siren,nic,siret,statutDiffusionEtablissement,dateCreationEtablissement,trancheEffectifsEtablissement,anneeEffectifsEtablissement,activitePrincipaleRegistreMetiersEtablissement,dateDernierTraitementEtablissement,etablissementSiege,nombrePeriodesEtablissement,complementAdresseEtablissement,numeroVoieEtablissement,indiceRepetitionEtablissement,typeVoieEtablissement,libelleVoieEtablissement,codePostalEtablissement,libelleCommuneEtablissement,libelleCommuneEtrangerEtablissement,distributionSpecialeEtablissement,codeCommuneEtablissement,codeCedexEtablissement,libelleCedexEtablissement,codePaysEtrangerEtablissement,libellePaysEtrangerEtablissement,complementAdresse2Etablissement,numeroVoie2Etablissement,indiceRepetition2Etablissement,typeVoie2Etablissement,libelleVoie2Etablissement,codePostal2Etablissement,libelleCommune2Etablissement,libelleCommuneEtranger2Etablissement,distributionSpeciale2Etablissement,codeCommune2Etablissement,codeCedex2Etablissement,libelleCedex2Etablissement,codePaysEtranger2Etablissement,libellePaysEtranger2Etablissement,dateDebut,etatAdministratifEtablissement,enseigne1Etablissement,enseigne2Etablissement,enseigne3Etablissement,denominationUsuelleEtablissement,activitePrincipaleEtablissement,nomenclatureActivitePrincipaleEtablissement,caractereEmployeurEtablissement,longitude,latitude,geo_score,geo_type,geo_adresse,geo_id,geo_ligne,geo_l4,geo_l5
214101412,00010,21410141200010,O,1983-03-01,03,2018,,2020-08-25T10:17:14,true,4,,8,,RTE,DE BLOIS,41160,MOISY,,,41141,,,,,,,,,,,,,,,,,,,2008-01-01,A,MAIRIE,,,,84.11Z,NAFRev2,O,1.314077,47.914113,0.81,housenumber,8 Route de Blois 41160 Moisy,41141_0002_00008,G,8 ROUTE DE BLOIS,
214101412,00028,21410141200028,O,1983-03-16,NN,,,2008-01-04T18:33:30,false,3,MAIRIE,8,,RTE,DE BLOIS,41160,MOISY,,,41141,,,,,,,,,,,,,,,,,,,2008-01-01,A,CANTINE SCOLAIRE,,,,56.29B,NAFRev2,N,1.314077,47.914113,0.81,housenumber,8 Route de Blois 41160 Moisy,41141_0002_00008,G,8 ROUTE DE BLOIS,
214101412,00036,21410141200036,O,1983-12-21,02,2018,,2020-08-25T10:17:14,false,4,,8,,RTE,DE BLOIS,41160,MOISY,,,41141,,,,,,,,,,,,,,,,,,,2010-07-20,A,ECOLE PRIMAIRE PUBLIQUE,,,,85.20Z,NAFRev2,N,1.314077,47.914113,0.81,housenumber,8 Route de Blois 41160 Moisy,41141_0002_00008,G,8 ROUTE DE BLOIS,
214101412,00044,21410141200044,O,1995-01-01,NN,,,2008-01-04T18:33:30,false,3,,8,,RTE,DE BLOIS,41160,MOISY,,,41141,,,,,,,,,,,,,,,,,,,2008-01-01,A,SERVICE ASSAINISSEMENT,,,,37.00Z,NAFRev2,N,1.314077,47.914113,0.81,housenumber,8 Route de Blois 41160 Moisy,41141_0002_00008,G,8 ROUTE DE BLOIS,
214101412,00051,21410141200051,O,1995-01-01,NN,,,2013-10-05T12:22:28,false,4,,8,,RTE,DE BLOIS,41160,MOISY,,,41141,,,,,,,,,,,,,,,,,,,2012-12-25,F,SERVICE DES ORDURES MENAGERES,,,,38.11Z,NAFRev2,N,1.314077,47.914113,0.81,housenumber,8 Route de Blois 41160 Moisy,41141_0002_00008,G,8 ROUTE DE BLOIS,
254101157,00017,25410115700017,O,1983-03-01,NN,,,2017-05-04T01:36:21,false,4,MAIRIE,8,,RTE,DE BLOIS,41160,MOISY,,,41141,,,,,,,,,,,,,,,,,,,2015-11-17,F,,,,,84.12Z,NAFRev2,O,1.314077,47.914113,0.81,housenumber,8 Route de Blois 41160 Moisy,41141_0002_00008,G,8 ROUTE DE BLOIS,
264102088,00012,26410208800012,O,1992-10-30,NN,,,2016-07-23T12:15:21,true,4,MAIRIE,8,,RTE,DE BLOIS,41160,MOISY,,,41141,,,,,,,,,,,,,,,,,,,2016-01-01,F,CCAS,,,,88.99B,NAFRev2,N,1.314077,47.914113,0.81,housenumber,8 Route de Blois 41160 Moisy,41141_0002_00008,G,8 ROUTE DE BLOIS,
294100516,00011,29410051600011,O,1983-09-27,NN,,,2018-09-29T12:08:56,true,3,MAIRIE,8,,RTE,DE BLOIS,41160,MOISY,,,41141,,,,,,,,,,,,,,,,,,,2008-01-01,A,,,,,42.99Z,NAFRev2,N,1.314077,47.914113,0.81,housenumber,8 Route de Blois 41160 Moisy,41141_0002_00008,G,8 ROUTE DE BLOIS,
312653892,00025,31265389200025,O,1984-11-01,NN,,,2014-07-08T00:16:42,true,4,,,,RTE,DE NOUZAY,41160,MOISY,,CIDEX 605,41141,,,,,,,,,,,,,,,,,,,2010-12-31,F,,,,,43.21A,NAFRev2,N,1.314704,47.917379,0.8,street,Route de Nouzay 41160 Moisy,41141_0023,G,ROUTE DE NOUZAY,
319241162,00035,31924116200035,O,1997-10-16,NN,,,2006-10-27T01:03:20,false,3,,2,,RUE,DE MOREE,41160,MOISY,,,41141,,,,,,,,,,,,,,,,,,,2004-11-15,F,,,,,01.1A,NAFRev1,N,1.284389,47.919714,0.93,housenumber,2 Rue de Morée 41160 Moisy,41141_0021_00002,G,2 RUE DE MOREE,
320326846,00013,32032684600013,O,,,,,,true,1,,,,LD,LE BOURG,41160,MOISY,,,41141,,,,,,,,,,,,,,,,,,,1985-12-25,F,,,,,67.08,NAP,N,1.313589,47.91368,0.93,street,Le Bourg 41160 Moisy,41141_uxuprn,G,LE BOURG,
320723984,00011,32072398400011,O,1981-01-01,NN,,,,true,4,,,,,LE FOYER,41160,MOISY,,,41141,,,,,,,,,,,,,,,,,,,1991-12-25,F,,,,,01.00,NAP,N,0.814773,48.949202,0.88,poi.community_centre,(Salle des fêtes) Le Fidelaire,https://osm.org/way/327052084,G,,
321321697,00013,32132169700013,O,,NN,,,,true,1,,,,,LE PLESSIS,41160,MOISY,,,41141,,,,,,,,,,,,,,,,,,,1994-09-30,F,,,,,01.1A,NAF1993,N,1.297374,47.92642,0.93,street,Le Plessis 41160 Moisy,41141_4ilbon,G,LE PLESSIS,
322444944,00019,32244494400019,O,1981-08-15,NN,,,2012-07-10T09:52:27,true,5,,,,RTE,DE THIREAU,41160,MOISY,,CIDEX 607,41141,,,,,,,,,,,,,,,,,,,2010-12-31,F,,,,,01.11Z,NAFRev2,N,1.314454,47.914689,0.75,street,Rue de Thireau 41160 Moisy,41141_0036,G,RUE DE THIREAU,
323389361,00011,32338936100011,O,1981-12-29,NN,,,2013-05-13T14:28:33,true,4,,,,LD,LE BOURG,41160,MOISY,,,41141,,,,,,,,,,,,,,,,,,,2012-06-15,F,,,,,68.20B,NAFRev2,N,1.313589,47.91368,0.93,street,Le Bourg 41160 Moisy,41141_uxuprn,G,LE BOURG,
324025105,00010,32402510500010,O,,NN,,,,true,1,,,,RUE,DE LA PINOTTERIE,41160,MOISY,,,41141,,,,,,,,,,,,,,,,,,,1990-03-09,F,,,,,55.60,NAP,N,1.314795,47.914794,0.48,street,Rue de la Mare 41160 Moisy,41141_0020,G,RUE DE LA MARE,
324043314,00024,32404331400024,O,1988-03-22,NN,,,2014-07-08T00:28:38,false,6,,6,,RUE,DU TENNIS,41160,MOISY,,,41141,,,,,,,,,,,,,,,,,,,2008-12-01,F,,,,,43.91A,NAFRev2,O,1.315419,47.914494,0.93,housenumber,6 Rue du Tennis 41160 Moisy,41141_0034_00006,G,6 RUE DU TENNIS,
324043314,00032,32404331400032,O,2008-12-01,NN,,4391AZ,2018-09-29T12:21:01,true,3,,2,B,RTE,DE THIREAU,41160,MOISY,,,41141,,,,,,,,,,,,,,,,,,,2016-06-30,F,,,,,43.91A,NAFRev2,N,1.314092,47.914996,0.65,housenumber,2 bis Rue de Thireau 41160 Moisy,41141_0036_00002_bis,G,2 BIS RUE DE THIREAU,
326977527,00018,32697752700018,O,1983-04-04,NN,,,2008-11-07T00:44:26,false,4,,,,,LE BOURG,41160,MOISY,,,41141,,,,,,,,,,,,,,,,,,,1994-12-25,F,,,,,45.2V,NAF1993,O,1.313589,47.91368,0.93,street,Le Bourg 41160 Moisy,41141_uxuprn,G,LE BOURG,
327527586,00017,32752758600017,O,1983-05-14,NN,,,2018-05-08T04:09:30,true,3,,,,,LE BOURG,41160,MOISY,,,41141,,,,,,,,,,,,,,,,,,,2008-01-01,A,,,,,01.11Z,NAFRev2,N,1.313589,47.91368,0.93,street,Le Bourg 41160 Moisy,41141_uxuprn,G,LE BOURG,
328632617,00010,32863261700010,O,1983-11-20,NN,,,2013-01-29T05:38:39,true,3,,,,LD,LE PRIEURE,41160,MOISY,,,41141,,,,,,,,,,,,,,,,,,,2008-01-01,A,,,,,68.20B,NAFRev2,N,5.4598475,43.5431171,0.9,poi.hotel,Hôtel** Le Prieuré Aix-en-Provence,https://osm.org/way/87187118,G,,
334779063,00067,33477906300067,O,2003-02-05,NN,,,2018-09-28T19:35:50,true,6,,12,,RTE,DE CHATEAUDUN,41160,MOISY,,,41141,,,,,,,,,,,,,,,,,,,2016-12-31,F,,,,,47.89Z,NAFRev2,N,1.315894,47.916587,0.85,housenumber,12 Route de Châteaudun 41160 Moisy,41141_0018_00012,G,12 ROUTE DE CHATEAUDUN,
334803806,00044,33480380600044,O,2006-09-01,,,,2009-11-23T20:20:29,true,3,,9,,RTE,DE CHATEAUDUN,41160,MOISY,,,41141,,,,,,,,,,,,,,,,,,,2009-11-02,F,,,,,68.20B,NAFRev2,N,1.315667,47.91647,0.84,housenumber,9 Route de Châteaudun 41160 Moisy,41141_0018_00009,G,9 ROUTE DE CHATEAUDUN,
338192784,00019,33819278400019,O,,NN,,,,true,1,,,,,,41160,MOISY,,,41141,,,,,,,,,,,,,,,,,,,1987-06-30,F,,,,,60.09,NAP,N,,,0,,,,,,
338321250,00015,33832125000015,O,1986-07-16,NN,,,2008-01-05T19:30:37,true,3,,,,,,41160,MOISY,,,41141,,,,,,,,,,,,,,,,,,,2008-01-01,A,,,,,68.20B,NAFRev2,N,,,0,,,,,,
339166563,00017,33916656300017,O,,,,,,true,1,,,,RTE,,41160,MOISY,,,41141,,,,,,,,,,,,,,,,,,,1990-01-19,F,,,,,67.08,NAP,N,3.1206907,45.7709538,0.88,poi.industrial,RTE (Zone industrielle) Clermont-Ferrand,https://osm.org/way/43852862,G,,
340652809,00013,34065280900013,O,1987-04-13,NN,,,,true,1,,,,RTE,,41160,MOISY,,,41141,,,,,,,,,,,,,,,,,,,1998-04-03,F,,,,,28.5A,NAF1993,O,3.1206907,45.7709538,0.88,poi.industrial,RTE (Zone industrielle) Clermont-Ferrand,https://osm.org/way/43852862,G,,
341985786,00027,34198578600027,O,2000-07-04,NN,,,2008-11-07T01:02:55,false,4,ORME GUIGNARD,1,,RUE,DE BEAUCE,41160,MOISY,,,41141,,,,,,,,,,,,,,,,,,,2002-12-13,F,TOP CUISINE 41,,,,45.4C,NAF1993,N,1.335443,47.908289,0.93,housenumber,1 Rue de Beauce 41160 Moisy,41141_0001_00001,G,1 RUE DE BEAUCE,
349497768,00011,34949776800011,O,1989-01-01,NN,,,2009-08-21T03:43:28,true,3,,,,,LE BOURG,41160,MOISY,,,41141,,,,,,,,,,,,,,,,,,,2007-08-31,F,,,,,01.1A,NAFRev1,N,1.313589,47.91368,0.93,street,Le Bourg 41160 Moisy,41141_uxuprn,G,LE BOURG,
350905667,00019,35090566700019,O,1989-04-22,NN,,,2006-10-27T23:43:24,false,3,,,,LD,LE MOULIN,41160,MOISY,,,41141,,,,,,,,,,,,,,,,,,,2006-06-14,F,,,,,01.1A,NAFRev1,N,1.315146,47.907986,0.91,street,Le Moulin Detruit 41160 Moisy,41141_b077,G,LE MOULIN DETRUIT,
350905667,00027,35090566700027,O,2006-06-14,,,,2012-12-07T09:27:41,true,3,,12,,RUE,DU STADE,41160,MOISY,,,41141,,,,,,,,,,,,,,,,,,,2012-10-31,F,,,,,01.11Z,NAFRev2,N,1.316291,47.914699,0.93,housenumber,12 Rue du Stade 41160 Moisy,41141_0032_00012,G,12 RUE DU STADE,
352951289,00011,35295128900011,O,1989-11-03,NN,,,2008-01-04T23:48:38,true,3,,,,LD,LA VALLEE DE LA HAYE MALTE,41160,MOISY,,,41141,,,,,,,,,,,,,,,,,,,2008-01-01,A,,,,,68.20A,NAFRev2,N,1.0824983,49.2530834,0.73,poi.bus_stop,La Vallée (Arrêt de bus) La Haye-Malherbe,https://osm.org/node/4511040913,G,,
353403348,00017,35340334800017,O,,NN,,,,true,1,,,,,NOUZAY,41160,MOISY,,,41141,,,,,,,,,,,,,,,,,,,1993-08-31,F,,,,,01.1A,NAF1993,N,1.314704,47.917379,0.91,street,Route de Nouzay 41160 Moisy,41141_0023,G,ROUTE DE NOUZAY,
353403678,00017,35340367800017,O,1990-01-01,NN,,,,true,1,,,,,,41160,MOISY,,,41141,,,,,,,,,,,,,,,,,,,1998-01-18,F,,,,,01.1A,NAF1993,N,,,0,,,,,,
356000240,05106,35600024005106,O,1991-01-01,NN,,,2007-05-19T10:41:44,false,3,,,,PL,EGLISE,41160,MOISY,,,41141,,,,,,,,,,,,,,,,,,,2006-01-01,F,BUREAU DE POSTE,,,,64.1A,NAFRev1,O,1.315813,47.914781,0.82,street,Place de l'Eglise 41160 Moisy,41141_0014,G,PLACE DE L EGLISE,
381977669,00013,38197766900013,O,1991-04-23,NN,,,2008-11-08T00:40:36,false,4,,,,,LE BOURG,41160,MOISY,,,41141,,,,,,,,,,,,,,,,,,,1997-12-31,F,LES TROIS GOURMANDS,,,,15.8C,NAF1993,O,1.313589,47.91368,0.93,street,Le Bourg 41160 Moisy,41141_uxuprn,G,LE BOURG,
381977669,00021,38197766900021,O,1996-10-01,NN,,,2014-07-08T01:06:29,true,4,,2,,RUE,DES THIBAUDIERES,41160,MOISY,,,41141,,,,,,,,,,,,,,,,,,,2010-06-12,F,,,,,10.71C,NAFRev2,N,1.314069,47.914247,0.93,housenumber,2 Rue des Thibaudières 41160 Moisy,41141_0035_00002,G,2 RUE DES THIBAUDIERES,
383051661,00015,38305166100015,O,1991-09-17,NN,,,2008-01-05T19:54:16,true,3,,,,,,41160,MOISY,,CIDEX 600,41141,,,,,,,,,,,,,,,,,,,2008-01-01,A,,,,,68.20B,NAFRev2,N,,,0,,,,,,
384377347,00032,38437734700032,O,2003-01-01,NN,,,2016-12-21T19:32:00,true,8,,12,,RTE,DE CHATEAUDUN,41160,MOISY,,,41141,,,,,,,,,,,,,,,,,,,2016-12-01,A,,,,,47.89Z,NAFRev2,N,1.315894,47.916587,0.85,housenumber,12 Route de Châteaudun 41160 Moisy,41141_0018_00012,G,12 ROUTE DE CHATEAUDUN,
385294830,00018,38529483000018,O,1991-04-25,NN,,,2020-05-07T08:36:41,true,4,,,,,LE FOYER,41160,MOISY,,,41141,,,,,,,,,,,,,,,,,,,2020-01-15,F,,,,,01.50Z,NAFRev2,N,0.814773,48.949202,0.88,poi.community_centre,(Salle des fêtes) Le Fidelaire,https://osm.org/way/327052084,G,,
387476690,00129,38747669000129,O,1992-07-01,NN,,,,false,3,,,,,LE BOURG,41160,MOISY,,,41141,,,,,,,,,,,,,,,,,,,1998-06-30,F,,,,,51.2A,NAF1993,N,1.313589,47.91368,0.93,street,Le Bourg 41160 Moisy,41141_uxuprn,G,LE BOURG,
388869976,00026,38886997600026,O,2001-04-20,NN,,,,true,1,,2,,RUE,DE LA GARE,41160,MOISY,,,41141,,,,,,,,,,,,,,,,,,,2002-03-31,F,,,,,52.5Z,NAF1993,N,1.316963,47.914376,0.93,housenumber,2 Rue de la Gare 41160 Moisy,41141_0016_00002,G,2 RUE DE LA GARE,
389401357,00014,38940135700014,O,,NN,,,,true,1,,,,,LA SERMONIERE,41160,MOISY,,,41141,,,,,,,,,,,,,,,,,,,1994-01-27,F,,,,,01.1A,NAF1993,N,1.296892,47.918722,0.85,street,Impasse de la Sermonniere 41160 Moisy,41141_0033,G,IMPASSE DE LA SERMONNIERE,
390801660,00015,39080166000015,O,,,,,,true,1,,,,LD,RICHEBOURG,41160,MOISY,,,41141,,,,,,,,,,,,,,,,,,,1995-05-31,F,,,,,01.3Z,NAF1993,N,1.324386,47.904188,0.93,street,Richebourg 41160 Moisy,41141_b32o1i,G,RICHEBOURG,
392523924,00018,39252392400018,O,1977-01-01,,,,,true,3,,,,,LE PRIEURE,41160,MOISY,,,41141,,,,,,,,,,,,,,,,,,,2002-03-29,F,,,,,01.1A,NAF1993,N,5.4598475,43.5431171,0.9,poi.hotel,Hôtel** Le Prieuré Aix-en-Provence,https://osm.org/way/87187118,G,,
397997982,00012,39799798200012,O,,NN,,,,true,1,,,,,LA SERMONIERE,41160,MOISY,,,41141,,,,,,,,,,,,,,,,,,,1995-05-30,F,,,,,01.3Z,NAF1993,N,1.296892,47.918722,0.85,street,Impasse de la Sermonniere 41160 Moisy,41141_0033,G,IMPASSE DE LA SERMONNIERE,
401248885,00014,40124888500014,O,1995-06-01,NN,,,,true,1,,,,,RICHEBOURG,41160,MOISY,,,41141,,,,,,,,,,,,,,,,,,,2002-06-30,F,,,,,01.1A,NAF1993,N,1.324386,47.904188,0.93,street,Richebourg 41160 Moisy,41141_b32o1i,G,RICHEBOURG,
401571344,00019,40157134400019,O,1995-01-01,NN,,,2008-01-04T19:49:28,true,3,MAIRIE,,,RTE,DE BLOIS,41160,MOISY,,,41141,,,,,,,,,,,,,,,,,,,2008-01-01,A,,,,,94.99Z,NAFRev2,N,1.314492,47.914378,0.79,street,Route de Blois 41160 Moisy,41141_0002,G,ROUTE DE BLOIS,
402183560,00018,40218356000018,O,1995-09-15,NN,,,,true,1,,1,,IMP,DE THIREAU,41160,MOISY,,,41141,,,,,,,,,,,,,,,,,,,2001-03-31,F,,,,,52.6G,NAF1993,N,1.284098,47.920161,0.82,housenumber,1 Impasse de Thireau 41160 Moisy,41141_0037_00001,G,1 IMPASSE DE THIREAU,
402647804,00010,40264780400010,O,1944-01-01,NN,,,,true,1,,13,,RUE,DE LA COLOMBE,41160,MOISY,,,41141,,,,,,,,,,,,,,,,,,,1998-12-31,F,,,,,01.1A,NAF1993,N,1.33959,47.907787,0.93,housenumber,13 Rue de la Colombe 41160 Moisy,41141_0007_00013,G,13 RUE DE LA COLOMBE,
403132285,00012,40313228500012,O,1995-12-04,NN,,,,true,1,,3,,PL,DE L EGLISE,41160,MOISY,,,41141,,,,,,,,,,,,,,,,,,,1999-09-12,F,,,,,55.3A,NAF1993,N,1.315691,47.914839,0.83,housenumber,3 Place de l'Eglise 41160 Moisy,41141_0014_00003,G,3 PLACE DE L EGLISE,
403836901,00013,40383690100013,O,1995-05-30,NN,,,2014-05-22T09:59:29,false,3,,,,,LA SERMONIERE,41160,MOISY,,,41141,,,,,,,,,,,,,,,,,,,2005-10-27,F,,,,,01.3Z,NAFRev1,N,1.296892,47.918722,0.85,street,Impasse de la Sermonniere 41160 Moisy,41141_0033,G,IMPASSE DE LA SERMONNIERE,
408202554,00023,40820255400023,O,2011-03-22,,,,2012-11-09T01:04:12,true,2,ORME GUIGNARD,3,,RUE,DE LA COLOMBE,41160,MOISY,,,41141,,,,,,,,,,,,,,,,,,,2011-12-31,F,,,,,43.12A,NAFRev2,N,1.332227,47.90875,0.93,housenumber,3 Rue de la Colombe 41160 Moisy,41141_0007_00003,G,3 RUE DE LA COLOMBE,
408550176,00015,40855017600015,O,1996-05-01,NN,,,2008-01-04T21:12:52,true,3,,,,,NOUZAY,41160,MOISY,,,41141,,,,,,,,,,,,,,,,,,,2008-01-01,A,,,,,01.11Z,NAFRev2,N,1.314704,47.917379,0.91,street,Route de Nouzay 41160 Moisy,41141_0023,G,ROUTE DE NOUZAY,
411882400,00012,41188240000012,O,1997-04-01,NN,,,2011-04-23T09:30:35,true,3,,,,,LE PRIEURE,41160,MOISY,,,41141,,,,,,,,,,,,,,,,,,,2008-01-01,A,,,,,01.11Z,NAFRev2,N,5.4598475,43.5431171,0.9,poi.hotel,Hôtel** Le Prieuré Aix-en-Provence,https://osm.org/way/87187118,G,,
413057597,00010,41305759700010,O,1997-05-01,11,2018,,2020-08-25T10:40:51,true,5,MOISY,2,,PL,DE L'EGLISE,41160,MOISY,,,41141,,,,,,,,,,,,,,,,,,,2012-12-31,A,,,,,01.30Z,NAFRev2,O,1.31605,47.915843,0.83,housenumber,2 Place de l'Eglise 41160 Moisy,41141_0014_00002,G,2 PLACE DE L EGLISE,
413057597,00028,41305759700028,O,1997-05-01,,,,2013-04-30T02:26:15,false,4,,,,,LE PRIEURE,41160,MOISY,,,41141,,,,,,,,,,,,,,,,,,,2012-03-18,F,,,,,01.61Z,NAFRev2,O,5.4598475,43.5431171,0.9,poi.hotel,Hôtel** Le Prieuré Aix-en-Provence,https://osm.org/way/87187118,G,,
418337168,00029,41833716800029,O,2004-02-01,NN,,,2006-11-25T15:57:30,false,3,,,,,RICHEBOURG,41160,MOISY,,,41141,,,,,,,,,,,,,,,,,,,2004-12-25,F,,,,,01.1A,NAFRev1,N,1.324386,47.904188,0.93,street,Richebourg 41160 Moisy,41141_b32o1i,G,RICHEBOURG,
418337168,00037,41833716800037,O,2019-09-01,,,,2019-10-15T07:50:01,true,1,,2,,RUE,DE MOREE,41160,MOISY,,,41141,,,,,,,,,,,,,,,,,,,2019-09-01,A,,,,,01.11Z,NAFRev2,O,1.284389,47.919714,0.93,housenumber,2 Rue de Morée 41160 Moisy,41141_0021_00002,G,2 RUE DE MOREE,
419612817,00025,41961281700025,O,2004-09-11,NN,,,2013-08-26T08:59:05,false,4,,10,B,RUE,DU STADE,41160,MOISY,,,41141,,,,,,,,,,,,,,,,,,,2013-07-20,F,,,,,68.20B,NAFRev2,N,1.31437,47.914257,0.77,housenumber,10 bis Rue du Stade 41160 Moisy,41141_0032_00010_bis,G,10 BIS RUE DU STADE,
419612817,00033,41961281700033,O,2013-07-20,,,,2021-02-23T11:40:30,true,1,,10,,RUE,DE LA GARE,41160,MOISY,,,41141,,,,,,,,,,,,,,,,,,,2013-07-20,A,,,,,68.20B,NAFRev2,N,1.317864,47.913498,0.93,housenumber,10 Rue de la Gare 41160 Moisy,41141_0016_00010,G,10 RUE DE LA GARE,
420184228,00013,42018422800013,O,1982-12-31,NN,,,2010-04-18T08:01:28,true,3,,2,,RUE,DU PATUREAU,41160,MOISY,,,41141,,,,,,,,,,,,,,,,,,,2007-12-31,F,,,,,01.2G,NAFRev1,N,1.319133,47.913948,0.93,housenumber,2 Rue du Patureau 41160 Moisy,41141_0025_00002,G,2 RUE DU PATUREAU,
420184236,00016,42018423600016,O,1991-01-01,NN,,,2012-02-13T09:49:30,true,4,CIDEX 602,5,,RTE,DE CHATEAUDUN,41160,MOISY,,,41141,,,,,,,,,,,,,,,,,,,2010-12-31,F,,,,,01.11Z,NAFRev2,N,1.315539,47.916232,0.84,housenumber,5 Route de Châteaudun 41160 Moisy,41141_0018_00005,G,5 ROUTE DE CHATEAUDUN,
420923310,00015,42092331000015,O,1982-12-31,NN,,,2008-03-31T11:10:37,true,4,,,,,NOUZAY,41160,MOISY,,,41141,,,,,,,,,,,,,,,,,,,2008-01-01,F,,,,,01.11Z,NAFRev2,N,1.314704,47.917379,0.91,street,Route de Nouzay 41160 Moisy,41141_0023,G,ROUTE DE NOUZAY,
421740622,00046,42174062200046,O,2018-11-02,,,8121ZZ,2019-09-17T03:47:15,false,2,,9,,RUE,DE LA MARE,41160,MOISY,,,41141,,,,,,,,,,,,,,,,,,,2019-09-12,F,,,,,81.21Z,NAFRev2,N,1.314887,47.915244,0.93,housenumber,9 Rue de la Mare 41160 Moisy,41141_0020_00009,G,9 RUE DE LA MARE,
422718171,00016,42271817100016,O,1975-12-22,NN,,,2008-01-05T00:27:01,true,3,MAIRIE,,,,,41160,MOISY,,,41141,,,,,,,,,,,,,,,,,,,2008-01-01,A,,,,,01.61Z,NAFRev2,N,,,0,,,,,,
425339595,00018,42533959500018,O,1986-01-01,NN,,,2015-04-09T04:03:53,true,4,,,,,MAIRIE DE MOISY,41160,MOISY,,,41141,,,,,,,,,,,,,,,,,,,2014-12-30,F,,,,,01.11Z,NAFRev2,N,1.314795,47.914794,0.63,street,Rue de la Mare 41160 Moisy,41141_0020,G,RUE DE LA MARE,
429188964,00010,42918896400010,O,2000-02-07,NN,,,2008-11-08T01:50:57,true,3,,10,,RTE,DE BLOIS,41160,MOISY,,,41141,,,,,,,,,,,,,,,,,,,2006-10-30,F,,,,,93.0D,NAFRev1,N,1.313785,47.91359,0.82,housenumber,10 Route de Blois 41160 Moisy,41141_0002_00010,G,10 ROUTE DE BLOIS,
429325053,00016,42932505300016,O,2000-01-05,03,2018,4332AA,2020-08-25T10:17:47,true,5,,17,,RTE,DE CHATEAUDUN,41160,MOISY,,,41141,,,,,,,,,,,,,,,,,,,2019-04-05,F,,,,,43.32A,NAFRev2,O,1.316407,47.917661,0.85,housenumber,17 Route de Châteaudun 41160 Moisy,41141_0018_00017,G,17 ROUTE DE CHATEAUDUN,
429875438,00013,42987543800013,O,2000-03-04,NN,,,2006-11-25T16:50:35,true,3,,3,,PL,DE L EGLISE,41160,MOISY,,,41141,,,,,,,,,,,,,,,,,,,2004-09-30,F,,,,,55.3A,NAFRev1,O,1.315691,47.914839,0.83,housenumber,3 Place de l'Eglise 41160 Moisy,41141_0014_00003,G,3 PLACE DE L EGLISE,
431765841,00025,43176584100025,O,1995-06-29,NN,,,2008-01-04T18:18:28,false,3,,,,,LE BOURG,41160,MOISY,,,41141,,,,,,,,,,,,,,,,,,,2008-01-01,A,,,,,64.19Z,NAFRev2,N,1.313589,47.91368,0.93,street,Le Bourg 41160 Moisy,41141_uxuprn,G,LE BOURG,
435149604,00017,43514960400017,O,2001-03-15,NN,,,2011-05-03T17:14:02,true,4,,1,,IMP,DU MOULIN,41160,MOISY,,,41141,,,,,,,,,,,,,,,,,,,2010-12-31,F,,,,,46.12B,NAFRev2,O,1.313126,47.910566,0.82,housenumber,1 Impasse du Moulin 41160 Moisy,41141_0022_00001,G,1 IMPASSE DU MOULIN,
441561248,00010,44156124800010,O,2002-04-02,NN,,,2008-01-04T21:22:21,true,3,MAIRIE,8,,RTE,DE BLOIS,41160,MOISY,,,41141,,,,,,,,,,,,,,,,,,,2008-01-01,A,,,,,94.99Z,NAFRev2,N,1.314077,47.914113,0.81,housenumber,8 Route de Blois 41160 Moisy,41141_0002_00008,G,8 ROUTE DE BLOIS,
443424007,00013,44342400700013,O,2002-08-08,NN,,,2016-01-12T10:56:08,true,3,,3,,PL,DE L'EGLISE,41160,MOISY,,,41141,,,,,,,,,,,,,,,,,,,2008-01-01,A,,,,,68.20B,NAFRev2,N,1.315691,47.914839,0.83,housenumber,3 Place de l'Eglise 41160 Moisy,41141_0014_00003,G,3 PLACE DE L EGLISE,
450134119,00012,45013411900012,O,1999-01-29,NN,,,2008-01-05T02:00:58,true,3,MAIRIE,8,,RTE,DE BLOIS,41160,MOISY,,,41141,,,,,,,,,,,,,,,,,,,2008-01-01,A,,,,,93.12Z,NAFRev2,N,1.314077,47.914113,0.81,housenumber,8 Route de Blois 41160 Moisy,41141_0002_00008,G,8 ROUTE DE BLOIS,
450575170,00029,45057517000029,O,2005-03-24,,,,2008-01-05T02:08:11,false,2,,,,,LES MARDEAUX,41160,MOISY,,,41141,,,,,,,,,,,,,,,,,,,2008-01-01,A,,,,,35.11Z,NAFRev2,N,,,0,,,,,,
450588330,00024,45058833000024,O,2005-03-31,,,,2008-01-05T02:08:24,false,2,LA GARENNE  PARCELLE CADA,,,LD,LES PENAGES,41160,MOISY,,,41141,,,,,,,,,,,,,,,,,,,2007-11-06,F,,,,,40.1A,NAFRev1,N,,,0,,,,,,
452815137,00016,45281513700016,O,2004-04-01,01,2018,,2020-08-25T10:18:37,true,4,,2,,RUE,DE MOREE,41160,MOISY,,,41141,,,,,,,,,,,,,,,,,,,2012-12-31,A,,,,,01.11Z,NAFRev2,O,1.284389,47.919714,0.93,housenumber,2 Rue de Morée 41160 Moisy,41141_0021_00002,G,2 RUE DE MOREE,
478373459,00013,47837345900013,O,2004-09-01,NN,,,2008-11-08T02:42:26,true,3,,9,B,PL,DE L EGLISE,41160,MOISY,,,41141,,,,,,,,,,,,,,,,,,,2005-12-31,F,,,,,92.7C,NAFRev1,N,-1.1676989,44.0766928,0.78,poi.park,Place de l'Église (Parc) Mézos,https://osm.org/way/37053988,G,,
479319113,00011,47931911300011,O,2004-10-04,NN,,,2009-06-27T11:38:26,true,3,,3,,PL,DE L EGLISE,41160,MOISY,,,41141,,,,,,,,,,,,,,,,,,,2007-04-13,F,,,,,55.3A,NAFRev1,O,1.315691,47.914839,0.83,housenumber,3 Place de l'Eglise 41160 Moisy,41141_0014_00003,G,3 PLACE DE L EGLISE,
479917924,00025,47991792400025,O,2006-03-15,,,,2008-01-05T04:12:39,false,2,,,,,LES PENAGES LA GARENNE,41160,MOISY,,,41141,,,,,,,,,,,,,,,,,,,2008-01-01,A,,,,,35.11Z,NAFRev2,N,1.316731,47.914716,0.34,street,Rue de la Gare 41160 Moisy,41141_0016,G,RUE DE LA GARE,
479917924,00058,47991792400058,O,2020-10-16,,,,2021-03-01T10:58:14,false,1,PARCELLE CADASTREE ZS N12,,,,LES PENAGES LA GARENNE,41160,MOISY,,,41141,,,,,,,,,,,,,,,,,,,2020-10-16,A,,,,,35.11Z,NAFRev2,N,1.316731,47.914716,0.34,street,Rue de la Gare 41160 Moisy,41141_0016,G,RUE DE LA GARE,
483488862,00010,48348886200010,O,2005-08-26,,,,2007-03-30T05:38:12,true,2,,1,,IMP,DE THIREAU,41160,MOISY,,,41141,,,,,,,,,,,,,,,,,,,2007-03-23,F,,,,,52.6D,NAFRev1,N,1.284098,47.920161,0.82,housenumber,1 Impasse de Thireau 41160 Moisy,41141_0037_00001,G,1 IMPASSE DE THIREAU,
485154710,00019,48515471000019,O,2005-10-28,00,2018,,2020-08-25T10:30:38,true,2,,3,,IMP,DE LA SERMONNIERE,41160,MOISY,,,41141,,,,,,,,,,,,,,,,,,,2008-01-01,A,,,,,01.11Z,NAFRev2,N,1.295634,47.916958,0.86,housenumber,3 Impasse de la Sermonniere 41160 Moisy,41141_0033_00003,G,3 IMPASSE DE LA SERMONNIERE,
488544917,00013,48854491700013,O,2006-02-20,,,,2012-05-23T09:30:47,false,2,ORME GUIGNARD,5,,RUE,DE BEAUCE,41160,MOISY,,,41141,,,,,,,,,,,,,,,,,,,2006-09-12,F,JESSICA COIFF'A DOMICILE,,,,93.0D,NAFRev1,N,1.335474,47.908591,0.93,housenumber,5 Rue de Beauce 41160 Moisy,41141_0001_00005,G,5 RUE DE BEAUCE,
489146076,00018,48914607600018,O,2006-04-01,02,2018,4391AZ,2020-08-25T10:33:41,true,2,,15,,RUE,DE LA MARE,41160,MOISY,,,41141,,,,,,,,,,,,,,,,,,,2008-01-01,A,,,,,43.91A,NAFRev2,O,1.315006,47.915615,0.93,housenumber,15 Rue de la Mare 41160 Moisy,41141_0020_00015,G,15 RUE DE LA MARE,
489268805,00012,48926880500012,O,2006-04-03,NN,,,2014-07-10T00:27:36,false,3,,9,,RUE,DE LA MARE,41160,MOISY,,,41141,,,,,,,,,,,,,,,,,,,2010-09-02,F,,,,,43.99B,NAFRev2,O,1.314887,47.915244,0.93,housenumber,9 Rue de la Mare 41160 Moisy,41141_0020_00009,G,9 RUE DE LA MARE,
492174677,00012,49217467700012,O,2006-07-12,,,,2008-01-05T04:14:56,true,2,,,,LD,LE PRIEURE,41160,MOISY,,,41141,,,,,,,,,,,,,,,,,,,2008-01-01,A,,,,,68.20B,NAFRev2,N,5.4598475,43.5431171,0.9,poi.hotel,Hôtel** Le Prieuré Aix-en-Provence,https://osm.org/way/87187118,G,,