siren,nic,siret,statutDiffusionEtablissement,dateCreationEtablissement,trancheEffectifsEtablissement,anneeEffectifsEtablissement,activitePrincipaleRegistreMetiersEtablissement,dateDernierTraitementEtablissement,etablissementSiege,nombrePeriodesEtablissement,complementAdresseEtablissement,numeroVoieEtablissement,indiceRepetitionEtablissement,typeVoieEtablissement,libelleVoieEtablissement,codePostalEtablissement,libelleCommuneEtablissement,libelleCommuneEtrangerEtablissement,distributionSpecialeEtablissement,codeCommuneEtablissement,codeCedexEtablissement,libelleCedexEtablissement,codePaysEtrangerEtablissement,libellePaysEtrangerEtablissement,complementAdresse2Etablissement,numeroVoie2Etablissement,indiceRepetition2Etablissement,typeVoie2Etablissement,libelleVoie2Etablissement,codePostal2Etablissement,libelleCommune2Etablissement,libelleCommuneEtranger2Etablissement,distributionSpeciale2Etablissement,codeCommune2Etablissement,codeCedex2Etablissement,libelleCedex2Etablissement,codePaysEtranger2Etablissement,libellePaysEtranger2Etablissement,dateDebut,etatAdministratifEtablissement,enseigne1Etablissement,enseigne2Etablissement,enseigne3Etablissement,denominationUsuelleEtablissement,activitePrincipaleEtablissement,nomenclatureActivitePrincipaleEtablissement,caractereEmployeurEtablissement,longitude,latitude,geo_score,geo_type,geo_adresse,geo_id,geo_ligne,geo_l4,geo_l5
215101460,00016,21510146000016,O,1983-03-01,02,2018,,2020-08-25T10:17:34,true,3,,,,,,51300,CLOYES-SUR-MARNE,,,51156,,,,,,,,,,,,,,,,,,,2008-01-01,A,MAIRIE,,,,84.11Z,NAFRev2,N,,,0,,,,,,
215101460,00024,21510146000024,O,1983-12-21,NN,,,2019-11-14T14:00:41,false,4,,,,,,51300,CLOYES-SUR-MARNE,,,51156,,,,,,,,,,,,,,,,,,,1997-12-31,F,ECOLE PRIMAIRE PUBLIQUE,,,,80.1Z,NAF1993,N,,,0,,,,,,
255101750,00016,25510175000016,O,1985-05-20,NN,,,2019-11-14T14:00:41,true,5,MAIRIE,,,,,51300,CLOYES-SUR-MARNE,,,51156,,,,,,,,,,,,,,,,,,,2014-08-12,F,,,,,84.12Z,NAFRev2,O,,,0,,,,,,
265101360,00013,26510136000013,O,1983-03-01,NN,,,2019-11-14T14:00:41,true,4,MAIRIE,,,,,51300,CLOYES-SUR-MARNE,,,51156,,,,,,,,,,,,,,,,,,,2016-12-31,F,CCAS,,,,88.99B,NAFRev2,N,,,0,,,,,,
295103493,00017,29510349300017,O,1983-08-10,NN,,,2019-11-14T14:00:41,true,4,MAIRIE,,,,,51300,CLOYES-SUR-MARNE,,,51156,,,,,,,,,,,,,,,,,,,2013-05-27,F,,,,,42.99Z,NAFRev2,N,,,0,,,,,,
313905556,00012,31390555600012,O,1978-01-01,NN,,,2019-11-14T14:00:41,false,5,,,,,,51300,CLOYES-SUR-MARNE,,,51156,,,,,,,,,,,,,,,,,,,2008-06-30,F,,,,,01.11Z,NAFRev2,N,,,0,,,,,,
313905556,00020,31390555600020,O,2008-06-30,NN,,,2021-02-23T10:40:21,true,1,,1,,,GRANDE RUE,51300,CLOYES-SUR-MARNE,,,51156,,,,,,,,,,,,,,,,,,,2008-06-30,A,,,,,01.11Z,NAFRev2,O,4.637539,48.663255,0.93,housenumber,1 Grande Rue 51300 Cloyes-sur-Marne,51156_0028_00001,G,1 GRANDE RUE,
319724969,00013,31972496900013,O,,NN,,,2019-11-14T14:00:41,true,1,,,,,GRANDE RUE,51300,CLOYES-SUR-MARNE,,,51156,,,,,,,,,,,,,,,,,,,,F,,,,,49.01,NAP,N,4.637539,48.663255,0.93,street,Grande Rue 51300 Cloyes-sur-Marne,51156_0028,G,GRANDE RUE,
328579800,00017,32857980000017,O,1983-11-29,NN,,,2019-11-14T14:00:41,true,3,,1,,,GRANDE RUE,51300,CLOYES-SUR-MARNE,,,51156,,,,,,,,,,,,,,,,,,,2008-01-01,A,,,,,68.20B,NAFRev2,N,4.637539,48.663255,0.93,housenumber,1 Grande Rue 51300 Cloyes-sur-Marne,51156_0028_00001,G,1 GRANDE RUE,
331082149,00013,33108214900013,O,1984-10-01,NN,,,2019-11-14T14:00:41,true,3,,,,,,51300,CLOYES-SUR-MARNE,,,51156,,,,,,,,,,,,,,,,,,,2008-01-01,A,,,,,01.11Z,NAFRev2,N,,,0,,,,,,
335880068,00077,33588006800077,O,2000-11-28,11,2018,,2020-08-25T10:37:20,false,4,CARRIERE,,,,,51300,CLOYES-SUR-MARNE,,,51156,,,,,,,,,,,,,,,,,,,2008-01-01,A,,,,,08.12Z,NAFRev2,O,4.636898,48.665166,0.3,street,Rue Pierre Gallet 51300 Cloyes-sur-Marne,51156_0095,D,RUE PIERRE GALLET,
339294050,00010,33929405000010,O,1986-06-15,NN,,,2019-11-14T14:00:41,true,4,,,,,,51300,CLOYES-SUR-MARNE,,,51156,,,,,,,,,,,,,,,,,,,2013-12-25,F,,,,,01.11Z,NAFRev2,N,,,0,,,,,,
341552271,00015,34155227100015,O,1987-01-01,NN,,,2019-11-14T14:00:41,false,4,,,,RTE,DE MATIGNICOURT,51300,CLOYES-SUR-MARNE,,,51156,,,,,,,,,,,,,,,,,,,2008-01-01,A,,,,,46.63Z,NAFRev2,N,4.7061021,48.6748921,0.77,poi.lock_gate,(Porte d'écluse) Matignicourt-Goncourt,https://osm.org/node/968825612,G,,
341631968,00029,34163196800029,O,1987-11-02,NN,,,2019-11-14T14:00:41,false,4,,,,RTE,DE MATIGNICOURT,51300,CLOYES-SUR-MARNE,,,51156,,,,,,,,,,,,,,,,,,,2002-11-26,F,,,,,14.2A,NAF1993,N,4.7061021,48.6748921,0.77,poi.lock_gate,(Porte d'écluse) Matignicourt-Goncourt,https://osm.org/node/968825612,G,,
381821024,00027,38182102400027,O,1998-02-28,NN,,,2019-11-14T14:00:41,false,3,,,,,,51300,CLOYES-SUR-MARNE,,,51156,,,,,,,,,,,,,,,,,,,2006-02-28,F,,,,,92.6C,NAFRev1,N,,,0,,,,,,
382280014,00012,38228001400012,O,1991-06-01,NN,,,2019-11-14T14:00:41,false,3,CHEZ MR BOUCTON EDMOND,,,,AU DOMICILE DE MR EDMOND,51300,CLOYES-SUR-MARNE,,,51156,,,,,,,,,,,,,,,,,,,2007-07-02,F,,,,,70.2A,NAFRev1,N,,,0,,,,,,
390232965,00017,39023296500017,O,1973-01-01,NN,,,2019-11-14T14:00:41,true,4,,7,,RUE,HAUTE,51300,CLOYES-SUR-MARNE,,,51156,,,,,,,,,,,,,,,,,,,2009-10-31,F,,,,,01.11Z,NAFRev2,N,4.639554,48.663307,0.93,housenumber,7 Rue Haute 51300 Cloyes-sur-Marne,51156_0034_00007,G,7 RUE HAUTE,
392807756,00037,39280775600037,O,1999-10-04,NN,,,2019-11-14T14:00:41,false,3,,14,,RUE,ST LAURENT,51300,CLOYES-SUR-MARNE,,,51156,,,,,,,,,,,,,,,,,,,2004-07-22,F,,,,,52.4H,NAFRev1,N,0.8134243,48.3185348,0.78,poi,Rue Saint-Laurent (Pont) Nogent-le-Rotrou,https://osm.org/way/438302803,G,,
392807756,00045,39280775600045,O,2009-04-15,,,,2019-11-14T14:00:41,true,2,,10,B,,GRANDE RUE,51300,CLOYES-SUR-MARNE,,,51156,,,,,,,,,,,,,,,,,,,2014-05-15,F,,,,,43.32A,NAFRev2,N,4.638304,48.662514,0.75,housenumber,10 bis Grande Rue 51300 Cloyes-sur-Marne,51156_0028_00010_bis,G,10 BIS GRANDE RUE,
400291290,00015,40029129000015,O,1940-01-01,NN,,,2019-11-14T14:00:41,true,3,,,,,,51300,CLOYES-SUR-MARNE,,,51156,,,,,,,,,,,,,,,,,,,2008-01-01,A,,,,,68.20B,NAFRev2,N,,,0,,,,,,
400560629,00018,40056062900018,O,1994-01-01,NN,,,2019-11-14T14:00:41,true,1,,10,,,GRANDE RUE,51300,CLOYES-SUR-MARNE,,,51156,,,,,,,,,,,,,,,,,,,2001-01-27,F,,,,,02.0B,NAF1993,N,4.638212,48.662639,0.93,housenumber,10 Grande Rue 51300 Cloyes-sur-Marne,51156_0028_00010,G,10 GRANDE RUE,
401228226,00015,40122822600015,O,1995-05-01,01,2018,,2020-08-25T10:33:39,true,3,,1,,,GRANDE RUE,51300,CLOYES-SUR-MARNE,,,51156,,,,,,,,,,,,,,,,,,,2008-01-01,A,,,,,01.61Z,NAFRev2,N,4.637539,48.663255,0.93,housenumber,1 Grande Rue 51300 Cloyes-sur-Marne,51156_0028_00001,G,1 GRANDE RUE,
403656796,00014,40365679600014,O,1995-12-26,NN,,,2019-11-15T14:59:54,true,3,,1,,,GRANDE RUE,51300,CLOYES-SUR-MARNE,,,51156,,,,,,,,,,,,,,,,,,,2008-01-01,A,,,,,02.40Z,NAFRev2,N,4.637539,48.663255,0.93,housenumber,1 Grande Rue 51300 Cloyes-sur-Marne,51156_0028_00001,G,1 GRANDE RUE,
403659337,00014,40365933700014,O,1995-12-26,NN,,,2019-11-14T14:00:41,true,3,,1,,,GRANDE RUE,51300,CLOYES-SUR-MARNE,,,51156,,,,,,,,,,,,,,,,,,,2008-01-01,A,,,,,68.20B,NAFRev2,N,4.637539,48.663255,0.93,housenumber,1 Grande Rue 51300 Cloyes-sur-Marne,51156_0028_00001,G,1 GRANDE RUE,
403660723,00012,40366072300012,O,1995-12-26,NN,,,2019-11-14T14:00:41,true,3,,1,,,GRANDE RUE,51300,CLOYES-SUR-MARNE,,,51156,,,,,,,,,,,,,,,,,,,2008-01-01,A,,,,,68.20B,NAFRev2,N,4.637539,48.663255,0.93,housenumber,1 Grande Rue 51300 Cloyes-sur-Marne,51156_0028_00001,G,1 GRANDE RUE,
403661127,00015,40366112700015,O,1995-12-26,NN,,,2019-11-14T14:00:41,true,3,MR ROYER J.LOUIS,1,,,GRANDE RUE,51300,CLOYES-SUR-MARNE,,,51156,,,,,,,,,,,,,,,,,,,2008-01-01,A,,,,,68.20B,NAFRev2,N,4.637539,48.663255,0.93,housenumber,1 Grande Rue 51300 Cloyes-sur-Marne,51156_0028_00001,G,1 GRANDE RUE,
409053451,00012,40905345100012,O,,NN,,,2019-11-14T14:00:41,true,1,,15,,RUE,HAUTE,51300,CLOYES-SUR-MARNE,,,51156,,,,,,,,,,,,,,,,,,,1996-12-06,F,,,,,93.0D,NAF1993,N,4.641201,48.664147,0.93,housenumber,15 Rue Haute 51300 Cloyes-sur-Marne,51156_0034_00015,G,15 RUE HAUTE,
415109073,00049,41510907300049,O,2019-06-28,,,,2021-02-23T11:37:35,true,1,,3,,RUE,DU PONT,51300,CLOYES-SUR-MARNE,,,51156,,,,,,,,,,,,,,,,,,,2019-06-28,A,,,,LIL-ARM-COMMUNICATION,46.42Z,NAFRev2,N,4.636429,48.663112,0.93,housenumber,3 Rue du Pont 51300 Cloyes-sur-Marne,51156_0105_00003,G,3 RUE DU PONT,
419592969,00010,41959296900010,O,1998-07-03,NN,,,2019-11-14T14:00:41,false,3,,9,,,GRANDE RUE,51300,CLOYES-SUR-MARNE,,,51156,,,,,,,,,,,,,,,,,,,2007-09-01,F,,,,,70.2B,NAFRev1,N,4.638543,48.662412,0.93,housenumber,9 Grande Rue 51300 Cloyes-sur-Marne,51156_0028_00009,G,9 GRANDE RUE,
420961328,00010,42096132800010,O,1998-03-28,NN,,,2019-11-14T14:00:41,true,3,,3,,,GRANDE RUE,51300,CLOYES-SUR-MARNE,,,51156,,,,,,,,,,,,,,,,,,,2008-01-01,A,,,,,02.10Z,NAFRev2,N,4.637888,48.663062,0.93,housenumber,3 Grande Rue 51300 Cloyes-sur-Marne,51156_0028_00003,G,3 GRANDE RUE,
422164962,00017,42216496200017,O,1999-03-05,NN,,,2021-07-08T19:35:52,true,3,,4,,RUE,SAINT LOUVENT,51300,CLOYES-SUR-MARNE,,,51156,,,,,,,,,,,,,,,,,,,2008-01-01,A,,,,,02.40Z,NAFRev2,N,4.636559,48.663947,0.93,housenumber,4 Rue Saint Louvent 51300 Cloyes-sur-Marne,51156_0120_00004,G,4 RUE SAINT LOUVENT,
428872386,00019,42887238600019,O,1984-01-01,NN,,,2019-11-14T14:00:41,true,3,,,,,,51300,CLOYES-SUR-MARNE,,,51156,,,,,,,,,,,,,,,,,,,2008-01-01,A,,,,,68.20B,NAFRev2,N,,,0,,,,,,
429457625,00029,42945762500029,O,2007-02-01,,,,2021-02-23T11:49:07,true,2,,6,,RUE,HAUTE,51300,CLOYES-SUR-MARNE,,,51156,,,,,,,,,,,,,,,,,,,2008-01-01,A,,,,,38.32Z,NAFRev2,N,4.639379,48.663115,0.93,housenumber,6 Rue Haute 51300 Cloyes-sur-Marne,51156_0034_00006,G,6 RUE HAUTE,
434479127,00038,43447912700038,O,2010-10-01,,,,2019-11-14T14:00:41,false,2,,26,,RUE,SAINT LOUVENT,51300,CLOYES-SUR-MARNE,,,51156,,,,,,,,,,,,,,,,,,,2011-05-24,F,,,,,56.10C,NAFRev2,N,4.63305,48.665748,0.93,housenumber,26 Rue Saint Louvent 51300 Cloyes-sur-Marne,51156_0120_00026,G,26 RUE SAINT LOUVENT,
439471467,00027,43947146700027,O,2008-04-01,,,,2019-11-14T14:00:41,true,2,,8,,RUE,ST LOUVENT,51300,CLOYES-SUR-MARNE,,,51156,,,,,,,,,,,,,,,,,,,2008-11-17,F,,,,,43.99C,NAFRev2,N,4.636226,48.664276,0.82,housenumber,8 Rue Saint Louvent 51300 Cloyes-sur-Marne,51156_0120_00008,G,8 RUE SAINT LOUVENT,
441473949,00010,44147394900010,O,2001-01-01,NN,,,2019-11-14T14:00:41,true,3,,14,,,GRANDE RUE,51300,CLOYES-SUR-MARNE,,,51156,,,,,,,,,,,,,,,,,,,2008-01-01,A,,,,,02.40Z,NAFRev2,N,4.638667,48.662138,0.93,housenumber,14 Grande Rue 51300 Cloyes-sur-Marne,51156_0028_00014,G,14 GRANDE RUE,
448063834,00015,44806383400015,O,1975-08-27,NN,,,2019-11-14T14:00:41,true,3,MAIRIE,,,,,51300,CLOYES-SUR-MARNE,,,51156,,,,,,,,,,,,,,,,,,,2008-01-01,A,,,,,94.99Z,NAFRev2,N,,,0,,,,,,
488290594,00016,48829059400016,O,2006-01-12,,,,2019-11-14T14:00:41,true,2,,18,,,GRANDE RUE,51300,CLOYES-SUR-MARNE,,,51156,,,,,,,,,,,,,,,,,,,2008-01-01,A,,,,,68.20B,NAFRev2,N,4.639978,48.66092,0.93,housenumber,18 Grande Rue 51300 Cloyes-sur-Marne,51156_0028_00018,G,18 GRANDE RUE,
499609220,00011,49960922000011,O,2007-08-20,,,,2019-11-14T14:00:41,true,3,,26,,RUE,SAINT LOUVENT,51300,CLOYES-SUR-MARNE,,,51156,,,,,,,,,,,,,,,,,,,2012-03-15,F,,,,,47.52A,NAFRev2,N,4.63305,48.665748,0.93,housenumber,26 Rue Saint Louvent 51300 Cloyes-sur-Marne,51156_0120_00026,G,26 RUE SAINT LOUVENT,
503382889,00015,50338288900015,O,2008-03-01,,,,2019-11-14T14:00:41,true,2,,8,,RUE,SAINT LOUVENT,51300,CLOYES-SUR-MARNE,,,51156,,,,,,,,,,,,,,,,,,,2008-12-15,F,,,,,68.20B,NAFRev2,N,4.636226,48.664276,0.93,housenumber,8 Rue Saint Louvent 51300 Cloyes-sur-Marne,51156_0120_00008,G,8 RUE SAINT LOUVENT,
508039831,00013,50803983100013,O,2008-03-01,,,,2019-11-14T14:00:41,true,1,LAC SEBASTIEN,,,RTE,DE MATIGNICOURT,51300,CLOYES-SUR-MARNE,,,51156,,,,,,,,,,,,,,,,,,,2008-03-01,A,,,,,93.29Z,NAFRev2,N,4.7061021,48.6748921,0.77,poi.lock_gate,(Porte d'écluse) Matignicourt-Goncourt,https://osm.org/node/968825612,G,,
520717216,00011,52071721600011,O,2010-03-02,,,,2019-11-14T14:00:41,true,2,,26,,RUE,SAINT LOUVENT,51300,CLOYES-SUR-MARNE,,,51156,,,,,,,,,,,,,,,,,,,2010-10-14,F,,,,,56.10C,NAFRev2,N,4.63305,48.665748,0.93,housenumber,26 Rue Saint Louvent 51300 Cloyes-sur-Marne,51156_0120_00026,G,26 RUE SAINT LOUVENT,
529067613,00016,52906761300016,O,2010-06-28,,,,2019-11-14T14:00:41,true,1,,26,,RUE,SAINT LOUVENT,51300,CLOYES-SUR-MARNE,,,51156,,,,,,,,,,,,,,,,,,,2010-06-28,A,,,,,94.99Z,NAFRev2,N,4.63305,48.665748,0.93,housenumber,26 Rue Saint Louvent 51300 Cloyes-sur-Marne,51156_0120_00026,G,26 RUE SAINT LOUVENT,
752070912,00015,75207091200015,O,2012-06-23,,,,2019-11-14T14:00:41,true,2,,13,,RUE,SAINT LOUVENT,51300,CLOYES-SUR-MARNE,,,51156,,,,,,,,,,,,,,,,,,,2013-07-10,F,,,,,47.81Z,NAFRev2,N,4.633254,48.665481,0.93,housenumber,13 Rue Saint Louvent 51300 Cloyes-sur-Marne,51156_0120_00013,G,13 RUE SAINT LOUVENT,
780375036,00016,78037503600016,O,,,,,2019-11-14T14:00:41,true,1,,,,,,51300,CLOYES-SUR-MARNE,,,51156,,,,,,,,,,,,,,,,,,,1984-12-25,F,,,,,67.04,NAP,N,,,0,,,,,,
794478974,00015,79447897400015,O,2013-07-01,,,,2019-11-14T14:00:41,false,1,,1,,RUE,HAUTE,51300,CLOYES-SUR-MARNE,,,51156,,,,,,,,,,,,,,,,,,,2013-07-01,A,,,,,68.20B,NAFRev2,N,4.638834,48.662939,0.93,housenumber,1 Rue Haute 51300 Cloyes-sur-Marne,51156_0034_00001,G,1 RUE HAUTE,
802538058,00016,80253805800016,O,2014-05-26,,,,2019-11-14T14:00:41,true,2,,2,,RUE,FORET,51300,CLOYES-SUR-MARNE,,,51156,,,,,,,,,,,,,,,,,,,2016-06-30,F,,,,,62.01Z,NAFRev2,N,4.63745,48.66246,0.93,housenumber,2 Rue Foret 51300 Cloyes-sur-Marne,51156_0023_00002,G,2 RUE FORET,
830927166,00017,83092716600017,O,2017-08-01,,,,2019-11-14T14:00:41,true,2,,14,,RUE,HAUTE,51300,CLOYES-SUR-MARNE,,,51156,,,,,,,,,,,,,,,,,,,2018-01-25,F,,,,,74.10Z,NAFRev2,N,4.640382,48.663635,0.93,housenumber,14 Rue Haute 51300 Cloyes-sur-Marne,51156_0034_00014,G,14 RUE HAUTE,
882909997,00018,88290999700018,O,2020-01-28,,,,2020-04-16T08:33:42,true,1,,25,,,GRANDE RUE,51300,CLOYES-SUR-MARNE,,,51156,,,,,,,,,,,,,,,,,,,2020-01-28,A,,,,,47.99A,NAFRev2,N,4.639985,48.661066,0.93,housenumber,25 Grande Rue 51300 Cloyes-sur-Marne,51156_0028_00025,G,25 GRANDE RUE,
