siren,nic,siret,statutDiffusionEtablissement,dateCreationEtablissement,trancheEffectifsEtablissement,anneeEffectifsEtablissement,activitePrincipaleRegistreMetiersEtablissement,dateDernierTraitementEtablissement,etablissementSiege,nombrePeriodesEtablissement,complementAdresseEtablissement,numeroVoieEtablissement,indiceRepetitionEtablissement,typeVoieEtablissement,libelleVoieEtablissement,codePostalEtablissement,libelleCommuneEtablissement,libelleCommuneEtrangerEtablissement,distributionSpecialeEtablissement,codeCommuneEtablissement,codeCedexEtablissement,libelleCedexEtablissement,codePaysEtrangerEtablissement,libellePaysEtrangerEtablissement,complementAdresse2Etablissement,numeroVoie2Etablissement,indiceRepetition2Etablissement,typeVoie2Etablissement,libelleVoie2Etablissement,codePostal2Etablissement,libelleCommune2Etablissement,libelleCommuneEtranger2Etablissement,distributionSpeciale2Etablissement,codeCommune2Etablissement,codeCedex2Etablissement,libelleCedex2Etablissement,codePaysEtranger2Etablissement,libellePaysEtranger2Etablissement,dateDebut,etatAdministratifEtablissement,enseigne1Etablissement,enseigne2Etablissement,enseigne3Etablissement,denominationUsuelleEtablissement,activitePrincipaleEtablissement,nomenclatureActivitePrincipaleEtablissement,caractereEmployeurEtablissement,longitude,latitude,geo_score,geo_type,geo_adresse,geo_id,geo_ligne,geo_l4,geo_l5
215102005,00018,21510200500018,O,1983-03-01,01,2018,,2020-08-25T10:17:35,true,3,,32,,,GRANDE RUE,51490,DONTRIEN,,,51216,,,,,,,,,,,,,,,,,,,2008-01-01,A,MAIRIE,,,,84.11Z,NAFRev2,N,4.412103,49.239627,0.93,housenumber,32 Grande Rue 51490 Dontrien,51216_0025_00032,G,32 GRANDE RUE,
215102005,00026,21510200500026,O,1983-12-21,02,2018,,2021-06-22T13:38:19,false,5,,32,,,GRANDE RUE,51490,DONTRIEN,,,51216,,,,,,,,,,,,,,,,,,,2021-04-02,F,ECOLE ELEMENTAIRE PUBLIQUE,,,,85.20Z,NAFRev2,N,4.412103,49.239627,0.93,housenumber,32 Grande Rue 51490 Dontrien,51216_0025_00032,G,32 GRANDE RUE,
215102005,00042,21510200500042,O,2021-04-02,,,,2021-06-22T13:38:19,false,1,POLE SCOLAIRE DES DEUX RIVES,13,,RUE,DU STADE,51490,DONTRIEN,,,51216,,,,,,,,,,,,,,,,,,,2021-04-02,A,ECOLE PRIMAIRE PUBLIQUE,,,,85.20Z,NAFRev2,N,4.41321,49.238782,0.78,street,Rue du Stade 51490 Dontrien,51216_0057,G,RUE DU STADE,
255100679,00018,25510067900018,O,1983-03-01,NN,,,,true,3,MAIRIE,32,,,GRANDE RUE,51490,DONTRIEN,,,51216,,,,,,,,,,,,,,,,,,,2003-11-17,F,,,,,75.1C,NAFRev1,N,4.412103,49.239627,0.93,housenumber,32 Grande Rue 51490 Dontrien,51216_0025_00032,G,32 GRANDE RUE,
265101832,00011,26510183200011,O,1983-03-01,NN,,,2016-11-20T14:05:42,true,4,MAIRIE,32,,,GRANDE RUE,51490,DONTRIEN,,,51216,,,,,,,,,,,,,,,,,,,2016-01-01,F,CCAS,,,,88.99B,NAFRev2,N,4.412103,49.239627,0.93,housenumber,32 Grande Rue 51490 Dontrien,51216_0025_00032,G,32 GRANDE RUE,
265106450,00017,26510645000017,O,1983-03-01,NN,,,2009-01-14T14:35:30,true,4,MAIRIE,32,,,GRANDE RUE,51490,DONTRIEN,,,51216,,,,,,,,,,,,,,,,,,,2008-01-01,F,CDE,,,,88.99B,NAFRev2,N,4.412103,49.239627,0.93,housenumber,32 Grande Rue 51490 Dontrien,51216_0025_00032,G,32 GRANDE RUE,
295100531,00017,29510053100017,O,1983-08-10,NN,,,2012-05-05T00:40:08,true,4,MAIRIE,32,,,GRANDE RUE,51490,DONTRIEN,,,51216,,,,,,,,,,,,,,,,,,,2010-02-15,A,,,,,42.99Z,NAFRev2,O,4.412103,49.239627,0.93,housenumber,32 Grande Rue 51490 Dontrien,51216_0025_00032,G,32 GRANDE RUE,
295105589,00010,29510558900010,O,1987-02-10,NN,,,2008-07-03T15:11:18,true,4,0121CIDEX,,,,,51490,DONTRIEN,,,51216,,,,,,,,,,,,,,,,,,,2008-01-01,F,,,,,42.99Z,NAFRev2,N,,,0,,,,,,
302700521,00016,30270052100016,O,1900-01-01,NN,,,2008-01-04T19:21:56,true,3,,,,,MAIRIE,51490,DONTRIEN,,,51216,,,,,,,,,,,,,,,,,,,2008-01-01,A,,,,,01.61Z,NAFRev2,N,3.0709671,50.6304695,0.92,poi.townhall,Hôtel de Ville Lille,https://osm.org/way/40917078,G,,
302715966,00156,30271596600156,O,1965-01-01,02,2018,,2020-08-25T10:22:23,false,1,,,,,GRANDE RUE,51490,DONTRIEN,,,51216,,,,,,,,,,,,,,,,,,,1965-01-01,A,,,,,46.21Z,NAFRev2,O,4.412132,49.2391,0.93,street,Grande Rue 51490 Dontrien,51216_0025,G,GRANDE RUE,
302867460,00016,30286746000016,O,,,,,,true,1,,,,,,51490,DONTRIEN,,,51216,,,,,,,,,,,,,,,,,,,1989-09-07,F,,,,,39.08,NAP,N,,,0,,,,,,
314140971,00016,31414097100016,O,1978-01-01,,,,,true,1,,,,,,51490,DONTRIEN,,,51216,,,,,,,,,,,,,,,,,,,1999-12-31,F,,,,,01.1A,NAF1993,N,,,0,,,,,,
321900482,00019,32190048200019,O,,NN,,,,true,1,,,,,,51490,DONTRIEN,,,51216,,,,,,,,,,,,,,,,,,,,F,,,,,64.49,NAP,N,,,0,,,,,,
323010520,00019,32301052000019,O,,NN,,,,true,1,,,,,,51490,DONTRIEN,,,51216,,,,,,,,,,,,,,,,,,,1988-07-15,F,,,,,01.1A,NAF1993,N,,,0,,,,,,
331884940,00015,33188494000015,O,1985-03-01,NN,,,2012-07-02T10:31:16,false,4,,,,,,51490,DONTRIEN,,,51216,,,,,,,,,,,,,,,,,,,2012-06-30,F,,,,,01.11Z,NAFRev2,N,,,0,,,,,,
335880274,00014,33588027400014,O,1900-01-01,NN,,,2008-01-04T21:10:16,true,3,,,,,,51490,DONTRIEN,,,51216,,,,,,,,,,,,,,,,,,,2008-01-01,A,,,,,68.20A,NAFRev2,N,,,0,,,,,,
336372370,00013,33637237000013,O,,NN,,,,true,1,,,,,,51490,DONTRIEN,,,51216,,,,,,,,,,,,,,,,,,,1990-12-31,F,,,,,38.40,NAP,N,,,0,,,,,,
336871579,00015,33687157900015,O,,,,,,true,1,,,,,,51490,DONTRIEN,,,51216,,,,,,,,,,,,,,,,,,,1984-12-25,F,,,,,67.08,NAP,N,,,0,,,,,,
336872692,00015,33687269200015,O,,,,,,true,1,,,,RUE,GRANDE,51490,DONTRIEN,,,51216,,,,,,,,,,,,,,,,,,,1993-06-30,F,,,,,50.1Z,NAF1993,N,4.412132,49.2391,0.81,street,Grande Rue 51490 Dontrien,51216_0025,G,GRANDE RUE,
337070353,00012,33707035300012,O,,,,,,true,1,,,,,,51490,DONTRIEN,,,51216,,,,,,,,,,,,,,,,,,,1984-12-25,F,,,,,64.49,NAP,N,,,0,,,,,,
337737522,00017,33773752200017,O,,NN,,,,true,1,,,,PL,DE LA GARE,51490,DONTRIEN,,,51216,,,,,,,,,,,,,,,,,,,1989-06-30,F,,,,,67.04,NAP,N,4.41106,49.243534,0.73,street,Allee de la Gare 51490 Dontrien,51216_0024,G,ALLEE DE LA GARE,
337892491,00016,33789249100016,O,1986-05-01,NN,,,2015-07-06T10:05:52,false,4,,45,,,GRANDE RUE,51490,DONTRIEN,,,51216,,,,,,,,,,,,,,,,,,,2015-03-01,F,,,,,01.11Z,NAFRev2,N,4.411017,49.237559,0.93,housenumber,45 Grande Rue 51490 Dontrien,51216_0025_00045,G,45 GRANDE RUE,
337892491,00024,33789249100024,O,2015-03-01,,,,2021-02-23T10:54:36,true,1,,25,,RUE,DU STADE,51490,DONTRIEN,,,51216,,,,,,,,,,,,,,,,,,,2015-03-01,A,,,,,01.11Z,NAFRev2,N,4.410931,49.236995,0.93,housenumber,25 Rue du Stade 51490 Dontrien,51216_0057_00025,G,25 RUE DU STADE,
342372562,00013,34237256200013,O,1987-07-31,NN,,,,true,4,,,,,,51490,DONTRIEN,,,51216,,,,,,,,,,,,,,,,,,,1994-12-25,F,,,,,01.1A,NAF1993,N,,,0,,,,,,
343602694,00014,34360269400014,O,1988-01-01,NN,,,2011-09-05T13:34:18,true,4,,,,,,51490,DONTRIEN,,,51216,,,,,,,,,,,,,,,,,,,2011-12-31,F,,,,,01.11Z,NAFRev2,N,,,0,,,,,,
344312814,00017,34431281400017,O,1988-03-19,NN,,,2011-04-10T05:44:52,true,5,,5,,,GRANDE RUE PRINCIPALE,51490,DONTRIEN,,,51216,,,,,,,,,,,,,,,,,,,2008-01-01,F,,,,,47.89Z,NAFRev2,N,7.2674939,43.6977499,0.74,poi.pharmacy,La Grande Pharmacie Principale Nice,https://osm.org/node/2512898292,G,,
349673012,00010,34967301200010,O,1989-01-01,NN,,,2007-01-18T09:26:58,true,3,,,,,,51490,DONTRIEN,,,51216,,,,,,,,,,,,,,,,,,,1996-12-25,F,,,,,01.1A,NAF1993,N,,,0,,,,,,
353138969,00012,35313896900012,O,1990-01-01,NN,,,,true,4,,,,,,51490,DONTRIEN,,,51216,,,,,,,,,,,,,,,,,,,1997-12-31,F,,,,,70.2B,NAF1993,N,,,0,,,,,,
389362633,00015,38936263300015,O,1981-08-01,NN,,,2019-04-09T09:27:26,true,4,,,,,,51490,DONTRIEN,,,51216,,,,,,,,,,,,,,,,,,,2019-05-15,A,,,,,01.46Z,NAFRev2,N,,,0,,,,,,
390567659,00011,39056765900011,O,1993-02-01,NN,,,2008-01-04T23:41:46,true,3,,,,,,51490,DONTRIEN,,,51216,,,,,,,,,,,,,,,,,,,2008-01-01,A,,,,,68.20B,NAFRev2,N,,,0,,,,,,
392158101,00015,39215810100015,O,1993-07-01,,,,,true,1,,,,,,51490,DONTRIEN,,,51216,,,,,,,,,,,,,,,,,,,1999-12-31,F,,,,,29.3C,NAF1993,N,,,0,,,,,,
399006873,00018,39900687300018,O,1994-11-10,NN,,,2008-01-04T19:01:08,true,3,,14,,,GRANDE RUE,51490,DONTRIEN,,,51216,,,,,,,,,,,,,,,,,,,2008-01-01,A,,,,,47.99A,NAFRev2,N,4.411361,49.241963,0.93,housenumber,14 Grande Rue 51490 Dontrien,51216_0025_00014,G,14 GRANDE RUE,
399986975,00015,39998697500015,O,1995-01-01,NN,,,2008-01-04T19:20:12,true,3,,,,,,51490,DONTRIEN,,,51216,,,,,,,,,,,,,,,,,,,2008-01-01,A,,,,,01.11Z,NAFRev2,N,,,0,,,,,,
403581440,00019,40358144000019,O,1996-01-01,NN,,,2006-10-28T03:15:53,true,3,,15,,,GRANDE RUE,51490,DONTRIEN,,,51216,,,,,,,,,,,,,,,,,,,2005-09-13,F,,,,,01.1A,NAFRev1,N,4.41159,49.241779,0.93,housenumber,15 Grande Rue 51490 Dontrien,51216_0025_00015,G,15 GRANDE RUE,
404535262,00012,40453526200012,O,1996-03-01,NN,,,2012-04-19T04:58:49,true,4,,,,,,51490,DONTRIEN,,,51216,,,,,,,,,,,,,,,,,,,2012-02-29,F,,,,,01.11Z,NAFRev2,N,,,0,,,,,,
410235287,00019,41023528700019,O,1974-01-01,NN,,,2008-01-04T21:39:46,true,3,,,,,,51490,DONTRIEN,,,51216,,,,,,,,,,,,,,,,,,,2008-01-01,A,,,,,68.20B,NAFRev2,N,,,0,,,,,,
410239198,00014,41023919800014,O,1983-01-01,NN,,,2016-02-03T12:53:26,true,8,,1,,RUE,DU STADE,51490,DONTRIEN,,,51216,,,,,,,,,,,,,,,,,,,2016-02-29,F,,,,,70.22Z,NAFRev2,N,4.41321,49.238782,0.93,housenumber,1 Rue du Stade 51490 Dontrien,51216_0057_00001,G,1 RUE DU STADE,
411643919,00011,41164391900011,O,1997-04-01,NN,,,2019-03-14T19:33:00,true,3,MR ET MME LUC LALLEMENT,29,,,GRANDE RUE,51490,DONTRIEN,,,51216,,,,,,,,,,,,,,,,,,,2008-01-01,A,,,,,01.11Z,NAFRev2,N,4.412259,49.239858,0.93,housenumber,29 Grande Rue 51490 Dontrien,51216_0025_00029,G,29 GRANDE RUE,
422962795,00015,42296279500015,O,1999-05-01,NN,,,2006-10-31T00:00:32,false,3,,17,,,GRANDE RUE,51490,DONTRIEN,,,51216,,,,,,,,,,,,,,,,,,,2005-04-01,F,,,,,01.1A,NAFRev1,N,4.411761,49.241472,0.93,housenumber,17 Grande Rue 51490 Dontrien,51216_0025_00017,G,17 GRANDE RUE,
422962795,00023,42296279500023,O,2005-04-01,01,2018,,2020-08-25T10:13:54,true,2,,1,,RUE,DE LA PLAINE,51490,DONTRIEN,,,51216,,,,,,,,,,,,,,,,,,,2008-01-01,A,,,,,01.11Z,NAFRev2,N,4.412852,49.240673,0.93,housenumber,1 Rue de la Plaine 51490 Dontrien,51216_0047_00001,G,1 RUE DE LA PLAINE,
429078165,00017,42907816500017,O,2000-01-01,NN,,,2008-01-05T01:34:51,true,3,,14,,RUE,DU TELLIER,51490,DONTRIEN,,,51216,,,,,,,,,,,,,,,,,,,2008-01-01,A,,,,,01.11Z,NAFRev2,N,4.409632,49.239813,0.93,housenumber,14 Rue du Tellier 51490 Dontrien,51216_0060_00014,G,14 RUE DU TELLIER,
431164169,00010,43116416900010,O,1997-12-01,NN,,,,true,3,,,,,LE VILLAGE,51490,DONTRIEN,,,51216,,,,,,,,,,,,,,,,,,,2002-11-30,F,,,,,70.2B,NAF1993,N,2.2950702,48.9311749,0.9,poi.bar,bar le village Gennevilliers,https://osm.org/node/3287755128,G,,
431721349,00014,43172134900014,O,2000-04-01,NN,,,2018-04-21T04:04:56,true,3,,1,,RUE,DE LA PLAINE,51490,DONTRIEN,,,51216,,,,,,,,,,,,,,,,,,,2008-01-01,A,,,,,01.11Z,NAFRev2,N,4.412852,49.240673,0.93,housenumber,1 Rue de la Plaine 51490 Dontrien,51216_0047_00001,G,1 RUE DE LA PLAINE,
432522456,00016,43252245600016,O,2000-07-01,NN,,,2019-06-24T13:13:04,true,5,,1,,RUE,DE LA PLAINE,51490,DONTRIEN,,,51216,,,,,,,,,,,,,,,,,,,2012-12-31,A,,,,,46.21Z,NAFRev2,O,4.412852,49.240673,0.93,housenumber,1 Rue de la Plaine 51490 Dontrien,51216_0047_00001,G,1 RUE DE LA PLAINE,
441070844,00010,44107084400010,O,2001-12-15,01,2018,,2020-08-25T10:28:17,true,5,CHEZ M. ET MME PHILIPPOT,3,,RUE,DE L'EGLISE,51490,DONTRIEN,,,51216,,,,,,,,,,,,,,,,,,,2010-12-31,A,,,,,01.61Z,NAFRev2,O,4.413511,49.239401,0.93,housenumber,3 Rue de l'Eglise 51490 Dontrien,51216_0015_00003,G,3 RUE DE L EGLISE,
443035001,00017,44303500100017,O,2002-08-12,NN,,,2008-11-08T02:17:22,true,3,,14,,RUE,DU TELLIER,51490,DONTRIEN,,,51216,,,,,,,,,,,,,,,,,,,2004-08-31,F,,,,,36.1K,NAFRev1,N,4.409632,49.239813,0.93,housenumber,14 Rue du Tellier 51490 Dontrien,51216_0060_00014,G,14 RUE DU TELLIER,
449171099,00012,44917109900012,O,2003-06-02,NN,,,2012-04-17T05:47:04,true,6,,11,,RUE,DU STADE,51490,DONTRIEN,,,51216,,,,,,,,,,,,,,,,,,,2012-01-01,F,,,,,70.22Z,NAFRev2,N,4.413298,49.237222,0.93,housenumber,11 Rue du Stade 51490 Dontrien,51216_0057_00011,G,11 RUE DU STADE,
477646657,00015,47764665700015,O,2004-06-18,NN,,,2018-05-24T08:43:02,true,3,,6,,RUE,DE LA PLAINE,51490,DONTRIEN,,,51216,,,,,,,,,,,,,,,,,,,2008-01-01,A,,,,,68.20B,NAFRev2,N,4.413744,49.240776,0.93,housenumber,6 Rue de la Plaine 51490 Dontrien,51216_0047_00006,G,6 RUE DE LA PLAINE,
477807556,00022,47780755600022,O,2006-10-16,,,1089ZZ,2021-07-08T09:04:09,true,5,,5,,RUE,DES TELLIERS,51490,DONTRIEN,,,51216,,,,,,,,,,,,,,,,,,,2020-12-31,F,,,,LOLOPIZZA,56.10C,NAFRev2,N,4.5840224,49.5270236,0.9,poi,Rue des Telliers (Pont) Écordal,https://osm.org/way/223677306,G,,
477887194,00025,47788719400025,O,2015-01-01,,,,2015-02-16T08:55:30,true,1,,,,,,51490,DONTRIEN,,,51216,,,,,,,,,,,,,,,,,,,2015-01-01,A,SOS ABEILLES,,,,01.49Z,NAFRev2,N,,,0,,,,,,
485071021,00011,48507102100011,O,2005-09-14,,,,2014-05-06T16:28:23,true,2,,15,,,GRANDE RUE,51490,DONTRIEN,,,51216,,,,,,,,,,,,,,,,,,,2008-01-01,A,,,,,01.11Z,NAFRev2,N,4.41159,49.241779,0.93,housenumber,15 Grande Rue 51490 Dontrien,51216_0025_00015,G,15 GRANDE RUE,
489766436,00013,48976643600013,O,2006-04-01,NN,,,2015-05-14T07:56:02,true,2,,5,,RUE,DE L'ECOLE,51490,DONTRIEN,,,51216,,,,,,,,,,,,,,,,,,,2008-01-01,A,,,,,01.11Z,NAFRev2,N,4.411107,49.239452,0.93,housenumber,5 Rue de l'Ecole 51490 Dontrien,51216_0013_00005,G,5 RUE DE L ECOLE,
492792221,00011,49279222100011,O,2006-10-01,,,,2014-06-06T04:16:07,true,3,,11,,RUE,DU STADE,51490,DONTRIEN,,,51216,,,,,,,,,,,,,,,,,,,2014-03-03,F,,,,,70.22Z,NAFRev2,N,4.413298,49.237222,0.93,housenumber,11 Rue du Stade 51490 Dontrien,51216_0057_00011,G,11 RUE DU STADE,
498235902,00018,49823590200018,O,2007-04-02,,,,2014-06-06T04:19:54,true,3,,11,,RUE,DU STADE,51490,DONTRIEN,,,51216,,,,,,,,,,,,,,,,,,,2014-03-03,F,,,,,68.10Z,NAFRev2,N,4.413298,49.237222,0.93,housenumber,11 Rue du Stade 51490 Dontrien,51216_0057_00011,G,11 RUE DU STADE,
504217969,00014,50421796900014,O,2008-04-01,,,,2021-06-22T03:34:35,true,2,,11,,RUE,DU STADE,51490,DONTRIEN,,,51216,,,,,,,,,,,,,,,,,,,2021-06-21,F,,,,,68.20B,NAFRev2,N,4.413298,49.237222,0.93,housenumber,11 Rue du Stade 51490 Dontrien,51216_0057_00011,G,11 RUE DU STADE,
515351633,00018,51535163300018,O,2009-10-08,,,,2015-11-18T03:14:57,true,2,,12,,RUE,DU STADE,51490,DONTRIEN,,,51216,,,,,,,,,,,,,,,,,,,2015-10-01,F,,,,,96.02A,NAFRev2,N,4.412701,49.237197,0.93,housenumber,12 Rue du Stade 51490 Dontrien,51216_0057_00012,G,12 RUE DU STADE,
518255807,00019,51825580700019,O,2009-12-01,,,,2020-05-02T08:22:40,false,1,,8,,RUE,DU TELLIER,51490,DONTRIEN,,,51216,,,,,,,,,,,,,,,,,,,2009-12-01,A,,,,,47.99B,NAFRev2,N,4.410783,49.240055,0.93,housenumber,8 Rue du Tellier 51490 Dontrien,51216_0060_00008,G,8 RUE DU TELLIER,
519264741,00017,51926474100017,O,2010-01-06,,,4321AB,2020-02-14T19:37:14,true,1,,23,,,GRANDE RUE,51490,DONTRIEN,,,51216,,,,,,,,,,,,,,,,,,,2010-01-06,A,,,,,43.21A,NAFRev2,N,4.412169,49.240741,0.93,housenumber,23 Grande Rue 51490 Dontrien,51216_0025_00023,G,23 GRANDE RUE,
522103860,00022,52210386000022,O,2012-08-01,,,,2013-02-01T08:34:23,true,2,,15,,,GRANDE RUE,51490,DONTRIEN,,,51216,,,,,,,,,,,,,,,,,,,2013-01-21,F,,,,,43.39Z,NAFRev2,N,4.41159,49.241779,0.93,housenumber,15 Grande Rue 51490 Dontrien,51216_0025_00015,G,15 GRANDE RUE,
528842115,00016,52884211500016,O,2010-11-24,,,,2010-12-08T08:44:27,true,1,,23,,GR,RUE,51490,DONTRIEN,,,51216,,,,,,,,,,,,,,,,,,,2010-11-24,A,,,,,68.20B,NAFRev2,N,4.412169,49.240741,0.74,housenumber,23 Grande Rue 51490 Dontrien,51216_0025_00023,G,23 GRANDE RUE,
529549818,00019,52954981800019,O,2011-02-01,,,,2013-08-06T08:21:35,false,3,,8,,RUE,DU TELLIER,51490,DONTRIEN,,,51216,,,,,,,,,,,,,,,,,,,2013-07-01,F,,,,LEGUMES DE SAISON,47.21Z,NAFRev2,N,4.410783,49.240055,0.93,housenumber,8 Rue du Tellier 51490 Dontrien,51216_0060_00008,G,8 RUE DU TELLIER,
529549818,00027,52954981800027,O,2012-02-22,,,,2021-02-23T15:47:12,true,4,,8,,RUE,DU TELLIER,51490,DONTRIEN,,,51216,,,,,,,,,,,,,,,,,,,2020-01-07,A,LEGUMES DE SAISON,,,,01.13Z,NAFRev2,N,4.410783,49.240055,0.93,housenumber,8 Rue du Tellier 51490 Dontrien,51216_0060_00008,G,8 RUE DU TELLIER,
530798537,00011,53079853700011,O,2011-04-01,,,4339ZZ,2016-02-04T05:11:07,true,2,,4,,RUE,DES CHAMPS,51490,DONTRIEN,,,51216,,,,,,,,,,,,,,,,,,,2016-01-31,F,,,,,43.39Z,NAFRev2,N,4.414441,49.238547,0.93,housenumber,4 Rue des Champs 51490 Dontrien,51216_0010_00004,G,4 RUE DES CHAMPS,
534435896,00012,53443589600012,O,2011-09-01,,,,2011-09-05T13:15:37,true,1,,11,,RUE,DE L'ECOLE,51490,DONTRIEN,,,51216,,,,,,,,,,,,,,,,,,,2011-09-01,A,,,,,01.11Z,NAFRev2,N,4.410307,49.239324,0.93,housenumber,11 Rue de l'Ecole 51490 Dontrien,51216_0013_00011,G,11 RUE DE L ECOLE,
534667878,00019,53466787800019,O,2011-09-15,,,4932ZA,2015-11-19T04:02:23,false,3,,12,,RUE,DU STADE,51490,DONTRIEN,,,51216,,,,,,,,,,,,,,,,,,,2015-10-31,F,,,,,49.32Z,NAFRev2,N,4.412701,49.237197,0.93,housenumber,12 Rue du Stade 51490 Dontrien,51216_0057_00012,G,12 RUE DU STADE,
749949368,00015,74994936800015,O,2012-03-01,NN,,,2017-05-04T08:24:12,true,1,,41,,,GRANDE RUE,51490,DONTRIEN,,,51216,,,,,,,,,,,,,,,,,,,2012-03-01,A,,,,,01.11Z,NAFRev2,N,4.410894,49.238132,0.93,housenumber,41 Grande Rue 51490 Dontrien,51216_0025_00041,G,41 GRANDE RUE,
753166990,00014,75316699000014,O,2012-09-01,,,4332AA,2018-01-21T18:07:35,true,2,,7,,RUE,DU STAGE,51490,DONTRIEN,,,51216,,,,,,,,,,,,,,,,,,,2018-01-21,A,,,,,43.32A,NAFRev2,O,4.413565,49.237619,0.75,housenumber,7 Rue du Stade 51490 Dontrien,51216_0057_00007,G,7 RUE DU STADE,
780371886,00026,78037188600026,O,1988-09-23,NN,,,2012-07-28T18:38:43,true,4,,,,,,51490,DONTRIEN,,,51216,,,,,,,,,,,,,,,,,,,2010-12-25,F,,,,,01.11Z,NAFRev2,N,,,0,,,,,,
780380846,00011,78038084600011,O,,NN,,,,true,1,,,,,,51490,DONTRIEN,,,51216,,,,,,,,,,,,,,,,,,,1987-09-30,F,,,,,22.02,NAP,N,,,0,,,,,,
780380853,00017,78038085300017,O,1972-01-01,NN,,,2012-05-05T16:55:05,true,5,,7,,RUE,STADE,51490,DONTRIEN,,,51216,,,,,,,,,,,,,,,,,,,2010-12-31,F,,,,,43.32A,NAFRev2,N,4.413565,49.237619,0.85,housenumber,7 Rue du Stade 51490 Dontrien,51216_0057_00007,G,7 RUE DU STADE,
780380861,00010,78038086100010,O,,,,,,true,1,,,,,,51490,DONTRIEN,,,51216,,,,,,,,,,,,,,,,,,,1986-07-01,F,,,,,73.08,NAP,N,,,0,,,,,,
780380887,00015,78038088700015,O,,NN,,,,true,1,,,,,,51490,DONTRIEN,,,51216,,,,,,,,,,,,,,,,,,,,F,,,,,60.07,NAP,N,,,0,,,,,,
780380929,00015,78038092900015,O,1900-01-01,NN,,,2008-01-05T03:13:17,true,3,MR ALLART REGIS,,,,,51490,DONTRIEN,,,51216,,,,,,,,,,,,,,,,,,,2008-01-01,A,,,,,94.99Z,NAFRev2,N,,,0,,,,,,
790475917,00015,79047591700015,O,2013-01-09,,,9602BB,2016-02-16T14:39:16,true,2,,3,,RUE,DES CHAMPS,51490,DONTRIEN,,,51216,,,,,,,,,,,,,,,,,,,2015-07-01,F,,,,,96.02B,NAFRev2,N,4.413999,49.238568,0.93,housenumber,3 Rue des Champs 51490 Dontrien,51216_0010_00003,G,3 RUE DES CHAMPS,
791996242,00016,79199624200016,O,2013-04-01,,,,2016-01-28T08:20:17,true,2,,35,,RUE,GRANDE,51490,DONTRIEN,,,51216,,,,,,,,,,,,,,,,,,,2016-01-14,F,,,,,25.99B,NAFRev2,N,4.411534,49.238802,0.77,housenumber,35 Grande Rue 51490 Dontrien,51216_0025_00035,G,35 GRANDE RUE,
792628562,00011,79262856200011,O,2013-04-22,,,,2014-12-02T09:23:51,true,4,,11,,RUE,DE L'ECOLE,51490,DONTRIEN,,,51216,,,,,,,,,,,,,,,,,,,2014-09-01,F,,,,,47.99A,NAFRev2,N,4.410307,49.239324,0.93,housenumber,11 Rue de l'Ecole 51490 Dontrien,51216_0013_00011,G,11 RUE DE L ECOLE,
794280669,00019,79428066900019,O,2013-07-08,,,,2013-07-17T07:45:53,true,1,,2,,AV,DE LA GARE,51490,DONTRIEN,,,51216,,,,,,,,,,,,,,,,,,,2013-07-08,A,,,,,68.20B,NAFRev2,N,4.411104,49.244535,0.82,housenumber,2 Avenue de la Gare 51490 Dontrien,51216_0022_00002,G,2 AVENUE DE LA GARE,
801845397,00018,80184539700018,O,2001-02-23,,,,2014-04-22T14:10:35,true,1,,14,,RUE,DU TELLIER,51490,DONTRIEN,,,51216,,,,,,,,,,,,,,,,,,,2001-02-23,A,,,,,94.99Z,NAFRev2,N,4.409632,49.239813,0.93,housenumber,14 Rue du Tellier 51490 Dontrien,51216_0060_00014,G,14 RUE DU TELLIER,
809462773,00015,80946277300015,O,2015-02-05,NN,,,2019-06-24T13:59:00,false,3,,10,,RUE,DU STADE,51490,DONTRIEN,,,51216,,,,,,,,,,,,,,,,,,,2017-09-01,F,,,,,49.41A,NAFRev2,O,4.412918,49.237235,0.93,housenumber,10 Rue du Stade 51490 Dontrien,51216_0057_00010,G,10 RUE DU STADE,
818557480,00014,81855748000014,O,2016-02-19,,,,2017-06-04T03:23:14,true,3,,6,,,GRANDE RUE,51490,DONTRIEN,,,51216,,,,,,,,,,,,,,,,,,,2017-04-01,A,,,,,01.49Z,NAFRev2,N,4.410622,49.243463,0.93,housenumber,6 Grande Rue 51490 Dontrien,51216_0025_00006,G,6 GRANDE RUE,
824134654,00014,82413465400014,O,2016-12-05,,,,2018-04-18T08:35:26,true,2,,52,,,GRANDE RUE,51490,DONTRIEN,,,51216,,,,,,,,,,,,,,,,,,,2017-04-19,F,,,,,47.99A,NAFRev2,N,4.41088,49.237627,0.93,housenumber,52 Grande Rue 51490 Dontrien,51216_0025_00052,G,52 GRANDE RUE,
831644836,00015,83164483600015,O,2017-09-04,,,4322AZ,2017-08-29T09:07:28,true,1,,19,,,GRANDE RUE,51490,DONTRIEN,,,51216,,,,,,,,,,,,,,,,,,,2017-09-04,A,,,,JP PLOMBERIE CHAUFFAGE,43.22A,NAFRev2,N,4.411969,49.241102,0.93,housenumber,19 Grande Rue 51490 Dontrien,51216_0025_00019,G,19 GRANDE RUE,
838362861,00018,83836286100018,O,2018-03-01,,,,2018-03-22T09:19:04,true,1,,1,,RUE,DE LA PLAINE,51490,DONTRIEN,,,51216,,,,,,,,,,,,,,,,,,,2018-03-01,A,,,,,66.30Z,NAFRev2,N,4.412852,49.240673,0.93,housenumber,1 Rue de la Plaine 51490 Dontrien,51216_0047_00001,G,1 RUE DE LA PLAINE,
839898079,00018,83989807900018,O,2018-06-01,01,2018,4332AA,2020-08-25T11:41:38,true,1,,33,,,GRANDE RUE,51490,DONTRIEN,,,51216,,,,,,,,,,,,,,,,,,,2018-06-01,A,,,,,43.32A,NAFRev2,O,4.412132,49.2391,0.93,housenumber,33 Grande Rue 51490 Dontrien,51216_0025_00033,G,33 GRANDE RUE,
851986901,00011,85198690100011,O,2019-07-01,,,,2021-07-29T08:40:12,true,1,,2,,RUE,DES CLOS,51490,DONTRIEN,,,51216,,,,,,,,,,,,,,,,,,,2019-07-01,A,GRAINE D'EPICES,,,GRAINE D'EPICES,85.59B,NAFRev2,N,4.410933,49.242239,0.93,housenumber,2 Rue des Clos 51490 Dontrien,51216_0116_00002,G,2 RUE DES CLOS,
852660745,00013,85266074500013,O,2019-07-20,,,,2019-08-10T03:42:35,true,1,,6,,,GRANDE RUE,51490,DONTRIEN,,,51216,,,,,,,,,,,,,,,,,,,2019-07-20,A,,,,,47.81Z,NAFRev2,N,4.410622,49.243463,0.93,housenumber,6 Grande Rue 51490 Dontrien,51216_0025_00006,G,6 GRANDE RUE,
891801433,00014,89180143300014,O,2020-11-30,,,4334ZC,2021-01-15T08:46:12,true,2,,12,,RUE,DU STADE,51490,DONTRIEN,,,51216,,,,,,,,,,,,,,,,,,,2020-12-01,A,,,,,43.34Z,NAFRev2,O,4.412701,49.237197,0.93,housenumber,12 Rue du Stade 51490 Dontrien,51216_0057_00012,G,12 RUE DU STADE,
894505080,00016,89450508000016,O,2021-02-25,,,5610CQ,2021-06-23T09:12:04,true,2,,2,,RUE,DES CLOS,51490,DONTRIEN,,,51216,,,,,,,,,,,,,,,,,,,2021-07-01,A,,,,EURL GASSON,56.10C,NAFRev2,N,4.410933,49.242239,0.93,housenumber,2 Rue des Clos 51490 Dontrien,51216_0116_00002,G,2 RUE DES CLOS,
