siren,nic,siret,statutDiffusionEtablissement,dateCreationEtablissement,trancheEffectifsEtablissement,anneeEffectifsEtablissement,activitePrincipaleRegistreMetiersEtablissement,dateDernierTraitementEtablissement,etablissementSiege,nombrePeriodesEtablissement,complementAdresseEtablissement,numeroVoieEtablissement,indiceRepetitionEtablissement,typeVoieEtablissement,libelleVoieEtablissement,codePostalEtablissement,libelleCommuneEtablissement,libelleCommuneEtrangerEtablissement,distributionSpecialeEtablissement,codeCommuneEtablissement,codeCedexEtablissement,libelleCedexEtablissement,codePaysEtrangerEtablissement,libellePaysEtrangerEtablissement,complementAdresse2Etablissement,numeroVoie2Etablissement,indiceRepetition2Etablissement,typeVoie2Etablissement,libelleVoie2Etablissement,codePostal2Etablissement,libelleCommune2Etablissement,libelleCommuneEtranger2Etablissement,distributionSpeciale2Etablissement,codeCommune2Etablissement,codeCedex2Etablissement,libelleCedex2Etablissement,codePaysEtranger2Etablissement,libellePaysEtranger2Etablissement,dateDebut,etatAdministratifEtablissement,enseigne1Etablissement,enseigne2Etablissement,enseigne3Etablissement,denominationUsuelleEtablissement,activitePrincipaleEtablissement,nomenclatureActivitePrincipaleEtablissement,caractereEmployeurEtablissement,longitude,latitude,geo_score,geo_type,geo_adresse,geo_id,geo_ligne,geo_l4,geo_l5
015851363,00091,01585136300091,O,1995-01-01,,,,2012-03-12T15:37:00,false,3,,,,,,52300,FRONVILLE,,,52212,,,,,,,,,,,,,,,,,,,2008-01-01,A,,,,,41.20B,NAFRev2,N,,,0,,,,,,
215201526,00013,21520152600013,O,1983-03-01,02,2018,,2020-08-25T10:17:38,true,3,,4,,,GRANDE RUE,52300,FRONVILLE,,,52212,,,,,,,,,,,,,,,,,,,2008-01-01,A,MAIRIE,,,,84.11Z,NAFRev2,O,5.154356,48.403894,0.93,housenumber,4 Grande Rue 52300 Fronville,52212_0005_00004,G,4 GRANDE RUE,
215201526,00021,21520152600021,O,1983-12-21,NN,,,2016-04-26T01:24:04,false,3,,,,,GRANDE RUE,52300,FRONVILLE,,,52212,,,,,,,,,,,,,,,,,,,2008-01-01,A,ECOLE PRIMAIRE PUBLIQUE,,,,85.20Z,NAFRev2,N,5.154706,48.403868,0.93,street,Grande Rue 52300 Fronville,52212_0005,G,GRANDE RUE,
215201526,00039,21520152600039,O,1994-12-25,NN,,,2008-01-04T18:35:43,false,2,MAIRIE,4,,,GRANDE RUE,52300,FRONVILLE,,,52212,,,,,,,,,,,,,,,,,,,2008-01-01,A,SERVICE EAUX ET ASSAINISSEMENT FRONVILLE,,,,36.00Z,NAFRev2,N,5.154356,48.403894,0.93,housenumber,4 Grande Rue 52300 Fronville,52212_0005_00004,G,4 GRANDE RUE,
215201526,00047,21520152600047,O,2002-01-01,NN,,,2008-01-04T18:35:43,false,3,MAIRIE,4,,,GRANDE RUE,52300,FRONVILLE,,,52212,,,,,,,,,,,,,,,,,,,2008-01-01,A,LOTISSEMENT COMMUNAL,,,,42.99Z,NAFRev2,N,5.154356,48.403894,0.93,housenumber,4 Grande Rue 52300 Fronville,52212_0005_00004,G,4 GRANDE RUE,
245200365,00022,24520036500022,O,1995-03-15,NN,,,2010-07-16T15:12:37,false,5,MAIRIE,4,,,GRANDE RUE,52300,FRONVILLE,,,52212,,,,,,,,,,,,,,,,,,,2010-06-02,F,,,,,84.11Z,NAFRev2,O,5.154356,48.403894,0.93,housenumber,4 Grande Rue 52300 Fronville,52212_0005_00004,G,4 GRANDE RUE,
265201988,00010,26520198800010,O,1983-03-01,NN,,,2016-07-23T12:29:51,true,4,,,,,,52300,FRONVILLE,,,52212,,,,,,,,,,,,,,,,,,,2016-01-01,F,CCAS,,,,88.99B,NAFRev2,N,,,0,,,,,,
265209759,00017,26520975900017,O,1992-11-26,NN,,,2016-05-10T13:21:46,true,4,MAIRIE,4,,,GRANDE RUE,52300,FRONVILLE,,,52212,,,,,,,,,,,,,,,,,,,2015-01-01,F,CDE,,,,88.99B,NAFRev2,N,5.154356,48.403894,0.93,housenumber,4 Grande Rue 52300 Fronville,52212_0005_00004,G,4 GRANDE RUE,
295203483,00017,29520348300017,O,1984-10-15,NN,,,2008-01-04T19:07:04,true,3,MAIRIE,4,,,GRANDE RUE,52300,FRONVILLE,,,52212,,,,,,,,,,,,,,,,,,,2008-01-01,A,,,,,42.99Z,NAFRev2,N,5.154356,48.403894,0.93,housenumber,4 Grande Rue 52300 Fronville,52212_0005_00004,G,4 GRANDE RUE,
302880505,00011,30288050500011,O,,,,,2006-11-25T09:15:16,true,1,,,,,,52300,FRONVILLE,,,52212,,,,,,,,,,,,,,,,,,,1988-12-25,F,,,,,97.22,NAP,N,,,0,,,,,,
307320630,00022,30732063000022,O,1981-10-01,NN,,,,false,4,,,,RTE,IMPERIALE,52300,FRONVILLE,,,52212,,,,,,,,,,,,,,,,,,,2001-10-01,F,,,,,85.1G,NAF1993,N,6.1262907,45.9931683,0.77,poi,Route Impériale (Pont) Fillière,https://osm.org/way/456663916,G,,
309918464,01440,30991846401440,O,2013-07-01,01,2018,,2020-08-25T10:24:26,false,1,,,,RTE,DE SAINT URBAIN,52300,FRONVILLE,,,52212,,,,,,,,,,,,,,,,,,,2013-07-01,A,,,,,23.63Z,NAFRev2,O,5.156071,48.400732,0.84,street,Route de Saint-urbain 52300 Fronville,52212_0020,G,ROUTE DE SAINT URBAIN,
310977681,00017,31097768100017,O,,NN,,,,true,1,,,,,AUX TILLEULS,52300,FRONVILLE,,,52212,,,,,,,,,,,,,,,,,,,1987-09-30,F,,,,,58.06,NAP,N,6.1859989,46.872425,0.82,poi.memorial,Monument (Mémorial) Dompierre-les-Tilleuls,https://osm.org/node/1713980251,G,,
311829642,00025,31182964200025,O,1982-01-01,NN,,,2010-12-29T09:33:56,true,4,,,,,COTE AUX GEAIS SUD,52300,FRONVILLE,,,52212,,,,,,,,,,,,,,,,,,,2010-12-31,F,,,,,38.32Z,NAFRev2,N,,,0,,,,,,
318524147,00010,31852414700010,O,,NN,,,,true,1,,,,,,52300,FRONVILLE,,,52212,,,,,,,,,,,,,,,,,,,1986-04-15,F,,,,,01.00,NAP,N,,,0,,,,,,
318649043,02975,31864904302975,O,2010-05-31,NN,,,2016-04-26T02:24:30,false,2,,,,RTE,DE SAINT-URBAIN,52300,FRONVILLE,,,52212,,,,,,,,,,,,,,,,,,,2014-11-28,F,RESEAU PRO,,,,46.73A,NAFRev2,O,5.156071,48.400732,0.84,street,Route de Saint-urbain 52300 Fronville,52212_0020,G,ROUTE DE SAINT URBAIN,
323104802,00018,32310480200018,O,,,,,,true,1,,,,RUE,PRINCIPALE,52300,FRONVILLE,,,52212,,,,,,,,,,,,,,,,,,,1997-07-31,F,,,,,93.0N,NAF1993,N,2.061661,50.820766,0.9,poi,Rue Principale (Pont) Zouafques,https://osm.org/way/111379934,G,,
324001866,00015,32400186600015,O,,NN,,,,true,1,,,,,,52300,FRONVILLE,,,52212,,,,,,,,,,,,,,,,,,,,F,,,,,64.43,NAP,N,,,0,,,,,,
325513232,00018,32551323200018,O,,NN,,,,true,1,,,,,,52300,FRONVILLE,,,52212,,,,,,,,,,,,,,,,,,,1989-12-31,F,,,,,57.02,NAP,N,,,0,,,,,,
331176776,00028,33117677600028,O,2020-06-22,,,4312AZ,2021-02-23T10:51:22,true,1,,59,,RUE,SAINT LUMIER,52300,FRONVILLE,,,52212,,,,,,,,,,,,,,,,,,,2020-06-22,A,TRAVAUX PUBLICS FRONVILLOIS,,,TPF,43.12A,NAFRev2,N,5.154728,48.402962,0.93,housenumber,59 Rue Saint Lumier 52300 Fronville,52212_0019_00059,G,59 RUE SAINT LUMIER,
338061138,00016,33806113800016,O,1986-05-01,NN,,,2008-01-04T21:16:39,true,5,,,,RTE,NATIONALE,52300,FRONVILLE,,,52212,,,,,,,,,,,,,,,,,,,2008-01-01,A,,,,,68.20B,NAFRev2,N,1.2279812,49.230352,0.77,poi,Route Nationale (Pont) Saint-Pierre-du-Vauvray,https://osm.org/way/95838375,G,,
341259406,00013,34125940600013,O,1987-06-01,NN,,,2008-01-04T21:50:38,true,3,,,,,,52300,FRONVILLE,,,52212,,,,,,,,,,,,,,,,,,,2008-01-01,A,,,,,47.81Z,NAFRev2,N,,,0,,,,,,
342166220,00018,34216622000018,O,1987-06-15,NN,,,,true,3,,,,RTE,N 67,52300,FRONVILLE,,,52212,,,,,,,,,,,,,,,,,,,1992-10-09,F,,,,,55.1A,NAF1993,N,,,0,,,,,,
342790334,00011,34279033400011,O,,NN,,,,true,1,,,,,,52300,FRONVILLE,,,52212,,,,,,,,,,,,,,,,,,,1990-06-30,F,,,,,87.09,NAP,N,,,0,,,,,,
344933338,00263,34493333800263,O,1995-09-01,NN,,,2015-05-14T07:35:22,false,5,,,,,,52300,FRONVILLE,,,52212,,,,,,,,,,,,,,,,,,,2013-06-28,F,,,,,23.63Z,NAFRev2,O,,,0,,,,,,
352564322,00019,35256432200019,O,1981-03-13,NN,,,2008-01-04T23:43:57,true,3,,,,,MAIRIE,52300,FRONVILLE,,,52212,,,,,,,,,,,,,,,,,,,2008-01-01,A,,,,,93.12Z,NAFRev2,N,3.0709671,50.6304695,0.92,poi.townhall,Hôtel de Ville Lille,https://osm.org/way/40917078,G,,
353018930,00019,35301893000019,O,1990-01-02,NN,,,2015-12-11T04:47:24,true,4,,,,,,52300,FRONVILLE,,,52212,,,,,,,,,,,,,,,,,,,2015-12-31,F,,,,,46.23Z,NAFRev2,N,,,0,,,,,,
380308940,00010,38030894000010,O,,NN,,,,true,1,,,,,,52300,FRONVILLE,,,52212,,,,,,,,,,,,,,,,,,,1992-12-31,F,,,,,01.3Z,NAF1993,N,,,0,,,,,,
382995116,00029,38299511600029,O,1900-01-01,NN,,,2014-07-08T01:07:51,true,5,,35,,RUE,DES TILLEULS,52300,FRONVILLE,,,52212,,,,,,,,,,,,,,,,,,,2009-09-15,F,,,,,43.22A,NAFRev2,N,5.151482,48.409011,0.93,housenumber,35 Rue des Tilleuls 52300 Fronville,52212_0025_00035,G,35 RUE DES TILLEULS,
388384794,00011,38838479400011,O,1992-07-01,NN,,,,true,1,,,,,,52300,FRONVILLE,,,52212,,,,,,,,,,,,,,,,,,,1995-10-19,F,,,,,26.6A,NAF1993,O,,,0,,,,,,
389434754,00013,38943475400013,O,1978-01-01,NN,,,2012-12-18T08:18:56,true,4,,,,,,52300,FRONVILLE,,,52212,,,,,,,,,,,,,,,,,,,2012-03-04,F,,,,,01.50Z,NAFRev2,N,,,0,,,,,,
389465154,00018,38946515400018,O,1968-01-01,NN,,,2008-01-04T23:24:43,true,5,,,,,,52300,FRONVILLE,,,52212,,,,,,,,,,,,,,,,,,,2008-01-01,A,,,,,68.20B,NAFRev2,N,,,0,,,,,,
389465170,00014,38946517000014,O,1981-02-01,NN,,,2008-01-04T23:24:43,true,5,,,,,,52300,FRONVILLE,,,52212,,,,,,,,,,,,,,,,,,,2008-01-01,A,,,,,68.20B,NAFRev2,N,,,0,,,,,,
394925416,00015,39492541600015,O,,NN,,,,true,1,,,,,RN 67,52300,FRONVILLE,,,52212,,,,,,,,,,,,,,,,,,,1995-05-17,F,,,,,55.3B,NAF1993,N,,,0,,,,,,
394939243,00025,39493924300025,O,2020-05-20,,,,2020-06-25T03:51:50,true,1,,28,,RUE,DES TILLEULS,52300,FRONVILLE,,,52212,,,,,,,,,,,,,,,,,,,2020-05-20,A,,,,,68.20A,NAFRev2,N,5.150717,48.410324,0.93,housenumber,28 Rue des Tilleuls 52300 Fronville,52212_0025_00028,G,28 RUE DES TILLEULS,
400247128,00012,40024712800012,O,,NN,,,,true,1,,,,,,52300,FRONVILLE,,,52212,,,,,,,,,,,,,,,,,,,1997-06-30,F,,,,,01.1A,NAF1993,N,,,0,,,,,,
401448154,00559,40144815400559,O,2006-02-28,NN,,,2012-05-05T05:14:04,false,4,,,,RTE,DE SAINT URBAIN,52300,FRONVILLE,,,52212,,,,,,,,,,,,,,,,,,,2010-05-31,F,RESEAU PRO,,,,46.73A,NAFRev2,O,5.156071,48.400732,0.84,street,Route de Saint-urbain 52300 Fronville,52212_0020,G,ROUTE DE SAINT URBAIN,
404307134,00019,40430713400019,O,1996-02-12,NN,,,,true,1,,,,,,52300,FRONVILLE,,,52212,,,,,,,,,,,,,,,,,,,1998-12-31,F,,,,,02.0B,NAF1993,N,,,0,,,,,,
404939217,00018,40493921700018,O,1996-01-01,NN,,,2019-07-02T10:33:29,false,4,TABOUREUX ERIC,,,RUE,GRANDE,52300,FRONVILLE,,,52212,,,,,,,,,,,,,,,,,,,2019-05-29,F,,,,,01.11Z,NAFRev2,N,5.154706,48.403868,0.82,street,Grande Rue 52300 Fronville,52212_0005,G,GRANDE RUE,
404939217,00026,40493921700026,O,2019-05-29,,,,2021-02-23T11:29:14,true,1,,2,,RUE,DE L'EGLISE,52300,FRONVILLE,,,52212,,,,,,,,,,,,,,,,,,,2019-05-29,A,,,,,01.11Z,NAFRev2,N,5.154189,48.40348,0.93,housenumber,2 Rue de l'Eglise 52300 Fronville,52212_0001_00002,G,2 RUE DE L EGLISE,
408306397,00014,40830639700014,O,1996-05-01,NN,,,,true,1,,,,,,52300,FRONVILLE,,,52212,,,,,,,,,,,,,,,,,,,2000-12-29,F,,,,,51.5F,NAF1993,O,,,0,,,,,,
410173298,00614,41017329800614,O,2014-11-28,03,2018,,2020-08-25T10:38:35,false,1,,,,RTE,DE SAINT-URBAIN,52300,FRONVILLE,,,52212,,,,,,,,,,,,,,,,,,,2014-11-28,A,RESEAU PRO,,,,46.73A,NAFRev2,O,5.156071,48.400732,0.84,street,Route de Saint-urbain 52300 Fronville,52212_0020,G,ROUTE DE SAINT URBAIN,
429783400,00014,42978340000014,O,2000-03-01,NN,,,2014-05-20T04:43:45,true,5,,12,,,GRANDE RUE,52300,FRONVILLE,,,52212,,,,,,,,,,,,,,,,,,,2013-12-03,F,,,,,43.99C,NAFRev2,N,5.153251,48.403814,0.93,housenumber,12 Grande Rue 52300 Fronville,52212_0005_00012,G,12 GRANDE RUE,
431877703,00014,43187770300014,O,2000-04-01,NN,,,,false,4,,35,,RUE,DES TILLEULS,52300,FRONVILLE,,,52212,,,,,,,,,,,,,,,,,,,2003-04-01,F,,,,,85.1G,NAFRev1,N,5.151482,48.409011,0.93,housenumber,35 Rue des Tilleuls 52300 Fronville,52212_0025_00035,G,35 RUE DES TILLEULS,
431877703,00022,43187770300022,O,2003-04-01,NN,,,2006-11-25T16:59:01,false,3,,27,,RUE,DES TILLEULS,52300,FRONVILLE,,,52212,,,,,,,,,,,,,,,,,,,2004-12-15,F,,,,,85.1G,NAFRev1,N,5.152258,48.407993,0.93,housenumber,27 Rue des Tilleuls 52300 Fronville,52212_0025_00027,G,27 RUE DES TILLEULS,
431877703,00030,43187770300030,O,2004-12-15,NN,,,2021-02-23T13:12:56,true,3,,4,,,LOTISSEMENT DU PRE MAHET,52300,FRONVILLE,,,52212,,,,,,,,,,,,,,,,,,,2008-01-01,A,,,,,86.90D,NAFRev2,N,5.150263,48.409272,0.8,housenumber,4 Lotissement le Pre Mahet 52300 Fronville,52212_a005_00004,G,4 LOTISSEMENT LE PRE MAHET,
435302328,00024,43530232800024,O,2004-11-15,NN,,,2008-12-06T05:21:09,false,3,LIEU-DIT DEVANT MEUVAL,,,RTE,DE SAINT URBAIN,52300,FRONVILLE,,,52212,,,,,,,,,,,,,,,,,,,2008-01-01,A,,,,,43.12A,NAFRev2,N,5.156071,48.400732,0.84,street,Route de Saint-urbain 52300 Fronville,52212_0020,G,ROUTE DE SAINT URBAIN,
438845646,00019,43884564600019,O,2001-07-30,NN,,,2021-06-23T03:55:11,true,3,M. COSSON PASCAL,33,,RUE,DES TILLEULS,52300,FRONVILLE,,,52212,,,,,,,,,,,,,,,,,,,2008-01-01,A,,,,,68.20B,NAFRev2,N,5.151647,48.408852,0.93,housenumber,33 Rue des Tilleuls 52300 Fronville,52212_0025_00033,G,33 RUE DES TILLEULS,
453095671,00013,45309567100013,O,2004-03-18,NN,,,2008-11-08T02:37:11,false,3,,52,,RUE,SAINT LUMIER,52300,FRONVILLE,,,52212,,,,,,,,,,,,,,,,,,,2005-11-01,F,,,,,50.3B,NAFRev1,N,5.154544,48.40288,0.93,housenumber,52 Rue Saint Lumier 52300 Fronville,52212_0019_00052,G,52 RUE SAINT LUMIER,
477579536,00012,47757953600012,O,2004-07-01,NN,,,2007-03-04T16:32:05,true,3,,40,,RUE,ST LUMIER,52300,FRONVILLE,,,52212,,,,,,,,,,,,,,,,,,,2006-12-15,F,,,,,52.4J,NAFRev1,N,5.154719,48.404382,0.83,housenumber,40 Rue Saint Lumier 52300 Fronville,52212_0019_00040,G,40 RUE SAINT LUMIER,
480526441,00013,48052644100013,O,2005-01-14,,,,2008-01-05T21:45:02,true,2,,4,,LOT,DES PRE MAHET,52300,FRONVILLE,,,52212,,,,,,,,,,,,,,,,,,,2008-01-01,A,,,,,68.20B,NAFRev2,N,5.150263,48.409272,0.66,housenumber,4 Lotissement le Pre Mahet 52300 Fronville,52212_a005_00004,G,4 LOTISSEMENT LE PRE MAHET,
487505398,00015,48750539800015,O,2005-11-10,NN,,,2014-07-10T00:20:45,true,3,,20,,RUE,DES TILLEULS,52300,FRONVILLE,,,52212,,,,,,,,,,,,,,,,,,,2010-01-11,F,,,,,43.99C,NAFRev2,N,5.151762,48.408879,0.93,housenumber,20 Rue des Tilleuls 52300 Fronville,52212_0025_00020,G,20 RUE DES TILLEULS,
500447701,00011,50044770100011,O,2007-09-29,,,,2015-01-13T03:27:54,true,3,,38,,RUE,SAINT LUMIER,52300,FRONVILLE,,,52212,,,,,,,,,,,,,,,,,,,2014-10-06,F,,,,,43.99C,NAFRev2,N,5.154681,48.404485,0.93,housenumber,38 Rue Saint Lumier 52300 Fronville,52212_0019_00038,G,38 RUE SAINT LUMIER,
502093420,00011,50209342000011,O,2008-01-01,NN,,9511ZZ,2015-03-18T00:14:06,true,2,,55,,,GRANDE RUE,52300,FRONVILLE,,,52212,,,,,,,,,,,,,,,,,,,2008-04-16,A,BENEVA,,,,62.02A,NAFRev2,O,5.148622,48.403493,0.93,housenumber,55 Grande Rue 52300 Fronville,52212_0005_00055,G,55 GRANDE RUE,
508686938,00012,50868693800012,O,2008-10-01,NN,,,2010-06-03T09:14:23,false,3,,,,,LIEUDIT DEVANT MEUVAL,52300,FRONVILLE,,,52212,,,,,,,,,,,,,,,,,,,2010-04-01,F,,,,,41.20A,NAFRev2,N,,,0,,,,,,
515580421,00011,51558042100011,O,1900-01-01,22,2018,,2020-08-25T10:30:59,false,4,,,,RTE,DE SAINT URBAIN,52300,FRONVILLE,,,52212,,,,,,,,,,,,,,,,,,,2008-01-01,A,,,,,29.32Z,NAFRev2,O,5.156071,48.400732,0.84,street,Route de Saint-urbain 52300 Fronville,52212_0020,G,ROUTE DE SAINT URBAIN,
516470085,00015,51647008500015,O,1964-01-01,,,,,true,3,,,,,,52300,FRONVILLE,,,52212,,,,,,,,,,,,,,,,,,,1997-08-08,F,,,,,70.2C,NAF1993,N,,,0,,,,,,
517664264,00010,51766426400010,O,2009-10-15,,,,2021-07-08T09:01:33,true,2,,35,,RTE,DE SOMBREUIL,52300,FRONVILLE,,,52212,,,,,,,,,,,,,,,,,,,2020-12-31,F,,,,,43.32A,NAFRev2,N,5.150668,48.403844,0.84,housenumber,35 Route de Sombreuil 52300 Fronville,52212_0023_00035,G,35 ROUTE DE SOMBREUIL,
517884466,00015,51788446600015,O,2009-10-30,,,,2020-01-10T03:54:50,true,2,,4,B,RUE,DES TILLEULS,52300,FRONVILLE,,,52212,,,,,,,,,,,,,,,,,,,2020-01-06,F,,,,,43.99C,NAFRev2,N,5.152974,48.407189,0.81,housenumber,4 bis Rue des Tilleuls 52300 Fronville,52212_0025_00004_bis,G,4 BIS RUE DES TILLEULS,
519383491,00015,51938349100015,O,2010-01-10,,,,2012-01-05T03:49:12,true,2,,25,,RUE,DES TILLEULS,52300,FRONVILLE,,,52212,,,,,,,,,,,,,,,,,,,2011-12-31,F,,,,,02.20Z,NAFRev2,N,5.152251,48.408004,0.93,housenumber,25 Rue des Tilleuls 52300 Fronville,52212_0025_00025,G,25 RUE DES TILLEULS,
523900199,00010,52390019900010,O,2010-06-24,,,,2010-07-22T09:33:38,true,1,,38,,RUE,SAINT LUMIER,52300,FRONVILLE,,,52212,,,,,,,,,,,,,,,,,,,2010-06-24,A,,,,,68.20B,NAFRev2,N,5.154681,48.404485,0.93,housenumber,38 Rue Saint Lumier 52300 Fronville,52212_0019_00038,G,38 RUE SAINT LUMIER,
524933009,00010,52493300900010,O,2010-06-01,,,,2010-09-16T13:56:08,true,1,,23,,,GRANDE RUE,52300,FRONVILLE,,,52212,,,,,,,,,,,,,,,,,,,2010-06-01,A,,,,,93.12Z,NAFRev2,N,5.151146,48.403641,0.93,housenumber,23 Grande Rue 52300 Fronville,52212_0005_00023,G,23 GRANDE RUE,
524940509,00010,52494050900010,O,2010-10-01,,,,2012-11-10T02:29:43,false,2,,8,,PL,RONCIERE,52300,FRONVILLE,,,52212,,,,,,,,,,,,,,,,,,,2012-02-01,F,,,,,96.02A,NAFRev2,N,5.155461,48.404437,0.79,housenumber,8 Place de la Ronciere 52300 Fronville,52212_0017_00008,G,8 PLACE DE LA RONCIERE,
527828461,00014,52782846100014,O,2010-11-15,,,,2013-01-11T14:36:29,false,2,GRANDE,23,,RUE,GRANDE RUE,52300,FRONVILLE,,,52212,,,,,,,,,,,,,,,,,,,2012-01-15,F,,,,,38.32Z,NAFRev2,N,5.151146,48.403641,0.82,housenumber,23 Grande Rue 52300 Fronville,52212_0005_00023,G,23 GRANDE RUE,
530524610,00017,53052461000017,O,2010-10-01,,,,2011-02-23T03:54:40,true,1,MAIRIE,4,,RUE,GRANDE RUE,52300,FRONVILLE,,,52212,,,,,,,,,,,,,,,,,,,2010-10-01,A,,,,,02.10Z,NAFRev2,N,5.154356,48.403894,0.81,housenumber,4 Grande Rue 52300 Fronville,52212_0005_00004,G,4 GRANDE RUE,
531976447,00015,53197644700015,O,2010-07-05,,,,2011-05-04T10:40:58,true,1,,23,,,GRANDE RUE,52300,FRONVILLE,,,52212,,,,,,,,,,,,,,,,,,,2010-07-05,A,,,,,93.12Z,NAFRev2,N,5.151146,48.403641,0.93,housenumber,23 Grande Rue 52300 Fronville,52212_0005_00023,G,23 GRANDE RUE,
537638322,00017,53763832200017,O,2011-11-01,,,,2017-05-18T05:23:44,true,2,,35,,,GRAND RUE,52300,FRONVILLE,,,52212,,,,,,,,,,,,,,,,,,,2017-05-10,F,,,,,45.32Z,NAFRev2,N,5.150221,48.403496,0.79,housenumber,35 Grande Rue 52300 Fronville,52212_0005_00035,G,35 GRANDE RUE,
750248627,00010,75024862700010,O,2012-03-02,,,,2012-03-15T07:38:01,true,1,,4,,LOT,DU PRE MAHET,52300,FRONVILLE,,,52212,,,,,,,,,,,,,,,,,,,2012-03-02,A,,,,,68.20B,NAFRev2,N,5.150263,48.409272,0.69,housenumber,4 Lotissement le Pre Mahet 52300 Fronville,52212_a005_00004,G,4 LOTISSEMENT LE PRE MAHET,
775613110,00136,77561311000136,O,2000-12-29,NN,,,2008-04-26T20:41:36,false,3,,,,RTE,DE SAINT URBAIN,52300,FRONVILLE,,,52212,,,,,,,,,,,,,,,,,,,2006-02-28,F,,,,,51.5F,NAFRev1,O,5.156071,48.400732,0.84,street,Route de Saint-urbain 52300 Fronville,52212_0020,G,ROUTE DE SAINT URBAIN,
778157131,00013,77815713100013,O,,,,,,true,1,,,,,,52300,FRONVILLE,,,52212,,,,,,,,,,,,,,,,,,,1984-12-25,F,,,,,21.10,NAP,N,,,0,,,,,,
780471587,00011,78047158700011,O,,NN,,,,true,1,,,,,,52300,FRONVILLE,,,52212,,,,,,,,,,,,,,,,,,,1995-11-24,F,,,,,45.4C,NAF1993,O,,,0,,,,,,
780471595,00014,78047159500014,O,,,,,,true,1,,,,,,52300,FRONVILLE,,,52212,,,,,,,,,,,,,,,,,,,1984-12-25,F,,,,,57.02,NAP,N,,,0,,,,,,
780471611,00019,78047161100019,O,,,,,,true,1,,,,,,52300,FRONVILLE,,,52212,,,,,,,,,,,,,,,,,,,1984-12-25,F,,,,,92.21,NAP,N,,,0,,,,,,
790690457,00011,79069045700011,O,2013-02-04,,,4333ZZ,2017-04-28T09:04:37,true,2,,49,,RUE,SAINT-LUMIER,52300,FRONVILLE,,,52212,,,,,,,,,,,,,,,,,,,2016-02-29,F,FCFM,,,PERSIN FREDERIC,43.33Z,NAFRev2,N,5.154905,48.403607,0.93,housenumber,49 Rue Saint Lumier 52300 Fronville,52212_0019_00049,G,49 RUE SAINT LUMIER,
790789879,00018,79078987900018,O,2013-02-01,,,,2013-08-27T08:31:36,true,2,,1,,,LOTISSEMENT LOUISE MARCILLY,52300,FRONVILLE,,,52212,,,,,,,,,,,,,,,,,,,2013-08-31,F,,,,,43.34Z,NAFRev2,N,5.15206,48.403582,0.93,housenumber,1 Lotissement Louise Marcilly 52300 Fronville,52212_a001_00001,G,1 LOTISSEMENT LOUISE MARCILLY,
802913178,00017,80291317800017,O,2014-06-23,,,,2014-12-16T09:23:57,true,2,,2,,RTE,DE SAINT URBAIN,52300,FRONVILLE,,,52212,,,,,,,,,,,,,,,,,,,2014-12-14,F,,,,,74.30Z,NAFRev2,N,5.156071,48.400732,0.76,street,Route de Saint-urbain 52300 Fronville,52212_0020,G,ROUTE DE SAINT URBAIN,
815129440,00013,81512944000013,O,2016-01-01,01,2018,,2021-06-20T08:50:01,true,3,,5,,RTE,DE SOMBREUIL,52300,FRONVILLE,,,52212,,,,,,,,,,,,,,,,,,,2018-01-01,A,,,,,46.23Z,NAFRev2,O,5.153449,48.405077,0.84,housenumber,5 Route de Sombreuil 52300 Fronville,52212_0023_00005,G,5 ROUTE DE SOMBREUIL,
815129440,00021,81512944000021,O,2021-06-01,,,,2021-06-21T10:18:46,false,1,,57,,,GRANDE RUE,52300,FRONVILLE,,,52212,,,,,,,,,,,,,,,,,,,2021-06-01,A,,,,,46.23Z,NAFRev2,N,5.148306,48.40351,0.93,housenumber,57 Grande Rue 52300 Fronville,52212_0005_00057,G,57 GRANDE RUE,
815129440,00039,81512944000039,O,2021-06-01,,,,2021-06-21T10:18:27,false,1,,2,,CHE,DIT DE MERLI,52300,FRONVILLE,,,52212,,,,,,,,,,,,,,,,,,,2021-06-01,A,,,,,46.23Z,NAFRev2,N,,,0,,,,,,
815379334,00015,81537933400015,O,2016-02-01,,,,2018-04-10T16:02:42,true,1,,50,,RUE,SAINT LUMIER,52300,FRONVILLE,,,52212,,,,,,,,,,,,,,,,,,,2016-02-01,A,,,,,70.10Z,NAFRev2,N,5.154688,48.403196,0.93,housenumber,50 Rue Saint Lumier 52300 Fronville,52212_0019_00050,G,50 RUE SAINT LUMIER,
819904020,00016,81990402000016,O,2016-04-01,,,,2016-04-26T08:51:20,true,1,,5,,RTE,DE SOMBREUIL,52300,FRONVILLE,,,52212,,,,,,,,,,,,,,,,,,,2016-04-01,A,,,,,68.20B,NAFRev2,N,5.153449,48.405077,0.84,housenumber,5 Route de Sombreuil 52300 Fronville,52212_0023_00005,G,5 ROUTE DE SOMBREUIL,
829868926,00017,82986892600017,O,2017-06-15,,,4321AB,2017-05-29T08:35:05,true,1,,23,T,RUE,DES TILLEULS,52300,FRONVILLE,,,52212,,,,,,,,,,,,,,,,,,,2017-06-15,A,,,,MERLI ELEC,43.21A,NAFRev2,N,5.153443,48.406345,0.81,housenumber,23 ter Rue des Tilleuls 52300 Fronville,52212_0025_00023_ter,G,23 TER RUE DES TILLEULS,
837529239,00019,83752923900019,O,2018-01-30,,,,2018-02-19T09:17:19,true,1,,,,CHE,DE BECHINVAL,52300,FRONVILLE,,,52212,,,,,,,,,,,,,,,,,,,2018-01-30,A,,,,,35.22Z,NAFRev2,N,,,0,,,,,,
840927750,00017,84092775000017,O,2018-06-21,,,,2018-07-10T04:16:40,true,1,,,,CHE,DE BECHINVAL,52300,FRONVILLE,,,52212,,,,,,,,,,,,,,,,,,,2018-06-21,A,,,,,01.61Z,NAFRev2,N,,,0,,,,,,
840962146,00014,84096214600014,O,2018-08-01,,,,2018-07-11T07:21:34,true,1,IMPASSE DU STADE,6,,RTE,DE SAINT URBAIN,52300,FRONVILLE,,,52212,,,,,,,,,,,,,,,,,,,2018-08-01,A,,,,,47.89Z,NAFRev2,N,5.156071,48.400732,0.76,street,Route de Saint-urbain 52300 Fronville,52212_0020,G,ROUTE DE SAINT URBAIN,
848851390,00015,84885139000015,O,2019-02-08,,,,2019-03-06T08:33:35,true,1,,39,,RUE,SAINT-LUMIER,52300,FRONVILLE,,,52212,,,,,,,,,,,,,,,,,,,2019-02-08,A,,,,,47.99A,NAFRev2,N,5.154911,48.404176,0.93,housenumber,39 Rue Saint Lumier 52300 Fronville,52212_0019_00039,G,39 RUE SAINT LUMIER,
881271043,00013,88127104300013,O,2020-02-01,,,4399CZ,2020-03-04T08:33:14,true,1,,57,,RUE,SAINT LUMIER,52300,FRONVILLE,,,52212,,,,,,,,,,,,,,,,,,,2020-02-01,A,AMBROSETTI CONSTRUCTION,,,AMBROSETTI CONSTRUCTION,43.99C,NAFRev2,O,5.154806,48.403184,0.93,housenumber,57 Rue Saint Lumier 52300 Fronville,52212_0019_00057,G,57 RUE SAINT LUMIER,
890512049,00010,89051204900010,O,2020-09-08,,,,2021-01-08T03:33:10,true,1,,64,,RTE,DE SOMBREUIL,52300,FRONVILLE,,,52212,,,,,,,,,,,,,,,,,,,2020-09-08,A,,,,,94.99Z,NAFRev2,N,5.149015,48.403782,0.84,housenumber,64 Route de Sombreuil 52300 Fronville,52212_0023_00064,G,64 ROUTE DE SOMBREUIL,
899407308,00019,89940730800019,O,2021-05-11,,,,2021-05-18T09:55:59,true,1,,4,,LOT,DU PRE MAHET,52300,FRONVILLE,,,52212,,,,,,,,,,,,,,,,,,,2021-05-11,A,,,,,68.20B,NAFRev2,N,5.150263,48.409272,0.69,housenumber,4 Lotissement le Pre Mahet 52300 Fronville,52212_a005_00004,G,4 LOTISSEMENT LE PRE MAHET,
899548093,00017,89954809300017,O,2021-04-17,,,,2021-05-22T03:50:06,true,1,,39,,RUE,SAINT LUMIER,52300,FRONVILLE,,,52212,,,,,,,,,,,,,,,,,,,2021-04-17,A,,,,,01.49Z,NAFRev2,N,5.154911,48.404176,0.93,housenumber,39 Rue Saint Lumier 52300 Fronville,52212_0019_00039,G,39 RUE SAINT LUMIER,
