siren,nic,siret,statutDiffusionEtablissement,dateCreationEtablissement,trancheEffectifsEtablissement,anneeEffectifsEtablissement,activitePrincipaleRegistreMetiersEtablissement,dateDernierTraitementEtablissement,etablissementSiege,nombrePeriodesEtablissement,complementAdresseEtablissement,numeroVoieEtablissement,indiceRepetitionEtablissement,typeVoieEtablissement,libelleVoieEtablissement,codePostalEtablissement,libelleCommuneEtablissement,libelleCommuneEtrangerEtablissement,distributionSpecialeEtablissement,codeCommuneEtablissement,codeCedexEtablissement,libelleCedexEtablissement,codePaysEtrangerEtablissement,libellePaysEtrangerEtablissement,complementAdresse2Etablissement,numeroVoie2Etablissement,indiceRepetition2Etablissement,typeVoie2Etablissement,libelleVoie2Etablissement,codePostal2Etablissement,libelleCommune2Etablissement,libelleCommuneEtranger2Etablissement,distributionSpeciale2Etablissement,codeCommune2Etablissement,codeCedex2Etablissement,libelleCedex2Etablissement,codePaysEtranger2Etablissement,libellePaysEtranger2Etablissement,dateDebut,etatAdministratifEtablissement,enseigne1Etablissement,enseigne2Etablissement,enseigne3Etablissement,denominationUsuelleEtablissement,activitePrincipaleEtablissement,nomenclatureActivitePrincipaleEtablissement,caractereEmployeurEtablissement,longitude,latitude,geo_score,geo_type,geo_adresse,geo_id,geo_ligne,geo_l4,geo_l5
215301607,00010,21530160700010,O,1983-03-01,02,2018,,2020-08-25T10:17:41,true,4,,,,,BOURG,53640,MONTREUIL-POULAY,,,53160,,,,,,,,,,,,,,,,,,,2008-01-01,A,MAIRIE,,,,84.11Z,NAFRev2,O,-0.519496,48.37721,0.9,street,Bourg de Poulay 53640 Montreuil-Poulay,53160_a005,G,BOURG DE POULAY,
215301607,00028,21530160700028,O,1983-12-21,01,2018,,2020-08-25T10:17:41,false,4,,437,,RUE,DES ARTISANS,53640,MONTREUIL-POULAY,,,53160,,,,,,,,,,,,,,,,,,,2008-12-25,A,ECOLE PRIMAIRE LUCIE AUBRAC,,,,85.20Z,NAFRev2,N,-0.516711,48.384669,0.93,housenumber,437 Rue des Artisans 53640 Montreuil-Poulay,53160_0015_00437,G,437 RUE DES ARTISANS,
215301607,00036,21530160700036,O,1997-03-01,NN,,,2008-01-04T18:35:58,false,3,MAIRIE,,,,BOURG,53640,MONTREUIL-POULAY,,,53160,,,,,,,,,,,,,,,,,,,2008-01-01,A,SERVICE ASSAINISSEMENT,,,,37.00Z,NAFRev2,N,-0.519496,48.37721,0.9,street,Bourg de Poulay 53640 Montreuil-Poulay,53160_a005,G,BOURG DE POULAY,
215301607,00044,21530160700044,O,1995-12-25,NN,,,2008-01-04T18:35:58,false,2,MAIRIE,,,,LE BOURG,53640,MONTREUIL-POULAY,,,53160,,,,,,,,,,,,,,,,,,,2008-01-01,A,SERVICE D EAU,,,,36.00Z,NAFRev2,N,2.212915,47.9910304,0.9,poi.bar,Le Bourg (Bar) Ingrannes,https://osm.org/node/1718543174,G,,
215301607,00051,21530160700051,O,2005-03-10,,,,2008-01-04T18:35:58,false,2,MAIRIE,,,,BOURG,53640,MONTREUIL-POULAY,,,53160,,,,,,,,,,,,,,,,,,,2008-01-01,A,LOTISSEMENT LES JARDINS DU LAC,,,,42.99Z,NAFRev2,N,-0.519496,48.37721,0.9,street,Bourg de Poulay 53640 Montreuil-Poulay,53160_a005,G,BOURG DE POULAY,
215301839,00019,21530183900019,O,1983-03-01,NN,,,2008-01-04T18:35:58,true,3,,,,,POULAY,53640,MONTREUIL-POULAY,,,53160,,,,,,,,,,,,,,,,,,,2008-01-01,A,,,,,84.11Z,NAFRev2,N,-0.519545,48.377169,0.93,street,Poulay 53640 Montreuil-Poulay,53160_phtu6v,G,POULAY,
265301820,00014,26530182000014,O,1983-03-01,NN,,,2016-07-23T12:27:48,true,4,MAIRIE,,,,BOURG,53640,MONTREUIL-POULAY,,,53160,,,,,,,,,,,,,,,,,,,2016-01-01,F,CCAS,,,,88.99B,NAFRev2,N,-0.519496,48.37721,0.9,street,Bourg de Poulay 53640 Montreuil-Poulay,53160_a005,G,BOURG DE POULAY,
275301075,00014,27530107500014,O,,,,,,true,1,,,,,BOURG,53640,MONTREUIL-POULAY,,,53160,,,,,,,,,,,,,,,,,,,1995-12-25,F,,,,,75.1C,NAF1993,N,-0.519496,48.37721,0.9,street,Bourg de Poulay 53640 Montreuil-Poulay,53160_a005,G,BOURG DE POULAY,
295301329,00013,29530132900013,O,1989-10-01,NN,,,2008-01-04T19:07:06,true,3,,,,,MAIRIE,53640,MONTREUIL-POULAY,,,53160,,,,,,,,,,,,,,,,,,,2007-12-04,F,,,,,70.1C,NAFRev1,N,3.0709671,50.6304695,0.92,poi.townhall,Hôtel de Ville Lille,https://osm.org/way/40917078,G,,
301063673,00026,30106367300026,O,,,,,,true,1,,,,,BOURG,53640,MONTREUIL-POULAY,,,53160,,,,,,,,,,,,,,,,,,,1997-06-30,F,,,,,55.4B,NAF1993,N,-0.519496,48.37721,0.9,street,Bourg de Poulay 53640 Montreuil-Poulay,53160_a005,G,BOURG DE POULAY,
308870468,00011,30887046800011,O,,,,,,true,1,,,,LD,LA HOUDOULIERE,53640,MONTREUIL-POULAY,,,53160,,,,,,,,,,,,,,,,,,,1984-12-25,F,,,,,01.80,NAP,N,-0.5119609,48.3759391,0.89,poi.stream,Ruiseau de la Houdoulière (Ruisseau) Champéon,https://osm.org/way/314831993,G,,
311837512,00012,31183751200012,O,,NN,,,,true,1,,,,,LE BOURG,53640,MONTREUIL-POULAY,,,53160,,,,,,,,,,,,,,,,,,,,F,,,,,00.10,NAP,N,2.212915,47.9910304,0.9,poi.bar,Le Bourg (Bar) Ingrannes,https://osm.org/node/1718543174,G,,
311837520,00015,31183752000015,O,,,,,,true,1,,,,,LE BOURG,53640,MONTREUIL-POULAY,,,53160,,,,,,,,,,,,,,,,,,,1984-12-25,F,,,,,00.10,NAP,N,2.212915,47.9910304,0.9,poi.bar,Le Bourg (Bar) Ingrannes,https://osm.org/node/1718543174,G,,
313673733,00017,31367373300017,O,1978-01-01,NN,,,2008-11-07T00:28:58,true,3,,,,,LES MEZIERES,53640,MONTREUIL-POULAY,,,53160,,,,,,,,,,,,,,,,,,,2005-12-31,F,,,,,45.4C,NAFRev1,N,4.6876715,49.7543865,0.89,poi.townhall,Mairie (Hôtel de ville) Prix-lès-Mézières,https://osm.org/way/100381738,G,,
314271131,00018,31427113100018,O,1978-01-01,,,,2011-04-23T04:48:52,false,3,,,,LD,MOUSSAY,53640,MONTREUIL-POULAY,,,53160,,,,,,,,,,,,,,,,,,,2006-06-22,F,,,,,71.3A,NAFRev1,N,1.4660746,47.0341273,0.88,poi.track,Chemin Rural de Jeu-Maloches à Moussay Jeu-Maloches,https://osm.org/way/246163827,G,,
314271131,00026,31427113100026,O,2006-06-22,01,2018,,2020-08-25T10:26:01,true,2,,,,,LES MEZIERES,53640,MONTREUIL-POULAY,,,53160,,,,,,,,,,,,,,,,,,,2008-01-01,A,,,,,77.31Z,NAFRev2,N,4.6876715,49.7543865,0.89,poi.townhall,Mairie (Hôtel de ville) Prix-lès-Mézières,https://osm.org/way/100381738,G,,
316566488,00029,31656648800029,O,,NN,,,,true,1,,,,,BOURG,53640,MONTREUIL-POULAY,,,53160,,,,,,,,,,,,,,,,,,,,F,,,,,62.11,NAP,N,-0.519496,48.37721,0.9,street,Bourg de Poulay 53640 Montreuil-Poulay,53160_a005,G,BOURG DE POULAY,
317288470,00014,31728847000014,O,,,,,,true,1,,,,,LES MOUSSAYS,53640,MONTREUIL-POULAY,,,53160,,,,,,,,,,,,,,,,,,,1985-01-01,F,,,,,01.3Z,NAF1993,N,-0.528106,48.398614,0.43,locality,Les Petits Bois 53640 Montreuil-Poulay,53160_b734,G,LES PETITS BOIS,
318234127,00013,31823412700013,O,,NN,,,,true,1,,,,LOT,DE BELLEVUE,53640,MONTREUIL-POULAY,,,53160,,,,,,,,,,,,,,,,,,,1997-06-07,F,,,,,52.6D,NAF1993,N,0.2249715,44.3174417,0.73,poi.track,Chemin rural de Puch-d'Agenais au Pont-de-Bellevue Puch-d'Agenais,https://osm.org/way/503179068,G,,
321783649,00015,32178364900015,O,1981-04-01,01,2018,,2021-07-12T09:21:47,false,4,,,,,BEARD,53640,MONTREUIL-POULAY,,,53160,,,,,,,,,,,,,,,,,,,2021-06-30,F,,,,,01.41Z,NAFRev2,N,3.332603,46.8568867,0.89,poi,(Pont) Béard,https://osm.org/way/377226093,G,,
321783649,00023,32178364900023,O,2021-06-30,,,,2021-07-12T09:21:47,true,1,,1,,,LA FONTENELLE,53640,MONTREUIL-POULAY,,,53160,,,,,,,,,,,,,,,,,,,2021-06-30,A,,,,,01.50Z,NAFRev2,N,-0.523743,48.382546,0.48,street,Rue de la Fontaine 53640 Montreuil-Poulay,53160_0035,G,RUE DE LA FONTAINE,
324597673,00015,32459767300015,O,,,,,,true,1,,,,,BOURG,53640,MONTREUIL-POULAY,,,53160,,,,,,,,,,,,,,,,,,,1985-12-25,F,,,,,62.43,NAP,N,-0.519496,48.37721,0.9,street,Bourg de Poulay 53640 Montreuil-Poulay,53160_a005,G,BOURG DE POULAY,
324649342,00015,32464934200015,O,1982-06-01,,,,2008-11-07T00:41:38,true,4,,,,RTE,DE POULAY,53640,MONTREUIL-POULAY,,,53160,,,,,,,,,,,,,,,,,,,2004-09-30,F,,,,,45.2V,NAFRev1,N,-0.519496,48.37721,0.66,street,Bourg de Poulay 53640 Montreuil-Poulay,53160_a005,G,BOURG DE POULAY,
326439288,00019,32643928800019,O,,NN,,,,true,1,,,,,LE BOURG,53640,MONTREUIL-POULAY,,,53160,,,,,,,,,,,,,,,,,,,1987-04-27,F,,,,,01.50,NAP,N,2.212915,47.9910304,0.9,poi.bar,Le Bourg (Bar) Ingrannes,https://osm.org/node/1718543174,G,,
326500279,00012,32650027900012,O,,,,,,true,1,,,,,LA CHESNAIE,53640,MONTREUIL-POULAY,,,53160,,,,,,,,,,,,,,,,,,,1984-12-25,F,,,,,62.45,NAP,N,2.2770005,48.9953985,0.9,poi.park,La Chesnaie (Parc) Eaubonne,https://osm.org/way/147588016,G,,
327415592,00010,32741559200010,O,,NN,,,,true,1,,,,LD,BOURG,53640,MONTREUIL-POULAY,,,53160,,,,,,,,,,,,,,,,,,,,F,,,,,87.06,NAP,N,-0.519496,48.37721,0.9,street,Bourg de Poulay 53640 Montreuil-Poulay,53160_a005,G,BOURG DE POULAY,
327649638,00019,32764963800019,O,1983-02-17,NN,,,,true,3,,,,LD,LA ROUSSARDIERE,53640,MONTREUIL-POULAY,,,53160,,,,,,,,,,,,,,,,,,,1998-12-25,F,,,,,70.2A,NAF1993,N,0.5555732,47.9137736,0.89,poi.track,Chemin du Parc à la Roussardière Tresson,https://osm.org/way/251553714,G,,
327794103,00017,32779410300017,O,1983-07-01,NN,,,2008-01-04T19:31:52,true,3,,,,LD,LE VIEUX GAST,53640,MONTREUIL-POULAY,,,53160,,,,,,,,,,,,,,,,,,,2008-01-01,A,,,,,01.46Z,NAFRev2,N,-0.556069,48.376778,0.93,locality,Le Vieux Gast 53640 Montreuil-Poulay,53160_c104,G,LE VIEUX GAST,
328977491,00013,32897749100013,O,,NN,,,,true,1,,,,,BOURG,53640,MONTREUIL-POULAY,,,53160,,,,,,,,,,,,,,,,,,,1993-12-25,F,,,,,01.1A,NAF1993,N,-0.519496,48.37721,0.9,street,Bourg de Poulay 53640 Montreuil-Poulay,53160_a005,G,BOURG DE POULAY,
329685614,00011,32968561400011,O,1984-05-01,NN,,,2006-10-27T01:57:18,true,3,,,,LD,LA HOUDOULIERE,53640,MONTREUIL-POULAY,,,53160,,,,,,,,,,,,,,,,,,,2004-08-11,F,,,,,01.3Z,NAFRev1,N,-0.5119609,48.3759391,0.89,poi.stream,Ruiseau de la Houdoulière (Ruisseau) Champéon,https://osm.org/way/314831993,G,,
331371641,00019,33137164100019,O,,NN,,,,true,1,,,,LD,PESSAY,53640,MONTREUIL-POULAY,,,53160,,,,,,,,,,,,,,,,,,,1993-12-25,F,,,,,01.3Z,NAF1993,N,6.6267235,46.3570707,0.88,poi.wood,Bois de Pessay (Forêt) Saint-Paul-en-Chablais,https://osm.org/way/446892062,G,,
332016674,00019,33201667400019,O,1985-01-01,NN,,,2007-01-18T09:20:06,true,3,,,,,LE VIEUX GAST,53640,MONTREUIL-POULAY,,,53160,,,,,,,,,,,,,,,,,,,1998-12-25,F,,,,,01.2A,NAF1993,N,-0.556069,48.376778,0.93,locality,Le Vieux Gast 53640 Montreuil-Poulay,53160_c104,G,LE VIEUX GAST,
332016682,00012,33201668200012,O,1985-01-01,NN,,,2006-10-27T02:16:53,true,3,,,,,LES MOUSSAYS,53640,MONTREUIL-POULAY,,,53160,,,,,,,,,,,,,,,,,,,2006-01-31,F,,,,,01.2A,NAFRev1,N,-0.528106,48.398614,0.43,locality,Les Petits Bois 53640 Montreuil-Poulay,53160_b734,G,LES PETITS BOIS,
332016690,00015,33201669000015,O,1985-01-01,NN,,,2007-01-18T09:20:06,true,3,,,,,LE BOIS DU FEU,53640,MONTREUIL-POULAY,,,53160,,,,,,,,,,,,,,,,,,,1998-12-25,F,,,,,01.2A,NAF1993,N,-0.507809,48.381324,0.93,locality,Le Bois du Feu 53640 Montreuil-Poulay,53160_b039,G,LE BOIS DU FEU,
333125607,00023,33312560700023,O,1999-07-23,NN,,,2015-03-27T03:49:02,true,4,,,,,LA PETITE BENETOUZE,53640,MONTREUIL-POULAY,,,53160,,,,,,,,,,,,,,,,,,,2014-12-31,F,,,,,01.49Z,NAFRev2,N,-0.538712,48.380177,0.67,street,Le Petit Benetouze 53640 Montreuil-Poulay,53160_b660,G,LE PETIT BENETOUZE,
334072774,00014,33407277400014,O,1985-11-01,NN,,,2017-12-22T04:01:07,true,4,,,,,LE BOIS DU FEU,53640,MONTREUIL-POULAY,,,53160,,,,,,,,,,,,,,,,,,,2017-10-31,F,,,,,01.41Z,NAFRev2,N,-0.507809,48.381324,0.93,locality,Le Bois du Feu 53640 Montreuil-Poulay,53160_b039,G,LE BOIS DU FEU,
334309598,00012,33430959800012,O,1986-01-01,NN,,,2008-01-04T20:49:25,true,3,,,,,LE BAS HOUSSEAU,53640,MONTREUIL-POULAY,,,53160,,,,,,,,,,,,,,,,,,,2008-01-01,A,,,,,01.42Z,NAFRev2,N,,,0,,,,,,
334359940,00015,33435994000015,O,,NN,,,,true,1,,,,,BOURG,53640,MONTREUIL-POULAY,,,53160,,,,,,,,,,,,,,,,,,,1990-12-31,F,,,,,49.05,NAP,N,-0.519496,48.37721,0.9,street,Bourg de Poulay 53640 Montreuil-Poulay,53160_a005,G,BOURG DE POULAY,
334420262,00019,33442026200019,O,,NN,,,,true,1,,,,,BOURG,53640,MONTREUIL-POULAY,,,53160,,,,,,,,,,,,,,,,,,,1985-10-23,F,,,,,01.3Z,NAF1993,N,-0.519496,48.37721,0.9,street,Bourg de Poulay 53640 Montreuil-Poulay,53160_a005,G,BOURG DE POULAY,
334526738,00011,33452673800011,O,1900-01-01,NN,,,2011-04-28T00:29:11,false,3,,,,,LA GESTIERE,53640,MONTREUIL-POULAY,,,53160,,,,,,,,,,,,,,,,,,,1993-12-25,F,,,,,01.2A,NAF1993,N,-0.560437,48.373934,0.33,locality,Le Champ de la Gautrie 53640 Montreuil-Poulay,53160_b123,G,LE CHAMP DE LA GAUTRIE,
334700093,00019,33470009300019,O,,NN,,,,true,1,,,,,BOURG,53640,MONTREUIL-POULAY,,,53160,,,,,,,,,,,,,,,,,,,1993-12-31,F,,,,,52.1B,NAF1993,N,-0.519496,48.37721,0.9,street,Bourg de Poulay 53640 Montreuil-Poulay,53160_a005,G,BOURG DE POULAY,
338584105,00013,33858410500013,O,1986-04-23,01,2018,,2020-08-25T10:38:05,true,3,,,,,LE PERRAY,53640,MONTREUIL-POULAY,,,53160,,,,,,,,,,,,,,,,,,,2008-01-01,A,,,,,01.41Z,NAFRev2,N,1.8565571,48.6932024,0.89,poi.station,Le Perray-en-Yvelines (Gare ferroviaire) Le Perray-en-Yvelines,https://osm.org/node/2471820348,G,,
338584105,00021,33858410500021,O,2013-09-01,,,,2021-02-23T10:55:04,false,1,,,,,LE PERRAY,53640,MONTREUIL-POULAY,,,53160,,,,,,,,,,,,,,,,,,,2013-09-01,A,,,,,35.11Z,NAFRev2,N,1.8565571,48.6932024,0.89,poi.station,Le Perray-en-Yvelines (Gare ferroviaire) Le Perray-en-Yvelines,https://osm.org/node/2471820348,G,,
339611154,00016,33961115400016,O,1986-12-13,NN,,,2008-11-07T00:59:22,true,3,,,,,BOURG,53640,MONTREUIL-POULAY,,,53160,,,,,,,,,,,,,,,,,,,1995-04-05,F,,,,,52.2C,NAF1993,N,-0.519496,48.37721,0.9,street,Bourg de Poulay 53640 Montreuil-Poulay,53160_a005,G,BOURG DE POULAY,
342672433,00014,34267243300014,O,1987-05-01,NN,,,2007-01-18T09:24:30,true,3,,,,,L'AULNAY VIROLET,53640,MONTREUIL-POULAY,,,53160,,,,,,,,,,,,,,,,,,,1998-12-25,F,,,,,01.3Z,NAF1993,N,-0.563585,48.37049,0.63,locality,Launay Virolet 53640 Montreuil-Poulay,53160_b597,G,LAUNAY VIROLET,
342793692,00126,34279369200126,O,2004-03-01,03,2018,,2020-08-25T10:40:51,false,3,,,,,LES HOUSSEAUX,53640,MONTREUIL-POULAY,,,53160,,,,,,,,,,,,,,,,,,,2008-01-01,A,,,,,08.12Z,NAFRev2,O,-0.5242551,48.470656,0.7,poi.cemetery,Cimetière du Housseau-Brétignolles Le Housseau-Brétignolles,https://osm.org/way/370902468,G,,
343022471,00019,34302247100019,O,,NN,,,,true,1,,,,,LA BROSSE,53640,MONTREUIL-POULAY,,,53160,,,,,,,,,,,,,,,,,,,1992-07-31,F,,,,,45.2V,NAF1993,N,6.9331714,47.7315035,0.9,poi.peak,La Brosse (Pic) Étueffont,https://osm.org/node/5427839525,G,,
344474218,00023,34447421800023,O,2001-06-13,NN,,,2007-10-25T14:30:11,true,3,LES MEZIERES,,,,POULAY,53640,MONTREUIL-POULAY,,,53160,,,,,,,,,,,,,,,,,,,2005-12-31,F,,,,,71.3A,NAFRev1,N,-0.519545,48.377169,0.93,street,Poulay 53640 Montreuil-Poulay,53160_phtu6v,G,POULAY,
350657011,00028,35065701100028,O,2016-02-18,,,,2021-05-29T03:41:14,true,1,,,,LD,PERRAY,53640,MONTREUIL-POULAY,,,53160,,,,,,,,,,,,,,,,,,,2016-02-18,A,,,,,01.61Z,NAFRev2,N,2.3132166,48.6602658,0.89,poi.hospital,Hôpital du Perray Épinay-sur-Orge,https://osm.org/way/155812572,G,,
352906077,00016,35290607700016,O,1990-01-01,NN,,1610AQ,2015-03-17T00:31:04,true,3,,,,,LE PETIT BENETOUZE,53640,MONTREUIL-POULAY,,,53160,,,,,,,,,,,,,,,,,,,2008-01-01,A,,,,,16.10A,NAFRev2,N,-0.538712,48.380177,0.93,street,Le Petit Benetouze 53640 Montreuil-Poulay,53160_b660,G,LE PETIT BENETOUZE,
379640527,00014,37964052700014,O,1990-07-01,NN,,,2007-06-22T14:22:36,true,3,,,,,LE BOIS DU FEU,53640,MONTREUIL-POULAY,,,53160,,,,,,,,,,,,,,,,,,,2005-01-31,F,,,,,01.2A,NAFRev1,N,-0.507809,48.381324,0.93,locality,Le Bois du Feu 53640 Montreuil-Poulay,53160_b039,G,LE BOIS DU FEU,
381880186,00014,38188018600014,O,1991-04-01,NN,,,2011-04-23T07:28:06,true,4,,,,,LA COCHERIE,53640,MONTREUIL-POULAY,,,53160,,,,,,,,,,,,,,,,,,,2010-04-26,F,,,,,01.41Z,NAFRev2,N,-0.524014,48.379071,0.47,street,La Richeraie 53640 Montreuil-Poulay,53160_fwxs3s,G,LA RICHERAIE,
384178778,00013,38417877800013,O,1992-01-01,NN,,,2008-01-04T22:34:55,true,3,,,,,LA GAUTRIE,53640,MONTREUIL-POULAY,,,53160,,,,,,,,,,,,,,,,,,,2008-01-01,A,,,,,01.41Z,NAFRev2,N,-0.560437,48.373934,0.91,locality,Le Champ de la Gautrie 53640 Montreuil-Poulay,53160_b123,G,LE CHAMP DE LA GAUTRIE,
384752093,00029,38475209300029,O,2001-01-01,NN,,,2009-03-02T03:47:24,false,3,,,,,LA PERDRIERE,53640,MONTREUIL-POULAY,,,53160,,,,,,,,,,,,,,,,,,,2008-01-01,F,,,,,90.03B,NAFRev2,N,2.9592248,50.6467415,0.89,poi.bus_stop,La Perdrière (Arrêt de bus) Capinghem,https://osm.org/node/3113151394,G,,
388365298,00016,38836529800016,O,1992-07-01,NN,,,2008-06-06T09:10:57,false,4,,,,,LES CHAMPS,53640,MONTREUIL-POULAY,,,53160,,,,,,,,,,,,,,,,,,,2008-03-31,F,,,,,01.45Z,NAFRev2,N,4.7661348,46.9053155,0.89,poi.track,Chemin sur les Champs Chagny,https://osm.org/way/206875587,G,,
391544533,00014,39154453300014,O,1993-05-01,NN,,,2016-04-26T02:50:15,true,3,,,,,POULAY,53640,MONTREUIL-POULAY,,,53160,,,,,,,,,,,,,,,,,,,2008-01-01,A,,,,,01.61Z,NAFRev2,N,-0.519545,48.377169,0.93,street,Poulay 53640 Montreuil-Poulay,53160_phtu6v,G,POULAY,
392311593,00017,39231159300017,O,1993-08-26,NN,,,2006-11-25T12:11:37,true,4,,,,,LE VIEUX PRESBYTERE,53640,MONTREUIL-POULAY,,,53160,,,,,,,,,,,,,,,,,,,2005-03-31,F,,,,,74.8F,NAFRev1,N,-0.1292194,44.9307714,0.9,poi.restaurant,Le Vieux Presbytère (Restaurant) Montagne,https://osm.org/way/438823553,G,,
394290753,00018,39429075300018,O,1994-04-02,NN,,,,true,1,,,,,LE PRESBYTERE,53640,MONTREUIL-POULAY,,,53160,,,,,,,,,,,,,,,,,,,2001-09-30,F,,,,,55.3A,NAF1993,O,-0.515976,48.374973,0.92,locality,Le Petit Presbytere 53640 Montreuil-Poulay,53160_b702,G,LE PETIT PRESBYTERE,
394595334,00019,39459533400019,O,1994-03-01,NN,,,2017-05-04T04:17:49,true,3,,,,,LE VIEUX GAST,53640,MONTREUIL-POULAY,,,53160,,,,,,,,,,,,,,,,,,,2008-01-01,A,,,,,01.41Z,NAFRev2,N,-0.556069,48.376778,0.93,locality,Le Vieux Gast 53640 Montreuil-Poulay,53160_c104,G,LE VIEUX GAST,
394779342,00010,39477934200010,O,1994-03-01,NN,,,2006-10-28T02:13:54,true,3,,,,,LE PERRAY,53640,MONTREUIL-POULAY,,,53160,,,,,,,,,,,,,,,,,,,2004-04-30,F,,,,,01.3Z,NAFRev1,N,1.8565571,48.6932024,0.89,poi.station,Le Perray-en-Yvelines (Gare ferroviaire) Le Perray-en-Yvelines,https://osm.org/node/2471820348,G,,
394789739,00023,39478973900023,O,2011-01-01,NN,,,2021-02-23T11:20:34,true,2,,,,,LA JOLIVERE,53640,MONTREUIL-POULAY,,,53160,,,,,,,,,,,,,,,,,,,2014-12-31,A,,,,,01.41Z,NAFRev2,O,-0.541082,48.369705,0.33,locality,La Croix du Louvre 53640 Montreuil-Poulay,53160_b338,G,LA CROIX DU LOUVRE,
395209828,00015,39520982800015,O,1994-04-02,NN,,,2006-11-25T12:27:55,true,1,,,,,LE PRESBYTERE,53640,MONTREUIL-POULAY,,,53160,,,,,,,,,,,,,,,,,,,1999-03-08,F,,,,,74.1J,NAF1993,N,-0.515976,48.374973,0.92,locality,Le Petit Presbytere 53640 Montreuil-Poulay,53160_b702,G,LE PETIT PRESBYTERE,
397496977,00018,39749697700018,O,1994-04-01,01,2018,,2021-02-23T11:21:15,true,3,,,,,LAUNAY VIROLET,53640,MONTREUIL-POULAY,,,53160,,,,,,,,,,,,,,,,,,,2008-01-01,A,,,,,01.41Z,NAFRev2,N,-0.563585,48.37049,0.93,locality,Launay Virolet 53640 Montreuil-Poulay,53160_b597,G,LAUNAY VIROLET,
399420579,00019,39942057900019,O,1993-01-01,NN,,,2006-10-28T02:42:32,true,3,,,,,LE VIEIL HETRE,53640,MONTREUIL-POULAY,,,53160,,,,,,,,,,,,,,,,,,,2006-09-30,F,,,,,01.2A,NAFRev1,N,-0.511071,48.391285,0.93,locality,Le Vieil Hetre 53640 Montreuil-Poulay,53160_c099,G,LE VIEIL HETRE,
399504430,00014,39950443000014,O,1995-01-01,NN,,,2017-05-04T04:50:00,true,4,,,,,LA CROIX DU LOUVRE,53640,MONTREUIL-POULAY,,,53160,,,,,,,,,,,,,,,,,,,2012-12-31,A,,,,,01.41Z,NAFRev2,O,-0.541082,48.369705,0.93,locality,La Croix du Louvre 53640 Montreuil-Poulay,53160_b338,G,LA CROIX DU LOUVRE,
400996997,00013,40099699700013,O,1995-04-26,NN,,,2008-11-08T01:10:26,false,4,,,,,LA JOLIVIERE,53640,MONTREUIL-POULAY,,,53160,,,,,,,,,,,,,,,,,,,1999-12-31,F,,,,,45.4C,NAF1993,O,-1.1151235,46.7343795,0.89,poi.track,Chemin Rural de la Jolivière Sainte-Cécile,https://osm.org/way/119197462,G,,
405248758,00014,40524875800014,O,,,,,,true,1,,,,,LES LANDES,53640,MONTREUIL-POULAY,,,53160,,,,,,,,,,,,,,,,,,,1997-05-31,F,,,,,01.1A,NAF1993,N,-0.550635,48.368416,0.74,locality,L'Aunay des Landes 53640 Montreuil-Poulay,53160_b016,G,L AUNAY DES LANDES,
407572155,00015,40757215500015,O,1972-01-01,NN,,,2011-09-26T10:17:55,true,3,,,,,LA FOUILLARDIERE,53640,MONTREUIL-POULAY,,,53160,,,,,,,,,,,,,,,,,,,2005-05-31,F,,,,,01.3Z,NAFRev1,N,-0.523743,48.382546,0.35,street,Rue de la Fontaine 53640 Montreuil-Poulay,53160_0035,G,RUE DE LA FONTAINE,
407572163,00019,40757216300019,O,1981-04-01,NN,,,2006-10-28T03:29:01,true,3,,,,,BENETOUZE,53640,MONTREUIL-POULAY,,,53160,,,,,,,,,,,,,,,,,,,2004-03-31,F,,,,,01.2A,NAFRev1,N,-0.539649,48.378514,0.91,locality,Le Grand Benetouze 53640 Montreuil-Poulay,53160_b431,G,LE GRAND BENETOUZE,
407572189,00014,40757218900014,O,1977-01-01,NN,,,2007-05-06T05:44:33,true,3,,,,,LA PATRIE POULAY,53640,MONTREUIL-POULAY,,,53160,,,,,,,,,,,,,,,,,,,2007-03-31,F,,,,,01.2A,NAFRev1,N,-0.560437,48.373934,0.66,locality,Le Champ de la Gautrie 53640 Montreuil-Poulay,53160_b123,G,LE CHAMP DE LA GAUTRIE,
407572205,00018,40757220500018,O,1977-12-01,NN,,,2006-10-28T03:29:01,true,3,,,,,LA JOLIVIERE,53640,MONTREUIL-POULAY,,,53160,,,,,,,,,,,,,,,,,,,2004-03-31,F,,,,,01.3Z,NAFRev1,N,-1.1151235,46.7343795,0.89,poi.track,Chemin Rural de la Jolivière Sainte-Cécile,https://osm.org/way/119197462,G,,
407573195,00010,40757319500010,O,1991-04-01,NN,,,,true,3,,,,,LA COCHERIE,53640,MONTREUIL-POULAY,,,53160,,,,,,,,,,,,,,,,,,,2001-03-30,F,,,,,70.2B,NAF1993,N,-0.524014,48.379071,0.47,street,La Richeraie 53640 Montreuil-Poulay,53160_fwxs3s,G,LA RICHERAIE,
409835709,00018,40983570900018,O,1978-01-01,NN,,,,true,1,,,,,LA GUENERIE,53640,MONTREUIL-POULAY,,,53160,,,,,,,,,,,,,,,,,,,1998-04-22,F,,,,,01.1A,NAF1993,N,-0.560437,48.373934,0.47,locality,Le Champ de la Gautrie 53640 Montreuil-Poulay,53160_b123,G,LE CHAMP DE LA GAUTRIE,
409835717,00011,40983571700011,O,1988-12-31,NN,,,2012-07-28T14:36:24,true,4,,,,,LA QUOQUELINIERE,53640,MONTREUIL-POULAY,,,53160,,,,,,,,,,,,,,,,,,,2008-12-25,F,,,,,01.43Z,NAFRev2,N,,,0,,,,,,
409835725,00014,40983572500014,O,1988-12-31,NN,,,2008-01-04T21:32:34,true,3,,,,,LE VIEUX GAST,53640,MONTREUIL-POULAY,,,53160,,,,,,,,,,,,,,,,,,,2008-01-01,A,,,,,01.41Z,NAFRev2,N,-0.556069,48.376778,0.93,locality,Le Vieux Gast 53640 Montreuil-Poulay,53160_c104,G,LE VIEUX GAST,
411058225,00011,41105822500011,O,1978-01-01,NN,,,,true,1,,,,,LA GRESILLLERE,53640,MONTREUIL-POULAY,,,53160,,,,,,,,,,,,,,,,,,,2000-12-31,F,,,,,01.2A,NAF1993,N,-1.245186,48.5120517,0.83,poi.stream,Ruisseau de la Grésillère Saint-Georges-de-Reintembault,https://osm.org/way/498854768,G,,
411058233,00015,41105823300015,O,1984-12-31,NN,,,,true,1,,,,,,53640,MONTREUIL-POULAY,,,53160,,,,,,,,,,,,,,,,,,,1997-03-15,F,,,,,01.1A,NAF1993,N,,,0,,,,,,
411058241,00018,41105824100018,O,1987-12-31,NN,,,,true,4,,,,,LE VIEIL HETRE,53640,MONTREUIL-POULAY,,,53160,,,,,,,,,,,,,,,,,,,2001-12-31,F,,,,,01.1A,NAF1993,N,-0.511071,48.391285,0.93,locality,Le Vieil Hetre 53640 Montreuil-Poulay,53160_c099,G,LE VIEIL HETRE,
412774549,00015,41277454900015,O,1996-01-01,NN,,,2007-09-05T10:57:01,true,3,,,,,BOURG DE POULAY,53640,MONTREUIL-POULAY,,,53160,,,,,,,,,,,,,,,,,,,2005-07-31,F,,,,,92.4Z,NAFRev1,N,-0.519496,48.37721,0.93,street,Bourg de Poulay 53640 Montreuil-Poulay,53160_a005,G,BOURG DE POULAY,
413198029,00014,41319802900014,O,1997-08-01,,,,,true,1,,,,,BOURG,53640,MONTREUIL-POULAY,,,53160,,,,,,,,,,,,,,,,,,,1998-08-04,F,,,,,55.4B,NAF1993,N,-0.519496,48.37721,0.9,street,Bourg de Poulay 53640 Montreuil-Poulay,53160_a005,G,BOURG DE POULAY,
414150359,00050,41415035900050,O,2019-01-01,,,4333ZZ,2021-02-23T11:36:31,true,1,,,,,LES VARIES,53640,MONTREUIL-POULAY,,,53160,,,,,,,,,,,,,,,,,,,2019-01-01,A,,,,IDEES FIXES PARQUETS ET TRADITIONS,43.33Z,NAFRev2,N,-2.1706531,48.4067639,0.88,poi.residential,Les varies (Zone résidentielle) Trébédan,https://osm.org/way/402689695,G,,
414840884,00012,41484088400012,O,1997-01-01,NN,,,2008-01-04T22:54:58,true,3,,,,,LE BOIS DU FEU,53640,MONTREUIL-POULAY,,,53160,,,,,,,,,,,,,,,,,,,2008-01-01,A,,,,,01.42Z,NAFRev2,N,-0.507809,48.381324,0.93,locality,Le Bois du Feu 53640 Montreuil-Poulay,53160_b039,G,LE BOIS DU FEU,
415211523,00014,41521152300014,O,1997-06-01,NN,,,2008-01-04T23:00:53,true,3,,,,,LES LANDES,53640,MONTREUIL-POULAY,,,53160,,,,,,,,,,,,,,,,,,,2008-01-01,A,,,,,01.11Z,NAFRev2,N,-0.550635,48.368416,0.74,locality,L'Aunay des Landes 53640 Montreuil-Poulay,53160_b016,G,L AUNAY DES LANDES,