siren,nic,siret,statutDiffusionEtablissement,dateCreationEtablissement,trancheEffectifsEtablissement,anneeEffectifsEtablissement,activitePrincipaleRegistreMetiersEtablissement,dateDernierTraitementEtablissement,etablissementSiege,nombrePeriodesEtablissement,complementAdresseEtablissement,numeroVoieEtablissement,indiceRepetitionEtablissement,typeVoieEtablissement,libelleVoieEtablissement,codePostalEtablissement,libelleCommuneEtablissement,libelleCommuneEtrangerEtablissement,distributionSpecialeEtablissement,codeCommuneEtablissement,codeCedexEtablissement,libelleCedexEtablissement,codePaysEtrangerEtablissement,libellePaysEtrangerEtablissement,complementAdresse2Etablissement,numeroVoie2Etablissement,indiceRepetition2Etablissement,typeVoie2Etablissement,libelleVoie2Etablissement,codePostal2Etablissement,libelleCommune2Etablissement,libelleCommuneEtranger2Etablissement,distributionSpeciale2Etablissement,codeCommune2Etablissement,codeCedex2Etablissement,libelleCedex2Etablissement,codePaysEtranger2Etablissement,libellePaysEtranger2Etablissement,dateDebut,etatAdministratifEtablissement,enseigne1Etablissement,enseigne2Etablissement,enseigne3Etablissement,denominationUsuelleEtablissement,activitePrincipaleEtablissement,nomenclatureActivitePrincipaleEtablissement,caractereEmployeurEtablissement,longitude,latitude,geo_score,geo_type,geo_adresse,geo_id,geo_ligne,geo_l4,geo_l5
216208504,00011,21620850400011,O,1983-03-01,02,2018,,2020-08-25T10:18:21,true,4,,,,RUE,DE LA MAIRIE,62770,VIEIL-HESDIN,,,62850,,,,,,,,,,,,,,,,,,,2008-01-01,A,MAIRIE,,,,84.11Z,NAFRev2,O,2.098808,50.357003,0.93,street,Rue de la Mairie 62770 Vieil-Hesdin,62850_0056,G,RUE DE LA MAIRIE,
216208504,00029,21620850400029,O,1983-12-21,NN,,,2019-11-14T14:00:50,false,4,,,,RUE,DE LA MAIRIE,62770,VIEIL-HESDIN,,,62850,,,,,,,,,,,,,,,,,,,1997-12-31,F,ECOLE PRIMAIRE PUBLIQUE,,,,80.1Z,NAF1993,O,2.098808,50.357003,0.93,street,Rue de la Mairie 62770 Vieil-Hesdin,62850_0056,G,RUE DE LA MAIRIE,
266208503,00018,26620850300018,O,1983-03-01,NN,,,2019-11-14T14:00:50,true,4,,,,RUE,DE FREVENT,62770,VIEIL-HESDIN,,,62850,,,,,,,,,,,,,,,,,,,2016-01-01,F,CCAS,,,,88.99B,NAFRev2,N,2.095384,50.357701,0.75,street,Route de Frevent 62770 Vieil-Hesdin,62850_0020,G,ROUTE DE FREVENT,
296203896,00018,29620389600018,O,1994-10-27,NN,,,2019-11-14T14:00:50,true,3,MAIRIE,,,RUE,DE LA MAIRIE,62770,VIEIL-HESDIN,,,62850,,,,,,,,,,,,,,,,,,,2008-01-01,A,,,,,42.99Z,NAFRev2,O,2.098808,50.357003,0.93,street,Rue de la Mairie 62770 Vieil-Hesdin,62850_0056,G,RUE DE LA MAIRIE,
303609705,00015,30360970500015,O,1975-01-01,NN,,,2019-11-14T14:00:50,true,3,,22,,RUE,D HESDIN,62770,VIEIL-HESDIN,,,62850,,,,,,,,,,,,,,,,,,,1998-12-25,F,,,,,70.2C,NAF1993,N,2.095518,50.357929,0.93,housenumber,22 Rue d'Hesdin 62770 Vieil-Hesdin,62850_0034_00022,G,22 RUE D HESDIN,
306504200,00016,30650420000016,O,,,,,2019-11-14T14:00:50,true,1,,,,RTE,DE FREVENT,62770,VIEIL-HESDIN,,,62850,,,,,,,,,,,,,,,,,,,1997-12-31,F,,,,,93.0D,NAF1993,N,2.095384,50.357701,0.81,street,Route de Frevent 62770 Vieil-Hesdin,62850_0020,G,ROUTE DE FREVENT,
307266320,00026,30726632000026,O,,,,,2019-11-14T14:00:50,true,1,,,,,,62770,VIEIL-HESDIN,,,62850,,,,,,,,,,,,,,,,,,,1984-12-25,F,,,,,67.04,NAP,N,,,0,,,,,,
309699114,00018,30969911400018,O,,NN,,,2019-11-14T14:00:50,true,1,,31,,RUE,D'HESDIN,62770,VIEIL-HESDIN,,,62850,,,,,,,,,,,,,,,,,,,1995-09-15,F,,,,,55.4A,NAF1993,N,2.098223,50.356613,0.93,housenumber,31 Rue d'Hesdin 62770 Vieil-Hesdin,62850_0034_00031,G,31 RUE D HESDIN,
312591555,00015,31259155500015,O,,,,,2019-11-14T14:00:50,true,1,,,,,,62770,VIEIL-HESDIN,,,62850,,,,,,,,,,,,,,,,,,,1984-12-25,F,,,,,62.42,NAP,N,,,0,,,,,,
312834740,00010,31283474000010,O,,,,,2019-11-14T14:00:50,true,1,,,,,,62770,VIEIL-HESDIN,,,62850,,,,,,,,,,,,,,,,,,,1984-12-25,F,,,,,80.02,NAP,N,,,0,,,,,,
314591165,00019,31459116500019,O,1978-01-01,,,,2019-11-14T14:00:50,true,1,,,,,HARAS D'ESTRUVAL,62770,VIEIL-HESDIN,,,62850,,,,,,,,,,,,,,,,,,,1998-06-30,F,,,,,01.3Z,NAF1993,N,2.114502,50.375437,0.6,street,Ferme d'Estruval 62770 Vieil-Hesdin,62850_0019,G,FERME D ESTRUVAL,
316497395,00012,31649739500012,O,1963-01-01,NN,,4399CZ,2019-11-14T14:00:50,true,5,,,,RTE,DE FREVENT,62770,VIEIL-HESDIN,,,62850,,,,,,,,,,,,,,,,,,,2015-06-22,F,,,,,43.99C,NAFRev2,O,2.095384,50.357701,0.81,street,Route de Frevent 62770 Vieil-Hesdin,62850_0020,G,ROUTE DE FREVENT,
318093796,00031,31809379600031,O,2004-10-01,02,2018,,2021-02-24T09:15:23,true,9,,63,,RUE,D HESDIN,62770,VIEIL-HESDIN,,,62850,,,,,,,,,,,,,,,,,,,2021-02-01,A,,,,,69.10Z,NAFRev2,O,2.104779,50.354107,0.93,housenumber,63 Rue d'Hesdin 62770 Vieil-Hesdin,62850_0034_00063,G,63 RUE D HESDIN,
318237591,00017,31823759100017,O,1980-01-01,NN,,,2019-11-14T14:00:50,true,5,,43,,RUE,D'HESDIN,62770,VIEIL-HESDIN,,,62850,,,,,,,,,,,,,,,,,,,2009-12-01,F,,,,,41.20B,NAFRev2,N,2.100547,50.355649,0.93,housenumber,43 Rue d'Hesdin 62770 Vieil-Hesdin,62850_0034_00043,G,43 RUE D HESDIN,
318812351,00027,31881235100027,O,2006-11-26,,,,2020-03-05T19:36:05,false,3,,63,,RUE,D'HESDIN,62770,VIEIL-HESDIN,,,62850,,,,,,,,,,,,,,,,,,,2020-01-27,F,,,,,68.20B,NAFRev2,N,2.104779,50.354107,0.93,housenumber,63 Rue d'Hesdin 62770 Vieil-Hesdin,62850_0034_00063,G,63 RUE D HESDIN,
320856362,00027,32085636200027,O,,NN,,,2019-11-14T14:00:50,true,1,,,,RTE,DE FREVENT,62770,VIEIL-HESDIN,,,62850,,,,,,,,,,,,,,,,,,,1993-06-30,F,,,,,52.6D,NAF1993,N,2.095384,50.357701,0.81,street,Route de Frevent 62770 Vieil-Hesdin,62850_0020,G,ROUTE DE FREVENT,
323179390,00014,32317939000014,O,,,,,2019-11-14T14:00:50,true,1,,,,RTE,NATIONALE,62770,VIEIL-HESDIN,,,62850,,,,,,,,,,,,,,,,,,,1992-05-31,F,,,,,51.2E,NAF1993,N,1.2279812,49.230352,0.77,poi,Route Nationale (Pont) Saint-Pierre-du-Vauvray,https://osm.org/way/95838375,G,,
323187153,00016,32318715300016,O,,,,,2019-11-14T14:00:50,true,1,,,,RUE,BASSE,62770,VIEIL-HESDIN,,,62850,,,,,,,,,,,,,,,,,,,1984-12-25,F,,,,,69.12,NAP,N,2.095336,50.358338,0.93,street,Rue Basse 62770 Vieil-Hesdin,62850_0008,G,RUE BASSE,
326188836,00018,32618883600018,O,1983-01-03,NN,,,2019-11-14T14:00:50,true,1,,,,RTE,DE LE PARCQ,62770,VIEIL-HESDIN,,,62850,,,,,,,,,,,,,,,,,,,2002-12-31,F,,,,,29.3C,NAF1993,N,2.120964,50.38124,0.42,street,Route Departementale 339 62770 Vieil-Hesdin,62850_n5zzwj,G,ROUTE DEPARTEMENTALE 339,
328565064,00024,32856506400024,O,1992-01-01,NN,,,2019-11-14T14:00:50,true,3,,,,,,62770,VIEIL-HESDIN,,,62850,,,,,,,,,,,,,,,,,,,2008-01-01,A,,,,,68.20B,NAFRev2,N,,,0,,,,,,
329004725,00027,32900472500027,O,,NN,,,2019-11-14T14:00:50,true,1,,5,,RUE,SAINT ANTOINE,62770,VIEIL-HESDIN,,,62850,,,,,,,,,,,,,,,,,,,1990-11-23,F,,,,,69.12,NAP,N,2.093472,50.357276,0.93,housenumber,5 Rue de Saint Antoine 62770 Vieil-Hesdin,62850_0120_00005,G,5 RUE DE SAINT ANTOINE,
332997394,00017,33299739400017,O,,NN,,,2019-11-14T14:00:50,true,1,,20,,RUE,D'HESDIN,62770,VIEIL-HESDIN,,,62850,,,,,,,,,,,,,,,,,,,,F,,,,,55.60,NAP,N,2.095263,50.358012,0.93,housenumber,20 Rue d'Hesdin 62770 Vieil-Hesdin,62850_0034_00020,G,20 RUE D HESDIN,
333182616,00016,33318261600016,O,,,,,2019-11-14T14:00:50,true,1,,19,,RUE,DE ST QUENTIN,62770,VIEIL-HESDIN,,,62850,,,,,,,,,,,,,,,,,,,1988-06-01,F,,,,,55.73,NAP,N,2.106062,50.359752,0.71,housenumber,19 Rue Saint Quentin 62770 Vieil-Hesdin,62850_0125_00019,G,19 RUE SAINT QUENTIN,
333882868,00016,33388286800016,O,1985-10-01,NN,,8219ZP,2019-11-14T14:00:50,true,3,,36,,RUE,D HESDIN,62770,VIEIL-HESDIN,,,62850,,,,,,,,,,,,,,,,,,,2008-01-01,A,,,,,82.99Z,NAFRev2,N,2.097951,50.356676,0.93,housenumber,36 Rue d'Hesdin 62770 Vieil-Hesdin,62850_0034_00036,G,36 RUE D HESDIN,
339170672,00010,33917067200010,O,1900-01-01,NN,,,2019-11-14T14:00:50,false,3,,,,,,62770,VIEIL-HESDIN,,,62850,,,,,,,,,,,,,,,,,,,1992-09-04,F,,,,,01.1A,NAF1993,N,,,0,,,,,,
349539460,00015,34953946000015,O,1900-01-01,NN,,,2019-11-14T14:00:50,false,4,,7,,RUE,DE L EGLISE,62770,VIEIL-HESDIN,,,62850,,,,,,,,,,,,,,,,,,,1997-12-30,F,,,,,70.3A,NAF1993,N,2.102664,50.361577,0.93,housenumber,7 Rue de l'Eglise 62770 Vieil-Hesdin,62850_0018_00007,G,7 RUE DE L EGLISE,
349846519,00016,34984651900016,O,1988-11-01,NN,,,2019-11-14T14:00:50,true,5,,4,,,LE FORESTEL,62770,VIEIL-HESDIN,,,62850,,,,,,,,,,,,,,,,,,,2010-07-01,A,,,,,01.11Z,NAFRev2,N,2.104023,50.347677,0.93,housenumber,4 Le Forestel 62770 Vieil-Hesdin,62850_790rb2_00004,G,4 LE FORESTEL,
351727607,00027,35172760700027,O,,NN,,,2019-11-14T14:00:50,true,1,,19,,RUE,D HESDIN,62770,VIEIL-HESDIN,,,62850,,,,,,,,,,,,,,,,,,,1993-07-02,F,,,,,45.3A,NAF1993,N,2.096624,50.357558,0.93,housenumber,19 Rue d'Hesdin 62770 Vieil-Hesdin,62850_0034_00019,G,19 RUE D HESDIN,
353147218,00013,35314721800013,O,1990-01-15,03,2018,4399CZ,2021-07-21T10:27:30,true,6,,22,,RUE,D HESDIN,62770,VIEIL-HESDIN,,,62850,,,,,,,,,,,,,,,,,,,2021-04-27,F,,,,,43.99C,NAFRev2,N,2.095518,50.357929,0.93,housenumber,22 Rue d'Hesdin 62770 Vieil-Hesdin,62850_0034_00022,G,22 RUE D HESDIN,
378570238,00014,37857023800014,O,,NN,,,2019-11-14T14:00:50,true,1,,35,,RUE,DE ST QUENTIN,62770,VIEIL-HESDIN,,,62850,,,,,,,,,,,,,,,,,,,1990-08-28,F,,,,,62.46,NAP,N,2.109761,50.358784,0.71,housenumber,35 Rue Saint Quentin 62770 Vieil-Hesdin,62850_0125_00035,G,35 RUE SAINT QUENTIN,
380772236,00028,38077223600028,O,2003-03-03,NN,,,2019-11-14T14:00:50,true,3,,28,,RUE,D HESDIN,62770,VIEIL-HESDIN,,,62850,,,,,,,,,,,,,,,,,,,2008-01-01,A,,,,,86.90E,NAFRev2,N,2.096718,50.357402,0.93,housenumber,28 Rue d'Hesdin 62770 Vieil-Hesdin,62850_0034_00028,G,28 RUE D HESDIN,
382802809,00014,38280280900014,O,1991-07-27,NN,,,2019-11-14T14:00:50,true,3,,7,,RUE,DE L'EGLISE,62770,VIEIL-HESDIN,,,62850,,,,,,,,,,,,,,,,,,,2008-01-01,A,,,,,68.20B,NAFRev2,N,2.102664,50.361577,0.93,housenumber,7 Rue de l'Eglise 62770 Vieil-Hesdin,62850_0018_00007,G,7 RUE DE L EGLISE,
385261748,00011,38526174800011,O,1992-02-01,01,2018,,2020-08-25T10:22:25,true,5,,3,,,HEDAUVILLE,62770,VIEIL-HESDIN,,,62850,,,,,,,,,,,,,,,,,,,2010-07-01,A,,,,,01.11Z,NAFRev2,O,2.5686139,50.0455805,0.89,poi.townhall,Mairie d'Hédauville (Hôtel de ville) Hédauville,https://osm.org/way/296714654,G,,
389193210,00017,38919321000017,O,1992-11-17,NN,,,2019-11-14T14:00:50,false,4,,,,RTE,DE FREVENT,62770,VIEIL-HESDIN,,,62850,,,,,,,,,,,,,,,,,,,2015-12-27,F,,,,,68.20B,NAFRev2,N,2.095384,50.357701,0.81,street,Route de Frevent 62770 Vieil-Hesdin,62850_0020,G,ROUTE DE FREVENT,
389825068,00031,38982506800031,O,2011-09-07,,,4322AZ,2020-07-29T19:33:16,false,2,,19,,,RUE D'HESDIN,62770,VIEIL-HESDIN,,,62850,,,,,,,,,,,,,,,,,,,2020-06-30,F,ENERGIE 2000 GRAFF DIDIER,,,,43.22A,NAFRev2,N,2.096624,50.357558,0.93,housenumber,19 Rue d'Hesdin 62770 Vieil-Hesdin,62850_0034_00019,G,19 RUE D HESDIN,
390254688,00026,39025468800026,O,2004-01-01,NN,,,2021-02-23T11:16:10,true,3,,48,,RUE,DE ST QUENTIN,62770,VIEIL-HESDIN,,,62850,,,,,,,,,,,,,,,,,,,2008-01-01,A,,,,,01.50Z,NAFRev2,N,2.112093,50.357748,0.71,housenumber,48 Rue Saint Quentin 62770 Vieil-Hesdin,62850_0125_00048,G,48 RUE SAINT QUENTIN,
390312619,00021,39031261900021,O,1996-01-01,NN,,,2019-11-14T14:00:50,true,1,,74,,RUE,D'HESDIN,62770,VIEIL-HESDIN,,,62850,,,,,,,,,,,,,,,,,,,2001-03-09,F,,,,,60.2M,NAF1993,O,2.107895,50.352883,0.93,housenumber,74 Rue d'Hesdin 62770 Vieil-Hesdin,62850_0034_00074,G,74 RUE D HESDIN,
390634673,00011,39063467300011,O,1993-03-26,NN,,,2019-11-14T14:00:50,true,3,,,,,ESTRUVAL,62770,VIEIL-HESDIN,,,62850,,,,,,,,,,,,,,,,,,,2008-01-01,A,,,,,68.20A,NAFRev2,N,2.114502,50.375437,0.91,street,Ferme d'Estruval 62770 Vieil-Hesdin,62850_0019,G,FERME D ESTRUVAL,
391122991,00014,39112299100014,O,1993-04-01,NN,,,2021-06-23T11:56:50,true,4,LE FORESTEL,,,,LE FORESTEL,62770,VIEIL-HESDIN,,,62850,,,,,,,,,,,,,,,,,,,2020-11-16,F,,,,,01.11Z,NAFRev2,N,2.104023,50.347677,0.93,street,Le Forestel 62770 Vieil-Hesdin,62850_790rb2,G,LE FORESTEL,
391281938,00012,39128193800012,O,1993-04-30,NN,,,2019-11-14T14:00:50,true,5,,7,,RUE,DE L'EGLISE,62770,VIEIL-HESDIN,,,62850,,,,,,,,,,,,,,,,,,,2008-01-01,A,,,,,68.20B,NAFRev2,N,2.102664,50.361577,0.93,housenumber,7 Rue de l'Eglise 62770 Vieil-Hesdin,62850_0018_00007,G,7 RUE DE L EGLISE,
391282043,00010,39128204300010,O,1993-04-30,NN,,,2019-11-14T14:00:50,true,3,,7,,RUE,DE L'EGLISE,62770,VIEIL-HESDIN,,,62850,,,,,,,,,,,,,,,,,,,2008-01-01,A,,,,,68.20B,NAFRev2,N,2.102664,50.361577,0.93,housenumber,7 Rue de l'Eglise 62770 Vieil-Hesdin,62850_0018_00007,G,7 RUE DE L EGLISE,
392527222,00013,39252722200013,O,,NN,,,2019-11-14T14:00:50,true,1,,,,,FERME DE DAME ALIX,62770,VIEIL-HESDIN,,,62850,,,,,,,,,,,,,,,,,,,1996-12-31,F,,,,,01.1A,NAF1993,N,2.110931,50.368957,0.53,locality,Dame Allix 62770 Vieil-Hesdin,62850_b014,G,DAME ALLIX,
392528832,00018,39252883200018,O,1993-04-01,NN,,,2019-11-14T14:00:50,true,1,,,,,LE FORESTEL,62770,VIEIL-HESDIN,,,62850,,,,,,,,,,,,,,,,,,,2000-08-31,F,,,,,70.2B,NAF1993,N,2.104023,50.347677,0.93,street,Le Forestel 62770 Vieil-Hesdin,62850_790rb2,G,LE FORESTEL,
392678496,00010,39267849600010,O,1993-10-01,NN,,,2019-11-14T14:00:50,true,3,LA ROSERAIE,,,RTE,DE FREVENT,62770,VIEIL-HESDIN,,,62850,,,,,,,,,,,,,,,,,,,2008-01-01,A,,,,,68.20B,NAFRev2,N,2.095384,50.357701,0.81,street,Route de Frevent 62770 Vieil-Hesdin,62850_0020,G,ROUTE DE FREVENT,
393333422,00011,39333342200011,O,1993-11-27,NN,,,2019-11-14T14:00:50,true,3,,7,,RUE,DE L'EGLISE,62770,VIEIL-HESDIN,,,62850,,,,,,,,,,,,,,,,,,,2008-01-01,A,,,,,68.20B,NAFRev2,N,2.102664,50.361577,0.93,housenumber,7 Rue de l'Eglise 62770 Vieil-Hesdin,62850_0018_00007,G,7 RUE DE L EGLISE,
393333620,00010,39333362000010,O,1993-11-27,NN,,,2019-11-14T14:00:50,true,3,,7,,RUE,DE L'EGLISE,62770,VIEIL-HESDIN,,,62850,,,,,,,,,,,,,,,,,,,2008-01-01,A,,,,,68.20B,NAFRev2,N,2.102664,50.361577,0.93,housenumber,7 Rue de l'Eglise 62770 Vieil-Hesdin,62850_0018_00007,G,7 RUE DE L EGLISE,
394981724,00013,39498172400013,O,1994-05-01,NN,,,2019-11-14T14:00:50,true,5,,19,,RUE,D'HESDIN,62770,VIEIL-HESDIN,,,62850,,,,,,,,,,,,,,,,,,,2009-06-30,F,,,,,47.54Z,NAFRev2,O,2.096624,50.357558,0.93,housenumber,19 Rue d'Hesdin 62770 Vieil-Hesdin,62850_0034_00019,G,19 RUE D HESDIN,
395050719,00016,39505071900016,O,,,,,2019-11-14T14:00:50,true,1,,18,,RUE,DU PLACITON,62770,VIEIL-HESDIN,,,62850,,,,,,,,,,,,,,,,,,,1995-09-30,F,,,,,01.3Z,NAF1993,N,2.093998,50.363451,0.93,housenumber,18 Rue du Placiton 62770 Vieil-Hesdin,62850_0095_00018,G,18 RUE DU PLACITON,
398997890,00015,39899789000015,O,1994-11-01,NN,,,2020-10-23T14:35:46,true,4,,53,,RUE,D'HESDIN,62770,VIEIL-HESDIN,,,62850,,,,,,,,,,,,,,,,,,,2020-10-20,F,,,,,01.13Z,NAFRev2,N,2.102439,50.355262,0.93,housenumber,53 Rue d'Hesdin 62770 Vieil-Hesdin,62850_0034_00053,G,53 RUE D HESDIN,
399366558,00027,39936655800027,O,1994-12-01,NN,,,2019-11-14T14:00:50,false,3,,54,,RUE,D'HESDIN,62770,VIEIL-HESDIN,,,62850,,,,,,,,,,,,,,,,,,,2008-01-01,A,,,,,47.78C,NAFRev2,N,2.102304,50.355219,0.93,housenumber,54 Rue d'Hesdin 62770 Vieil-Hesdin,62850_0034_00054,G,54 RUE D HESDIN,
400815734,00019,40081573400019,O,1981-10-01,NN,,,2021-02-23T11:24:48,true,3,,37,,RUE,D'HESDIN,62770,VIEIL-HESDIN,,,62850,,,,,,,,,,,,,,,,,,,2008-01-01,A,,,,,01.50Z,NAFRev2,N,2.098887,50.356279,0.93,housenumber,37 Rue d'Hesdin 62770 Vieil-Hesdin,62850_0034_00037,G,37 RUE D HESDIN,
401353537,00012,40135353700012,O,,NN,,,2019-11-14T14:00:50,true,1,,55,,RUE,D'HESDIN,62770,VIEIL-HESDIN,,,62850,,,,,,,,,,,,,,,,,,,1994-09-30,F,,,,,01.3Z,NAF1993,N,2.102871,50.355048,0.93,housenumber,55 Rue d'Hesdin 62770 Vieil-Hesdin,62850_0034_00055,G,55 RUE D HESDIN,
401355649,00013,40135564900013,O,1994-10-01,NN,,,2019-11-14T14:00:50,true,1,,55,,RUE,D'HESDIN,62770,VIEIL-HESDIN,,,62850,,,,,,,,,,,,,,,,,,,2002-12-31,F,,,,,01.1A,NAF1993,N,2.102871,50.355048,0.93,housenumber,55 Rue d'Hesdin 62770 Vieil-Hesdin,62850_0034_00055,G,55 RUE D HESDIN,
402199020,00023,40219902000023,O,1997-08-27,NN,,,2019-11-14T14:00:50,true,3,,1,A,RUE,STE COLETTE,62770,VIEIL-HESDIN,,,62850,,,,,,,,,,,,,,,,,,,2008-01-01,A,,,,,68.20A,NAFRev2,N,2.099809,50.359359,0.73,housenumber,1 a Rue de Sainte Colette 62770 Vieil-Hesdin,62850_0123_00001_a,G,1 A RUE DE SAINTE COLETTE,
402756555,00015,40275655500015,O,1995-09-16,NN,,,2019-11-14T14:00:50,true,5,,31,,RUE,D'HESDIN,62770,VIEIL-HESDIN,,,62850,,,,,,,,,,,,,,,,,,,2017-07-30,F,,,,,56.30Z,NAFRev2,O,2.098223,50.356613,0.93,housenumber,31 Rue d'Hesdin 62770 Vieil-Hesdin,62850_0034_00031,G,31 RUE D HESDIN,
410575484,00010,41057548400010,O,1997-01-06,NN,,,2019-11-14T14:00:50,true,3,,19,,RTE,D'HESDIN,62770,VIEIL-HESDIN,,,62850,,,,,,,,,,,,,,,,,,,2008-01-01,A,,,,,68.20B,NAFRev2,N,2.096624,50.357558,0.76,housenumber,19 Rue d'Hesdin 62770 Vieil-Hesdin,62850_0034_00019,G,19 RUE D HESDIN,
411308794,00014,41130879400014,O,1997-01-01,02,2018,,2020-08-25T10:39:32,true,4,,,,,FERME DE ESTRUVAL,62770,VIEIL-HESDIN,,,62850,,,,,,,,,,,,,,,,,,,2012-12-31,A,,,,,01.11Z,NAFRev2,O,2.114502,50.375437,0.79,street,Ferme d'Estruval 62770 Vieil-Hesdin,62850_0019,G,FERME D ESTRUVAL,
415043884,00014,41504388400014,O,1997-12-01,NN,,,2019-11-14T14:00:50,true,3,,,,,LE FORESTEL,62770,VIEIL-HESDIN,,,62850,,,,,,,,,,,,,,,,,,,2001-12-31,F,,,,,70.2B,NAF1993,N,2.104023,50.347677,0.93,street,Le Forestel 62770 Vieil-Hesdin,62850_790rb2,G,LE FORESTEL,
419451174,00017,41945117400017,O,1998-07-01,03,2018,,2020-08-25T10:44:25,true,6,,,,,ESTRUVAL,62770,VIEIL-HESDIN,,,62850,,,,,,,,,,,,,,,,,,,2014-04-01,A,,,,,85.51Z,NAFRev2,O,2.114502,50.375437,0.91,street,Ferme d'Estruval 62770 Vieil-Hesdin,62850_0019,G,FERME D ESTRUVAL,
420493314,00017,42049331400017,O,1998-01-01,NN,,,2019-11-14T14:00:50,true,4,,31,,RUE,DE SAINT QUENTIN,62770,VIEIL-HESDIN,,,62850,,,,,,,,,,,,,,,,,,,2008-01-01,F,,,,,94.99Z,NAFRev2,N,2.108883,50.359177,0.83,housenumber,31 Rue Saint Quentin 62770 Vieil-Hesdin,62850_0125_00031,G,31 RUE SAINT QUENTIN,
423481159,00014,42348115900014,O,1999-08-01,,,,2019-11-14T14:00:50,true,1,,3,,RUE,STE COLETTE,62770,VIEIL-HESDIN,,,62850,,,,,,,,,,,,,,,,,,,1999-08-01,F,,,,,64.2B,NAF1993,N,2.098537,50.359798,0.82,housenumber,3 Rue de Sainte Colette 62770 Vieil-Hesdin,62850_0123_00003,G,3 RUE DE SAINTE COLETTE,
438450132,00024,43845013200024,O,2020-02-10,,,,2021-02-23T13:18:53,true,1,,18,,RUE,DE SAINT QUENTIN,62770,VIEIL-HESDIN,,,62850,,,,,,,,,,,,,,,,,,,2020-02-10,A,,,,SCI ROXANE,68.20B,NAFRev2,N,2.10574,50.359696,0.83,housenumber,18 Rue Saint Quentin 62770 Vieil-Hesdin,62850_0125_00018,G,18 RUE SAINT QUENTIN,
439639931,00013,43963993100013,O,2001-10-10,NN,,,2019-11-14T14:00:50,true,3,,,,,LE FORESTEL,62770,VIEIL-HESDIN,,,62850,,,,,,,,,,,,,,,,,,,2008-01-01,A,,,,,68.20A,NAFRev2,N,2.104023,50.347677,0.93,street,Le Forestel 62770 Vieil-Hesdin,62850_790rb2,G,LE FORESTEL,
439696436,00013,43969643600013,O,2001-09-01,01,2018,,2020-08-25T10:26:35,true,4,VIEIL HESDIN,,,,LE FORESTEL,62770,VIEIL-HESDIN,,,62850,,,,,,,,,,,,,,,,,,,2015-01-11,A,,,,,77.31Z,NAFRev2,O,2.104023,50.347677,0.93,street,Le Forestel 62770 Vieil-Hesdin,62850_790rb2,G,LE FORESTEL,
443175450,00073,44317545000073,O,2021-01-04,,,,2021-02-23T13:25:24,true,1,,5,,RUE,DE SAINT QUENTIN,62770,VIEIL-HESDIN,,,62850,,,,,,,,,,,,,,,,,,,2021-01-04,A,,,,MALTO CREA,74.10Z,NAFRev2,N,2.106662,50.359695,0.83,housenumber,5 Rue Saint Quentin 62770 Vieil-Hesdin,62850_0125_00005,G,5 RUE SAINT QUENTIN,
444033922,00014,44403392200014,O,2002-10-29,NN,,,2019-11-14T14:00:50,true,3,,28,,RUE,HESDIN,62770,VIEIL-HESDIN,,,62850,,,,,,,,,,,,,,,,,,,2008-01-01,A,,,,,68.20B,NAFRev2,N,2.096718,50.357402,0.87,housenumber,28 Rue d'Hesdin 62770 Vieil-Hesdin,62850_0034_00028,G,28 RUE D HESDIN,
448762708,00015,44876270800015,O,2003-06-02,NN,,,2019-11-14T14:00:50,false,3,,2,B,RUE,VACQUERIETTE,62770,VIEIL-HESDIN,,,62850,,,,,,,,,,,,,,,,,,,2003-12-25,F,,,,,45.2V,NAFRev1,O,2.09793,50.355584,0.84,housenumber,2 b Rue de Vacqueriette 62770 Vieil-Hesdin,62850_0128_00002_b,G,2 B RUE DE VACQUERIETTE,
449346113,00011,44934611300011,O,2003-06-01,01,2018,,2020-08-25T10:13:34,true,3,,,,,FERME D'ESTRUVAL,62770,VIEIL-HESDIN,,,62850,,,,,,,,,,,,,,,,,,,2008-01-01,A,,,,,01.61Z,NAFRev2,O,2.114502,50.375437,0.93,street,Ferme d'Estruval 62770 Vieil-Hesdin,62850_0019,G,FERME D ESTRUVAL,
451073472,00016,45107347200016,O,2003-11-18,NN,,,2019-11-14T14:00:50,true,3,,7,,RUE,DE L'EGLISE,62770,VIEIL-HESDIN,,,62850,,,,,,,,,,,,,,,,,,,2008-01-01,A,,,,,68.20A,NAFRev2,N,2.102664,50.361577,0.93,housenumber,7 Rue de l'Eglise 62770 Vieil-Hesdin,62850_0018_00007,G,7 RUE DE L EGLISE,
453696460,00022,45369646000022,O,2014-12-31,,,,2020-07-01T19:32:14,true,2,,3,,RUE,STE COLETTE,62770,VIEIL-HESDIN,,,62850,,,,,,,,,,,,,,,,,,,2018-12-31,F,,,,,68.20A,NAFRev2,N,2.098537,50.359798,0.82,housenumber,3 Rue de Sainte Colette 62770 Vieil-Hesdin,62850_0123_00003,G,3 RUE DE SAINTE COLETTE,
479319261,00018,47931926100018,O,2004-11-02,NN,,,2019-11-14T14:00:50,true,3,,2,B,RUE,DE VACQUERIETTE,62770,VIEIL-HESDIN,,,62850,,,,,,,,,,,,,,,,,,,2005-07-13,F,,,,,45.2V,NAFRev1,N,2.09793,50.355584,0.86,housenumber,2 b Rue de Vacqueriette 62770 Vieil-Hesdin,62850_0128_00002_b,G,2 B RUE DE VACQUERIETTE,
479606592,00018,47960659200018,O,2004-11-19,NN,,,2019-11-14T14:00:50,true,4,,57,,RUE,D HESDIN,62770,VIEIL-HESDIN,,,62850,,,,,,,,,,,,,,,,,,,2014-06-30,F,,,,,68.20A,NAFRev2,N,2.103474,50.354659,0.93,housenumber,57 Rue d'Hesdin 62770 Vieil-Hesdin,62850_0034_00057,G,57 RUE D HESDIN,
483043626,00017,48304362600017,O,2005-07-18,,,,2019-11-14T14:00:50,true,3,,8,,RUE,ST ANTOINE,62770,VIEIL-HESDIN,,,62850,,,,,,,,,,,,,,,,,,,2008-09-30,F,,,,,41.20A,NAFRev2,N,2.093904,50.357746,0.82,housenumber,8 Rue de Saint Antoine 62770 Vieil-Hesdin,62850_0120_00008,G,8 RUE DE SAINT ANTOINE,
488424037,00015,48842403700015,O,2006-02-01,NN,,,2019-11-14T14:00:50,true,2,,50,,RUE,DE SAINT QUENTIN,62770,VIEIL-HESDIN,,,62850,,,,,,,,,,,,,,,,,,,2007-08-31,F,,,,,02.0B,NAFRev1,N,2.113246,50.356413,0.83,housenumber,50 Rue Saint Quentin 62770 Vieil-Hesdin,62850_0125_00050,G,50 RUE SAINT QUENTIN,
489413005,00013,48941300500013,O,2006-04-01,,,,2019-11-14T14:00:50,true,3,,37,,RUE,D'HESDIN,62770,VIEIL-HESDIN,,,62850,,,,,,,,,,,,,,,,,,,2012-04-01,A,,,,,01.11Z,NAFRev2,N,2.098887,50.356279,0.93,housenumber,37 Rue d'Hesdin 62770 Vieil-Hesdin,62850_0034_00037,G,37 RUE D HESDIN,
510181035,00013,51018103500013,O,2009-01-29,,,,2019-11-14T14:00:50,true,1,,17,,RUE,DE SAINT QUENTIN,62770,VIEIL-HESDIN,,,62850,,,,,,,,,,,,,,,,,,,2009-01-29,A,,,,,70.10Z,NAFRev2,N,2.105696,50.359792,0.83,housenumber,17 Rue Saint Quentin 62770 Vieil-Hesdin,62850_0125_00017,G,17 RUE SAINT QUENTIN,
513646620,00015,51364662000015,O,2009-06-27,,,,2019-11-14T14:00:50,true,1,,2,,,A RUE DE HESDIN,62770,VIEIL-HESDIN,,,62850,,,,,,,,,,,,,,,,,,,2009-06-27,A,,,,,68.20B,NAFRev2,N,2.097865,50.355821,0.86,housenumber,2 a Rue de Vacqueriette 62770 Vieil-Hesdin,62850_0128_00002_a,G,2 A RUE DE VACQUERIETTE,
519542898,00019,51954289800019,O,2010-02-04,,,,2019-11-14T14:00:50,true,1,,1,,RUE,ST COLETTE,62770,VIEIL-HESDIN,,,62850,,,,,,,,,,,,,,,,,,,2010-02-04,A,,,,,81.30Z,NAFRev2,N,2.098852,50.359365,0.77,housenumber,1 Rue de Sainte Colette 62770 Vieil-Hesdin,62850_0123_00001,G,1 RUE DE SAINTE COLETTE,
523482289,00015,52348228900015,O,2010-07-05,,,,2019-11-14T14:00:50,false,2,,1,,,LIEU DIT HERAUVILLE,62770,VIEIL-HESDIN,,,62850,,,,,,,,,,,,,,,,,,,2017-09-09,F,,,,,86.90E,NAFRev2,N,2.118404,50.383162,0.85,housenumber,1 Ferme d'Herauville 62770 Vieil-Hesdin,62850_0030_00001,G,1 FERME D HERAUVILLE,
525116943,00016,52511694300016,O,2010-09-13,,,4312BA,2019-11-14T14:00:50,false,2,,23,A,RUE,D'HESDIN,62770,VIEIL-HESDIN,,,62850,,,,,,,,,,,,,,,,,,,2012-09-30,F,,,,,43.12A,NAFRev2,N,2.096989,50.357335,0.83,housenumber,23 a Rue d'Hesdin 62770 Vieil-Hesdin,62850_0034_00023_a,G,23 A RUE D HESDIN,
530172451,00011,53017245100011,O,2011-03-01,,,4333ZZ,2019-11-14T14:00:50,true,1,,11,,,RUE DE LA MAIRIE,62770,VIEIL-HESDIN,,,62850,,,,,,,,,,,,,,,,,,,2011-03-01,A,,,,,43.33Z,NAFRev2,N,2.099987,50.358731,0.93,housenumber,11 Rue de la Mairie 62770 Vieil-Hesdin,62850_0056_00011,G,11 RUE DE LA MAIRIE,
539063602,00012,53906360200012,O,2012-01-10,,,,2021-07-14T08:36:13,true,2,,37,,RUE,D'HESDIN,62770,VIEIL-HESDIN,,,62850,,,,,,,,,,,,,,,,,,,2020-12-31,F,,,,,43.12A,NAFRev2,N,2.098887,50.356279,0.93,housenumber,37 Rue d'Hesdin 62770 Vieil-Hesdin,62850_0034_00037,G,37 RUE D HESDIN,