siren,nic,siret,statutDiffusionEtablissement,dateCreationEtablissement,trancheEffectifsEtablissement,anneeEffectifsEtablissement,activitePrincipaleRegistreMetiersEtablissement,dateDernierTraitementEtablissement,etablissementSiege,nombrePeriodesEtablissement,complementAdresseEtablissement,numeroVoieEtablissement,indiceRepetitionEtablissement,typeVoieEtablissement,libelleVoieEtablissement,codePostalEtablissement,libelleCommuneEtablissement,libelleCommuneEtrangerEtablissement,distributionSpecialeEtablissement,codeCommuneEtablissement,codeCedexEtablissement,libelleCedexEtablissement,codePaysEtrangerEtablissement,libellePaysEtrangerEtablissement,complementAdresse2Etablissement,numeroVoie2Etablissement,indiceRepetition2Etablissement,typeVoie2Etablissement,libelleVoie2Etablissement,codePostal2Etablissement,libelleCommune2Etablissement,libelleCommuneEtranger2Etablissement,distributionSpeciale2Etablissement,codeCommune2Etablissement,codeCedex2Etablissement,libelleCedex2Etablissement,codePaysEtranger2Etablissement,libellePaysEtranger2Etablissement,dateDebut,etatAdministratifEtablissement,enseigne1Etablissement,enseigne2Etablissement,enseigne3Etablissement,denominationUsuelleEtablissement,activitePrincipaleEtablissement,nomenclatureActivitePrincipaleEtablissement,caractereEmployeurEtablissement,longitude,latitude,geo_score,geo_type,geo_adresse,geo_id,geo_ligne,geo_l4,geo_l5
216601856,00018,21660185600018,O,1983-03-01,03,2018,,2020-08-25T10:18:33,true,4,HOTEL DE VILLE,,,,,66130,SAINT-MICHEL-DE-LLOTES,,,66185,,,,,,,,,,,,,,,,,,,2008-01-01,A,MAIRIE,,,,84.11Z,NAFRev2,O,2.615504,42.655355,0.56,locality,Voie Communale Veinat d'En Llense 66130 Saint-Michel-de-Llotes,66185_5470,D,VOIE C VEINAT D EN LLENSE,
216601856,00026,21660185600026,O,2002-01-01,NN,,,2019-11-14T14:00:53,false,3,,,,,,66130,SAINT-MICHEL-DE-LLOTES,,,66185,,,,,,,,,,,,,,,,,,,2008-01-01,A,MUSEE DE L'AGRICULTURE CATALANE,,,,91.03Z,NAFRev2,N,,,0,,,,,,
266602028,00018,26660202800018,O,1995-12-25,,,,2019-11-14T14:00:53,true,3,,,,,MAIRIE,66130,SAINT-MICHEL-DE-LLOTES,,,66185,,,,,,,,,,,,,,,,,,,2016-01-01,F,CCAS,,,,88.99B,NAFRev2,N,2.624461,42.647122,0.37,street,Voie Communale Veinat de l'Aire 66130 Saint-Michel-de-Llotes,66185_0260,G,VOIE COMMUNALE VEINAT DE L AIRE,
296603111,00018,29660311100018,O,1983-09-14,NN,,,2019-11-14T14:00:53,true,4,,,,,HOTEL DE VILLE,66130,SAINT-MICHEL-DE-LLOTES,,,66185,,,,,,,,,,,,,,,,,,,2010-12-31,F,,,,,42.99Z,NAFRev2,N,2.615504,42.655355,0.56,locality,Voie Communale Veinat d'En Llense 66130 Saint-Michel-de-Llotes,66185_5470,G,VOIE C VEINAT D EN LLENSE,
304122054,00048,30412205400048,O,1985-09-01,NN,,,2019-11-14T14:00:53,true,3,,,,,,66130,SAINT-MICHEL-DE-LLOTES,,,66185,,,,,,,,,,,,,,,,,,,1994-12-15,F,,,,,45.3A,NAF1993,N,,,0,,,,,,
312476997,00019,31247699700019,O,,NN,,,2019-11-14T14:00:53,true,1,,,,,MAS D EN PAYROT,66130,SAINT-MICHEL-DE-LLOTES,,,66185,,,,,,,,,,,,,,,,,,,1993-12-31,F,,,,,55.4B,NAF1993,N,2.619366,42.637934,0.59,locality,Mas d'En Pere Miquel 66130 Saint-Michel-de-Llotes,66185_b019,G,MAS D EN PERE MIQUEL,
316641976,00063,31664197600063,O,2014-08-01,NN,,,2021-02-23T10:41:55,true,2,,3,,,VEINAT DEL SERRAT,66130,SAINT-MICHEL-DE-LLOTES,,,66185,,,,,,,,,,,,,,,,,,,2014-09-16,A,AURUM,,,,32.12Z,NAFRev2,N,2.619217,42.65506,0.93,housenumber,3 Veinat Del Serrat 66130 Saint-Michel-de-Llotes,66185_er02k5_00003,G,3 VEINAT DEL SERRAT,
323057505,00048,32305750500048,O,,,,,2019-11-14T14:00:53,true,1,,,,,VEINAT D'EN BLANC,66130,SAINT-MICHEL-DE-LLOTES,,,66185,,,,,,,,,,,,,,,,,,,1997-12-31,F,,,,,52.6E,NAF1993,N,2.621015,42.652973,0.93,street,Veinat d'En Blanc 66130 Saint-Michel-de-Llotes,66185_v5ui89,G,VEINAT D EN BLANC,
326239506,00016,32623950600016,O,,NN,,,2019-11-14T14:00:53,true,1,,,,RTE,DE BOULETERNERE,66130,SAINT-MICHEL-DE-LLOTES,,,66185,,,,,,,,,,,,,,,,,,,,F,,,,,66.02,NAP,N,2.622733,42.655835,0.84,street,Route de Bouleternere 66130 Saint-Michel-de-Llotes,66185_1270,G,ROUTE DE BOULETERNERE,
327551073,00049,32755107300049,O,2017-01-01,,,,2021-02-23T10:49:06,true,1,,,,,CAN GRAOU,66130,SAINT-MICHEL-DE-LLOTES,,,66185,,,,,,,,,,,,,,,,,,,2017-01-01,A,,,,,01.25Z,NAFRev2,N,,,0,,,,,,
329742084,00059,32974208400059,O,2009-07-01,NN,,1623ZZ,2019-11-14T14:00:53,true,7,,2,,,CAMI DE LA VALLTORTA,66130,SAINT-MICHEL-DE-LLOTES,,,66185,,,,,,,,,,,,,,,,,,,2018-06-30,F,ACANTHE MENUISERIE,,,,43.32A,NAFRev2,N,2.622384,42.650223,0.86,housenumber,2 Cami de la Valltorte 66130 Saint-Michel-de-Llotes,66185_8180_00002,G,2 CAMI DE LA VALLTORTE,
333461895,00042,33346189500042,O,2010-04-01,,,,2019-11-14T14:00:53,false,2,,1,,,MAS BLANC,66130,SAINT-MICHEL-DE-LLOTES,,,66185,,,,,,,,,,,,,,,,,,,2010-06-01,F,,,,,86.90F,NAFRev2,N,4.6579333,43.962819,0.89,poi.track,Chemin du Mas Blanc Domazan,https://osm.org/way/478516550,G,,
334629706,00394,33462970600394,O,2017-12-31,,,,2019-11-14T14:00:53,false,1,,,,LD,A L'HORT D'EN GILL,66130,SAINT-MICHEL-DE-LLOTES,,,66185,,,,,,,,,,,,,,,,,,,2017-12-31,A,,,,,46.21Z,NAFRev2,N,2.633384,42.663553,0.93,street,À l'Hort d'En Gill 66130 Saint-Michel-de-Llotes,66185_b011,G,A L HORT D EN GILL,
334678828,00024,33467882800024,O,1987-01-01,NN,,,2019-11-14T14:00:53,false,3,,,,,VOIE COMMUNALE VEINAT DE LA BALL,66130,SAINT-MICHEL-DE-LLOTES,,,66185,,,,,,,,,,,,,,,,,,,2008-01-01,A,,,,,90.03A,NAFRev2,N,2.621138,42.652212,0.9,street,Voie Communale Veinat de la Balltorte 66130 Saint-Michel-de-Llotes,66185_0815,G,VOIE C VEINAT DE LA BALLTORTE,
340352517,00015,34035251700015,O,1987-01-01,NN,,,2019-11-14T14:00:53,true,3,,,,,,66130,SAINT-MICHEL-DE-LLOTES,,,66185,,,,,,,,,,,,,,,,,,,1999-12-31,F,,,,,01.1F,NAF1993,N,,,0,,,,,,
341147544,00017,34114754400017,O,1987-03-31,01,2018,,2021-05-21T03:46:30,true,5,MAS DE LAS BASSES,,,RTE,DE BOULETERNERE,66130,SAINT-MICHEL-DE-LLOTES,,,66185,,,,,,,,,,,,,,,,,,,2021-02-28,F,,,,,47.78B,NAFRev2,O,2.622733,42.655835,0.84,street,Route de Bouleternere 66130 Saint-Michel-de-Llotes,66185_1270,G,ROUTE DE BOULETERNERE,
342189321,00017,34218932100017,O,,,,,2019-11-14T14:00:53,true,1,,,,LD,LE MASOT,66130,SAINT-MICHEL-DE-LLOTES,,,66185,,,,,,,,,,,,,,,,,,,1997-05-31,F,,,,,52.6D,NAF1993,N,2.619366,42.637934,0.4,locality,Mas d'En Pere Miquel 66130 Saint-Michel-de-Llotes,66185_b019,G,MAS D EN PERE MIQUEL,
347695405,00014,34769540500014,O,1988-08-01,NN,,,2019-11-14T14:00:53,false,5,EL VALL TORTA,,,,MAS CANTALLOSE,66130,SAINT-MICHEL-DE-LLOTES,,,66185,,,,,,,,,,,,,,,,,,,2008-01-01,F,,,,,90.03A,NAFRev2,N,2.624405,42.643522,0.34,street,Mas d'En Marc 66130 Saint-Michel-de-Llotes,66185_b017,G,MAS D EN MARC,
349423319,00012,34942331900012,O,1989-01-27,NN,,,2019-11-14T14:00:53,true,6,,,,,,66130,SAINT-MICHEL-DE-LLOTES,,,66185,,,,,,,,,,,,,,,,,,,2008-01-01,A,,,,,01.24Z,NAFRev2,N,,,0,,,,,,
352541957,00036,35254195700036,O,2011-12-01,,,,2019-11-14T14:00:53,true,2,ROUTE DE BOULTERNERE,3,,,VEINAT D'EN LLENSE,66130,SAINT-MICHEL-DE-LLOTES,,,66185,,,,,,,,,,,,,,,,,,,2012-08-31,F,MOTOS 66,,,,95.29Z,NAFRev2,N,2.615504,42.655355,0.83,locality,Voie Communale Veinat d'En Llense 66130 Saint-Michel-de-Llotes,66185_5470,G,VOIE C VEINAT D EN LLENSE,
353049745,00022,35304974500022,O,2018-12-17,,,,2021-02-23T11:05:25,true,1,,14,,,IMPASSE DES PINS,66130,SAINT-MICHEL-DE-LLOTES,,,66185,,,,,,,,,,,,,,,,,,,2018-12-17,A,,,,,68.20B,NAFRev2,N,2.623732,42.657848,0.93,housenumber,14 Impasse des Pins 66130 Saint-Michel-de-Llotes,66185_7570_00014,G,14 IMPASSE DES PINS,
377900329,00048,37790032900048,O,2007-04-10,,,9602BB,2021-02-23T11:06:41,true,3,,,,,VEINAT DEL SERRAT,66130,SAINT-MICHEL-DE-LLOTES,,,66185,,,,,,,,,,,,,,,,,,,2015-11-01,A,ESCALE DETENTE,,,,96.02B,NAFRev2,N,2.619217,42.65506,0.93,street,Veinat Del Serrat 66130 Saint-Michel-de-Llotes,66185_er02k5,G,VEINAT DEL SERRAT,
378582480,00026,37858248000026,O,1991-11-01,NN,,,2019-11-14T14:00:53,false,3,,,,,VEINAT D EN BLANC,66130,SAINT-MICHEL-DE-LLOTES,,,66185,,,,,,,,,,,,,,,,,,,2006-05-23,F,,,,,45.3A,NAFRev1,N,2.621015,42.652973,0.93,street,Veinat d'En Blanc 66130 Saint-Michel-de-Llotes,66185_v5ui89,G,VEINAT D EN BLANC,
383039013,00024,38303901300024,O,1997-06-30,,,,2019-11-14T14:00:53,false,3,,,,,VEINAT D'EN ROCH,66130,SAINT-MICHEL-DE-LLOTES,,,66185,,,,,,,,,,,,,,,,,,,2000-09-01,F,,,,,80.4D,NAF1993,N,2.62084,42.641733,0.66,street,Veïnat d'En Marsalet 66130 Saint-Michel-de-Llotes,66185_bq8reh,G,VEINAT D EN MARSALET,
384429551,00037,38442955100037,O,2014-03-01,,,,2021-02-23T11:12:36,true,1,,8,,,CARRER DEL REC,66130,SAINT-MICHEL-DE-LLOTES,,,66185,,,,,,,,,,,,,,,,,,,2014-03-01,A,,,,,43.31Z,NAFRev2,N,2.62354,42.65097,0.93,housenumber,8 Carrer Del Rec 66130 Saint-Michel-de-Llotes,66185_7600_00008,G,8 CARRER DEL REC,
387467194,00081,38746719400081,O,2002-10-01,NN,,,2019-11-14T14:00:53,false,4,,,,LD,A L'HORT D'EN GILL,66130,SAINT-MICHEL-DE-LLOTES,,,66185,,,,,,,,,,,,,,,,,,,2017-12-31,F,,,,,46.21Z,NAFRev2,O,2.633384,42.663553,0.93,street,À l'Hort d'En Gill 66130 Saint-Michel-de-Llotes,66185_b011,G,A L HORT D EN GILL,
388464133,00015,38846413300015,O,1992-08-06,NN,,,2019-11-14T14:00:53,true,3,,,,,MAS ARNAL,66130,SAINT-MICHEL-DE-LLOTES,,,66185,,,,,,,,,,,,,,,,,,,2008-01-01,A,,,,,68.20B,NAFRev2,N,2.623995,42.658968,0.38,street,Mas Martine 66130 Saint-Michel-de-Llotes,66185_8l193m,G,MAS MARTINE,
389267782,00024,38926778200024,O,2010-01-01,,,,2019-11-14T14:00:53,false,2,,,,LD,LAS BASSES,66130,SAINT-MICHEL-DE-LLOTES,,,66185,,,,,,,,,,,,,,,,,,,2010-05-01,F,L'ESTAMPILLE,,,,56.10C,NAFRev2,N,2.622111,42.658346,0.93,street,Las Basses 66130 Saint-Michel-de-Llotes,66185_w0i7a2,G,LAS BASSES,
390347615,00010,39034761500010,O,1993-02-01,NN,,,2019-11-14T14:00:53,true,6,L'HORT D'EN GIL,,,,TRAVERSE D ILLE,66130,SAINT-MICHEL-DE-LLOTES,,,66185,,,,,,,,,,,,,,,,,,,2010-12-31,A,,,,,01.24Z,NAFRev2,O,2.621073,42.657623,0.48,street,Route d'Ille 66130 Saint-Michel-de-Llotes,66185_4800,G,ROUTE D ILLE,
391885969,00017,39188596900017,O,1993-07-19,NN,,,2019-11-14T14:00:53,false,3,MAS PEQUIGNOT,,,PL,DE MONTORIOL,66130,SAINT-MICHEL-DE-LLOTES,,,66185,,,,,,,,,,,,,,,,,,,1995-06-01,F,,,,,74.1J,NAF1993,N,2.626791,42.653958,0.85,street,Pla de Montoriol 66130 Saint-Michel-de-Llotes,66185_b025,G,PLA DE MONTORIOL,
393424478,00013,39342447800013,O,1994-01-01,NN,,,2019-11-14T14:00:53,true,4,,,,LOT,LE PLEIN SOLEIL,66130,SAINT-MICHEL-DE-LLOTES,,,66185,,,,,,,,,,,,,,,,,,,2003-06-30,F,,,,,74.6Z,NAFRev1,O,6.6722367,46.3258666,0.76,poi.hotel,Hôtel-Restaurant Le Plein Soleil Vacheresse,https://osm.org/way/70089683,G,,
395219777,00012,39521977700012,O,1992-10-01,NN,,,2019-11-14T14:00:53,true,1,,,,LOT,PLEIN SOLEIL,66130,SAINT-MICHEL-DE-LLOTES,,,66185,,,,,,,,,,,,,,,,,,,2002-04-16,F,,,,,01.1F,NAF1993,N,2.623426,42.657111,0.86,street,Lotissement Plein Soleil 66130 Saint-Michel-de-Llotes,66185_a070,G,LOTISSEMENT PLEIN SOLEIL,
397671017,00036,39767101700036,O,2017-06-12,,,,2019-11-14T14:00:53,true,1,,10,,AV,DES ASPRES,66130,SAINT-MICHEL-DE-LLOTES,,,66185,,,,,,,,,,,,,,,,,,,2017-06-12,A,,,,,96.09Z,NAFRev2,N,2.622783,42.650117,0.82,housenumber,10 Avenue des Aspres 66130 Saint-Michel-de-Llotes,66185_0500_00010,G,10 AVENUE DES ASPRES,
398544296,00021,39854429600021,O,1994-09-01,NN,,,2019-11-14T14:00:53,false,4,MAS D EN PEYROT,,,RTE,SAINTE COLOMBE,66130,SAINT-MICHEL-DE-LLOTES,,,66185,,,,,,,,,,,,,,,,,,,2008-01-01,F,,,,,01.43Z,NAFRev2,N,2.626883,42.645032,0.83,street,Route de Sainte Colombe 66130 Saint-Michel-de-Llotes,66185_8000,G,ROUTE DE SAINTE COLOMBE,
400559522,00018,40055952200018,O,1995-04-01,NN,,,2019-11-14T14:00:53,true,6,,,,,QUARTIER DE L'ECOLE,66130,SAINT-MICHEL-DE-LLOTES,,,66185,,,,,,,,,,,,,,,,,,,2012-12-03,F,,,,,43.34Z,NAFRev2,N,5.1887465,44.2384893,0.83,poi.community_centre,Salle polyvalente de l'école (Salle des fêtes) Mollans-sur-Ouvèze,https://osm.org/node/3043075742,G,,
401360458,00012,40136045800012,O,1995-04-01,,,,2019-11-14T14:00:53,false,3,,,,,VEINAT LAS BASSES,66130,SAINT-MICHEL-DE-LLOTES,,,66185,,,,,,,,,,,,,,,,,,,2002-04-05,F,,,,,01.1F,NAF1993,N,2.62224,42.656111,0.88,street,Veinat de Las Basses 66130 Saint-Michel-de-Llotes,66185_u3zgv4,G,VEINAT DE LAS BASSES,
401360458,00020,40136045800020,O,2002-04-05,03,2018,,2021-02-23T11:25:20,true,3,,,,,VEINAT D'EN LLENSE,66130,SAINT-MICHEL-DE-LLOTES,,,66185,,,,,,,,,,,,,,,,,,,2008-01-01,A,,,,,01.24Z,NAFRev2,O,2.615504,42.655355,0.91,locality,Voie Communale Veinat d'En Llense 66130 Saint-Michel-de-Llotes,66185_5470,G,VOIE C VEINAT D EN LLENSE,
401505672,00014,40150567200014,O,1993-09-01,NN,,,2019-11-14T14:00:53,false,3,,,,,,66130,SAINT-MICHEL-DE-LLOTES,,,66185,,,,,,,,,,,,,,,,,,,2001-12-31,F,,,,,01.1F,NAF1993,N,,,0,,,,,,
408152981,00010,40815298100010,O,1996-06-29,NN,,,2019-11-14T14:00:53,true,3,,,,,MAIRIE,66130,SAINT-MICHEL-DE-LLOTES,,,66185,,,,,,,,,,,,,,,,,,,2008-01-01,A,,,,,90.02Z,NAFRev2,N,2.624461,42.647122,0.37,street,Voie Communale Veinat de l'Aire 66130 Saint-Michel-de-Llotes,66185_0260,G,VOIE COMMUNALE VEINAT DE L AIRE,
408188613,00033,40818861300033,O,2010-05-20,01,2018,4399CZ,2021-06-16T03:50:12,false,3,LIEU DIT LAS BASSES,5,,,CARRER DE LAS MOILLERES,66130,SAINT-MICHEL-DE-LLOTES,,,66185,,,,,,,,,,,,,,,,,,,2021-06-01,F,,,,,43.99C,NAFRev2,O,2.623913,42.645982,0.52,housenumber,5 Carrer de l'Esglesia 66130 Saint-Michel-de-Llotes,66185_3500_00005,G,5 CARRER DE L ESGLESIA,
411939390,00018,41193939000018,O,1987-12-31,NN,,,2019-11-14T14:00:53,true,3,,,,,,66130,SAINT-MICHEL-DE-LLOTES,,,66185,,,,,,,,,,,,,,,,,,,2008-01-01,A,,,,,01.24Z,NAFRev2,N,,,0,,,,,,
411940091,00019,41194009100019,O,1987-12-31,NN,,,2019-11-14T14:00:53,true,4,,,,,,66130,SAINT-MICHEL-DE-LLOTES,,,66185,,,,,,,,,,,,,,,,,,,2003-10-15,F,,,,,01.1F,NAFRev1,N,,,0,,,,,,
411942147,00017,41194214700017,O,1987-12-31,NN,,,2019-11-14T14:00:53,true,3,,,,RTE,DE BOULETERNERE,66130,SAINT-MICHEL-DE-LLOTES,,,66185,,,,,,,,,,,,,,,,,,,2008-01-01,A,,,,,01.24Z,NAFRev2,N,2.622733,42.655835,0.84,street,Route de Bouleternere 66130 Saint-Michel-de-Llotes,66185_1270,G,ROUTE DE BOULETERNERE,
413209727,00010,41320972700010,O,1991-12-31,NN,,,2019-11-14T14:00:53,false,4,,,,,MAS SOLERE,66130,SAINT-MICHEL-DE-LLOTES,,,66185,,,,,,,,,,,,,,,,,,,1999-01-01,F,,,,,01.1F,NAF1993,N,2.619366,42.637934,0.5,locality,Mas d'En Pere Miquel 66130 Saint-Michel-de-Llotes,66185_b019,G,MAS D EN PERE MIQUEL,
413209727,00028,41320972700028,O,1999-01-01,NN,,,2019-11-14T14:00:53,true,3,,,,,VEINAT DEL SERRAT,66130,SAINT-MICHEL-DE-LLOTES,,,66185,,,,,,,,,,,,,,,,,,,2008-01-01,A,,,,,01.24Z,NAFRev2,N,2.619217,42.65506,0.93,street,Veinat Del Serrat 66130 Saint-Michel-de-Llotes,66185_er02k5,G,VEINAT DEL SERRAT,
413591827,00014,41359182700014,O,1997-09-01,NN,,,2019-11-14T14:00:53,true,4,MAS PELRAS,,,RTE,DE BOULETERNERE,66130,SAINT-MICHEL-DE-LLOTES,,,66185,,,,,,,,,,,,,,,,,,,2001-02-14,F,,,,,45.2V,NAF1993,O,2.622733,42.655835,0.84,street,Route de Bouleternere 66130 Saint-Michel-de-Llotes,66185_1270,G,ROUTE DE BOULETERNERE,
415224302,00026,41522430200026,O,1998-12-14,NN,,,2019-11-14T14:00:53,true,3,MAS BERTIN,,,RTE,DE BOULETERNERE,66130,SAINT-MICHEL-DE-LLOTES,,,66185,,,,,,,,,,,,,,,,,,,2007-02-28,F,,,,,45.2V,NAFRev1,O,2.622733,42.655835,0.84,street,Route de Bouleternere 66130 Saint-Michel-de-Llotes,66185_1270,G,ROUTE DE BOULETERNERE,
420486631,00013,42048663100013,O,1998-09-25,,,,2019-11-14T14:00:53,true,3,,,,,MAS PEYROTS,66130,SAINT-MICHEL-DE-LLOTES,,,66185,,,,,,,,,,,,,,,,,,,2000-02-29,F,,,,,02.0D,NAF1993,N,2.619366,42.637934,0.4,locality,Mas d'En Pere Miquel 66130 Saint-Michel-de-Llotes,66185_b019,G,MAS D EN PERE MIQUEL,
421979733,00019,42197973300019,O,1998-06-01,00,2018,,2020-08-25T10:12:44,true,4,MAS DE L ORATOIRE,,,RTE,DE CORBERE,66130,SAINT-MICHEL-DE-LLOTES,,,66185,,,,,,,,,,,,,,,,,,,2019-12-31,F,,,,,01.24Z,NAFRev2,N,2.629785,42.655487,0.81,street,Route de Corbere 66130 Saint-Michel-de-Llotes,66185_2000,G,ROUTE DE CORBERE,
422421792,00017,42242179200017,O,1992-01-01,NN,,,2019-11-14T14:00:53,true,3,,,,,,66130,SAINT-MICHEL-DE-LLOTES,,,66185,,,,,,,,,,,,,,,,,,,2008-01-01,A,,,,,01.24Z,NAFRev2,N,,,0,,,,,,
430091066,00018,43009106600018,O,2000-04-30,NN,,4321AB,2021-02-23T11:49:54,true,6,,10,,,CARRER DEL REC,66130,SAINT-MICHEL-DE-LLOTES,,,66185,,,,,,,,,,,,,,,,,,,2009-09-11,A,RUIZ FRANCOIS ELECTRICITE GENERALE,,,,43.21A,NAFRev2,N,2.62354,42.65097,0.93,housenumber,10 Carrer Del Rec 66130 Saint-Michel-de-Llotes,66185_7600_00010,G,10 CARRER DEL REC,
430293746,00011,43029374600011,O,2000-01-01,NN,,,2019-11-14T14:00:53,true,3,,,,,,66130,SAINT-MICHEL-DE-LLOTES,,,66185,,,,,,,,,,,,,,,,,,,2004-12-31,F,,,,,01.1F,NAFRev1,N,,,0,,,,,,
437544612,00017,43754461200017,O,2001-06-01,NN,,,2019-11-14T14:00:53,true,3,,,,,MAS D'EN MESTRE,66130,SAINT-MICHEL-DE-LLOTES,,,66185,,,,,,,,,,,,,,,,,,,2003-12-31,F,,,,,01.1F,NAFRev1,N,2.618299,42.637005,0.88,locality,Mas d'En Mestres 66130 Saint-Michel-de-Llotes,66185_b018,G,MAS D EN MESTRES,
440560779,00017,44056077900017,O,2002-01-01,NN,,,2019-11-14T14:00:53,true,3,VEINAT DEL SERRAT,,,,,66130,SAINT-MICHEL-DE-LLOTES,,,66185,,,,,,,,,,,,,,,,,,,2008-01-01,A,,,,,01.24Z,NAFRev2,N,2.619217,42.65506,0.93,street,Veinat Del Serrat 66130 Saint-Michel-de-Llotes,66185_er02k5,D,VEINAT DEL SERRAT,
440560779,00025,44056077900025,O,2015-07-23,,,,2021-06-23T09:28:29,false,1,,2,B,RTE,DE CORBERE,66130,SAINT-MICHEL-DE-LLOTES,,,66185,,,,,,,,,,,,,,,,,,,2015-07-23,A,,,,,01.61Z,NAFRev2,N,2.629785,42.655487,0.74,housenumber,2 b Route de Corbere 66130 Saint-Michel-de-Llotes,66185_2000_00002_b,G,2 B ROUTE DE CORBERE,
440957744,00012,44095774400012,O,1983-01-01,NN,,,2019-11-14T14:00:53,true,3,,,,,LE VILLAGE,66130,SAINT-MICHEL-DE-LLOTES,,,66185,,,,,,,,,,,,,,,,,,,2008-01-01,A,,,,,01.21Z,NAFRev2,N,2.2950702,48.9311749,0.9,poi.bar,bar le village Gennevilliers,https://osm.org/node/3287755128,G,,
442607479,00023,44260747900023,O,2014-12-08,,,,2021-02-23T13:24:35,true,2,,,,,MAS MESTRE,66130,SAINT-MICHEL-DE-LLOTES,,,66185,,,,,,,,,,,,,,,,,,,2014-12-09,A,,,,,46.19B,NAFRev2,N,2.618299,42.637005,0.76,locality,Mas d'En Mestres 66130 Saint-Michel-de-Llotes,66185_b018,G,MAS D EN MESTRES,
443368733,00012,44336873300012,O,2002-08-20,NN,,,2019-11-14T14:00:53,true,3,MAS BERTIN,,,RTE,DE BOULETERNERE,66130,SAINT-MICHEL-DE-LLOTES,,,66185,,,,,,,,,,,,,,,,,,,2008-01-01,A,,,,,68.20B,NAFRev2,N,2.622733,42.655835,0.84,street,Route de Bouleternere 66130 Saint-Michel-de-Llotes,66185_1270,G,ROUTE DE BOULETERNERE,
443881404,00018,44388140400018,O,2002-11-01,NN,,,2019-11-14T14:00:53,false,4,PLA DE MONTORIOL,,,,,66130,SAINT-MICHEL-DE-LLOTES,,,66185,,,,,,,,,,,,,,,,,,,2006-10-24,F,,,,,51.8M,NAFRev1,O,2.626791,42.653958,0.93,street,Pla de Montoriol 66130 Saint-Michel-de-Llotes,66185_b025,D,PLA DE MONTORIOL,
444853378,00016,44485337800016,O,2003-01-01,NN,,,2019-11-14T14:00:53,true,3,,,,,,66130,SAINT-MICHEL-DE-LLOTES,,,66185,,,,,,,,,,,,,,,,,,,2008-01-01,A,,,,,01.13Z,NAFRev2,N,,,0,,,,,,
444973085,00012,44497308500012,O,2003-01-16,,,,2019-11-14T14:00:53,true,3,VEINAT DEL REC,,,,VILLA LE PUITS,66130,SAINT-MICHEL-DE-LLOTES,,,66185,,,,,,,,,,,,,,,,,,,2003-12-25,F,,,,,52.4Y,NAFRev1,N,2.624238,42.651209,0.51,street,Voie Communale Veinat Del Rec 66130 Saint-Michel-de-Llotes,66185_7630,D,VOIE COMMUNALE VEINAT DEL REC,
448982058,00027,44898205800027,O,2006-12-20,,,,2021-02-23T13:30:57,true,2,,,,,LAS BASSES,66130,SAINT-MICHEL-DE-LLOTES,,,66185,,,,,,,,,,,,,,,,,,,2008-01-01,A,,,,,68.20B,NAFRev2,N,2.622111,42.658346,0.93,street,Las Basses 66130 Saint-Michel-de-Llotes,66185_w0i7a2,G,LAS BASSES,
450222674,00019,45022267400019,O,2003-10-01,NN,,,2019-11-14T14:00:53,true,4,,4,,LOT,PLEIN SOLEIL,66130,SAINT-MICHEL-DE-LLOTES,,,66185,,,,,,,,,,,,,,,,,,,2009-12-31,F,,,,,47.89Z,NAFRev2,N,2.623426,42.657111,0.76,street,Lotissement Plein Soleil 66130 Saint-Michel-de-Llotes,66185_a070,G,LOTISSEMENT PLEIN SOLEIL,
451078562,00027,45107856200027,O,2018-02-01,,,,2021-02-23T13:34:13,true,1,MAS MARTINE,,,RTE,DE SAINT MICHEL,66130,SAINT-MICHEL-DE-LLOTES,,,66185,,,,,,,,,,,,,,,,,,,2018-02-01,A,,,,,01.49Z,NAFRev2,N,2.621073,42.657623,0.83,street,Route d'Ille 66130 Saint-Michel-de-Llotes,66185_4800,G,ROUTE D ILLE,
451670913,00040,45167091300040,O,2013-11-06,01,2018,,2021-02-23T13:35:10,true,1,,1,,RUE,PLEIN SOLEIL,66130,SAINT-MICHEL-DE-LLOTES,,,66185,,,,,,,,,,,,,,,,,,,2013-11-06,A,,,,,43.99C,NAFRev2,N,2.623009,42.656918,0.93,housenumber,1 Rue Plein Soleil 66130 Saint-Michel-de-Llotes,66185_7580_00001,G,1 RUE PLEIN SOLEIL,
453155848,00014,45315584800014,O,2004-04-20,NN,,,2019-11-14T14:00:53,false,3,MAS VILARDELL,,,CHE,DE LA BALLTORTE,66130,SAINT-MICHEL-DE-LLOTES,,,66185,,,,,,,,,,,,,,,,,,,2008-01-01,A,,,,,43.32A,NAFRev2,N,2.621138,42.652212,0.78,street,Voie Communale Veinat de la Balltorte 66130 Saint-Michel-de-Llotes,66185_0815,G,VOIE C VEINAT DE LA BALLTORTE,
478329311,00052,47832931100052,O,2014-03-01,,,,2021-02-23T13:40:11,true,3,,3,,RTE,DE CASEFABRE,66130,SAINT-MICHEL-DE-LLOTES,,,66185,,,,,,,,,,,,,,,,,,,2017-03-01,A,,,,,74.90B,NAFRev2,N,2.624662,42.644267,0.84,housenumber,3 Route de Casefabre 66130 Saint-Michel-de-Llotes,66185_1520_00003,G,3 ROUTE DE CASEFABRE,
479049967,00017,47904996700017,O,2004-10-13,,,,2019-11-14T14:00:53,false,4,,5,,LOT,LE GIMENEIL,66130,SAINT-MICHEL-DE-LLOTES,,,66185,,,,,,,,,,,,,,,,,,,2011-05-13,F,,,,,47.52B,NAFRev2,N,2.622479,42.656665,0.77,street,Lotissement le Gimeneil 66130 Saint-Michel-de-Llotes,66185_a060,G,LOTISSEMENT LE GIMENEIL,
481651909,00014,48165190900014,O,2005-04-18,,,,2019-11-14T14:00:53,true,2,,,,,VEINAT DEL REC,66130,SAINT-MICHEL-DE-LLOTES,,,66185,,,,,,,,,,,,,,,,,,,2006-04-14,F,,,,,45.3A,NAFRev1,N,2.624238,42.651209,0.91,street,Voie Communale Veinat Del Rec 66130 Saint-Michel-de-Llotes,66185_7630,G,VOIE COMMUNALE VEINAT DEL REC,
489305136,00017,48930513600017,O,2006-03-24,,,,2019-11-14T14:00:53,true,3,,8,,LOT,PLEIN SOLEIL,66130,SAINT-MICHEL-DE-LLOTES,,,66185,,,,,,,,,,,,,,,,,,,2011-03-31,F,,,,,85.59B,NAFRev2,N,2.624267,42.657995,0.87,housenumber,8 Lotissement Plein Soleil 66130 Saint-Michel-de-Llotes,66185_a070_00008,G,8 LOTISSEMENT PLEIN SOLEIL,
494177082,00018,49417708200018,O,2006-07-01,,,,2019-11-14T14:00:53,true,2,,14,,LOT,PLEIN SOLEIL,66130,SAINT-MICHEL-DE-LLOTES,,,66185,,,,,,,,,,,,,,,,,,,2008-01-01,A,,,,,94.99Z,NAFRev2,N,2.623426,42.657111,0.73,street,Lotissement Plein Soleil 66130 Saint-Michel-de-Llotes,66185_a070,G,LOTISSEMENT PLEIN SOLEIL,
508308244,00013,50830824400013,O,1972-11-29,,,,2019-11-14T14:00:53,true,1,MAIRIE,,,,,66130,SAINT-MICHEL-DE-LLOTES,,,66185,,,,,,,,,,,,,,,,,,,1972-11-29,A,,,,,94.99Z,NAFRev2,N,2.624461,42.647122,0.37,street,Voie Communale Veinat de l'Aire 66130 Saint-Michel-de-Llotes,66185_0260,D,VOIE COMMUNALE VEINAT DE L AIRE,
508542115,00011,50854211500011,O,2006-06-18,,,,2019-11-14T14:00:53,true,1,,,,,MAIRIE,66130,SAINT-MICHEL-DE-LLOTES,,,66185,,,,,,,,,,,,,,,,,,,2006-06-18,A,,,,,94.99Z,NAFRev2,N,2.624461,42.647122,0.37,street,Voie Communale Veinat de l'Aire 66130 Saint-Michel-de-Llotes,66185_0260,G,VOIE COMMUNALE VEINAT DE L AIRE,
510793714,00021,51079371400021,O,2014-06-01,,,,2021-02-23T15:18:33,true,1,,10,,,LAS BASSES,66130,SAINT-MICHEL-DE-LLOTES,,,66185,,,,,,,,,,,,,,,,,,,2014-06-01,A,RENOVACTION,,,,43.99C,NAFRev2,N,2.623124,42.655393,0.93,housenumber,10 Las Basses 66130 Saint-Michel-de-Llotes,66185_w0i7a2_00010,G,10 LAS BASSES,
511495079,00010,51149507900010,O,2009-01-01,,,,2019-11-14T14:00:53,false,2,,,,,MAS D'EN GRAU,66130,SAINT-MICHEL-DE-LLOTES,,,66185,,,,,,,,,,,,,,,,,,,2016-09-30,F,,,,,90.03B,NAFRev2,N,2.632975,42.636211,0.93,street,Mas d'En Grau 66130 Saint-Michel-de-Llotes,66185_b016,G,MAS D EN GRAU,
515048684,00028,51504868400028,O,2011-11-21,,,,2019-11-14T14:00:53,false,2,,2,,AV,DES ASPRES,66130,SAINT-MICHEL-DE-LLOTES,,,66185,,,,,,,,,,,,,,,,,,,2012-12-02,F,,,,,18.13Z,NAFRev2,N,2.623328,42.654157,0.81,housenumber,2 Avenue des Aspres 66130 Saint-Michel-de-Llotes,66185_0500_00002,G,2 AVENUE DES ASPRES,
519596530,00013,51959653000013,O,2010-01-01,NN,,4391BZ,2019-11-14T14:00:53,true,9,,2,,,PLA DE MONTORIOL,66130,SAINT-MICHEL-DE-LLOTES,,,66185,,,,,,,,,,,,,,,,,,,2019-01-01,A,,,,,43.39Z,NAFRev2,N,2.626791,42.653958,0.93,housenumber,2 Pla de Montoriol 66130 Saint-Michel-de-Llotes,66185_b025_00002,G,2 PLA DE MONTORIOL,