siren,nic,siret,statutDiffusionEtablissement,dateCreationEtablissement,trancheEffectifsEtablissement,anneeEffectifsEtablissement,activitePrincipaleRegistreMetiersEtablissement,dateDernierTraitementEtablissement,etablissementSiege,nombrePeriodesEtablissement,complementAdresseEtablissement,numeroVoieEtablissement,indiceRepetitionEtablissement,typeVoieEtablissement,libelleVoieEtablissement,codePostalEtablissement,libelleCommuneEtablissement,libelleCommuneEtrangerEtablissement,distributionSpecialeEtablissement,codeCommuneEtablissement,codeCedexEtablissement,libelleCedexEtablissement,codePaysEtrangerEtablissement,libellePaysEtrangerEtablissement,complementAdresse2Etablissement,numeroVoie2Etablissement,indiceRepetition2Etablissement,typeVoie2Etablissement,libelleVoie2Etablissement,codePostal2Etablissement,libelleCommune2Etablissement,libelleCommuneEtranger2Etablissement,distributionSpeciale2Etablissement,codeCommune2Etablissement,codeCedex2Etablissement,libelleCedex2Etablissement,codePaysEtranger2Etablissement,libellePaysEtranger2Etablissement,dateDebut,etatAdministratifEtablissement,enseigne1Etablissement,enseigne2Etablissement,enseigne3Etablissement,denominationUsuelleEtablissement,activitePrincipaleEtablissement,nomenclatureActivitePrincipaleEtablissement,caractereEmployeurEtablissement,longitude,latitude,geo_score,geo_type,geo_adresse,geo_id,geo_ligne,geo_l4,geo_l5
186709648,00015,18670964800015,O,1988-04-11,,,,2019-11-14T14:00:53,true,4,,58,,RUE,DE LA FEODALITE,67310,SCHARRACHBERGHEIM-IRMSTETT,,,67442,,,,,,,,,,,,,,,,,,,2008-01-01,A,PAROISSE DE SCHARRACHBERGHEIM,,,,94.91Z,NAFRev2,N,7.48946,48.593751,0.83,street,Rue de la Féodalité 67310 Scharrachbergheim-Irmstett,67442_0085,G,RUE DE LA FEODALITE,
216702241,00011,21670224100011,O,1983-03-01,NN,,,2019-11-14T14:00:53,true,3,,,,,MAIRIE DE IRMSTETT,67310,SCHARRACHBERGHEIM-IRMSTETT,,,67442,,,,,,,,,,,,,,,,,,,2008-01-01,A,,,,,84.11Z,NAFRev2,N,7.480455,48.587422,0.6,street,Rue de l'Eglise à Irmstett 67310 Scharrachbergheim-Irmstett,67442_0081,G,RUE DE L EGLISE A IRMSTETT,
216704429,00010,21670442900010,O,1983-03-01,02,2018,,2020-08-25T10:18:36,true,4,,89,,RUE,PRINCIPALE,67310,SCHARRACHBERGHEIM-IRMSTETT,,,67442,,,,,,,,,,,,,,,,,,,2008-01-01,A,MAIRIE,,,,84.11Z,NAFRev2,O,7.497119,48.592767,0.94,housenumber,89 Rue Principale 67310 Scharrachbergheim-Irmstett,67442_0200_00089,G,89 RUE PRINCIPALE,
216704429,00028,21670442900028,O,1983-12-21,NN,,,2019-11-14T14:00:53,false,3,,15,,RUE,DU MOULIN-IRMSTETT,67310,SCHARRACHBERGHEIM-IRMSTETT,,,67442,,,,,,,,,,,,,,,,,,,2005-08-31,F,ECOLE PRIMAIRE PUBLIQUE,,,,80.1Z,NAFRev1,N,7.479555,48.587275,0.89,housenumber,15 Rue du Moulin 67310 Scharrachbergheim-Irmstett,67442_0170_00015,G,15 RUE DU MOULIN,
216704429,00036,21670442900036,O,1983-12-21,NN,,,2019-11-14T14:00:53,false,3,,154,,RUE,ECOLE,67310,SCHARRACHBERGHEIM-IRMSTETT,,,67442,,,,,,,,,,,,,,,,,,,2005-08-31,F,ECOLE ELEMENTAIRE PUBLIQUE,,,,80.1Z,NAFRev1,N,7.498978,48.59345,0.59,street,Rue de l'Ecole 67310 Scharrachbergheim-Irmstett,67442_0060,G,RUE DE L ECOLE,
246700439,00028,24670043900028,O,2001-12-25,NN,,,2019-11-14T14:00:53,true,4,STATION D'EPURATION,,,RUE,DE SCHARRACH,67310,SCHARRACHBERGHEIM-IRMSTETT,,,67442,,,,,,,,,,,,,,,,,,,2013-05-13,F,,,,,84.12Z,NAFRev2,N,7.501445,48.590943,0.78,street,Rue du Scharrach 67310 Scharrachbergheim-Irmstett,67442_0235,G,RUE DU SCHARRACH,
256702028,00018,25670202800018,O,1985-11-29,NN,,,2019-11-14T14:00:53,false,5,MAIRIE,74,,RUE,PRINCIPALE,67310,SCHARRACHBERGHEIM-IRMSTETT,,,67442,,,,,,,,,,,,,,,,,,,2008-04-04,F,,,,,84.12Z,NAFRev2,O,7.495399,48.593077,0.94,housenumber,74 Rue Principale 67310 Scharrachbergheim-Irmstett,67442_0200_00074,G,74 RUE PRINCIPALE,
256702028,00026,25670202800026,O,2004-12-25,11,2018,,2020-08-25T10:20:34,false,3,,16,,RUE,DE L'ECOLE,67310,SCHARRACHBERGHEIM-IRMSTETT,,,67442,,,,,,,,,,,,,,,,,,,2008-01-01,A,ECOLE ELEMENTAIRE PUBLIQUE,,,,85.20Z,NAFRev2,N,7.499406,48.59482,0.94,housenumber,16 Rue de l'Ecole 67310 Scharrachbergheim-Irmstett,67442_0060_00016,G,16 RUE DE L ECOLE,
256702028,00034,25670202800034,O,2004-12-25,NN,,,2019-11-14T14:00:53,false,2,IRMSTETT,20,,RUE,DU MOULIN,67310,SCHARRACHBERGHEIM-IRMSTETT,,,67442,,,,,,,,,,,,,,,,,,,2008-01-01,A,ECOLE PRIMAIRE PUBLIQUE,,,,85.20Z,NAFRev2,N,7.478904,48.587345,0.94,housenumber,20 Rue du Moulin 67310 Scharrachbergheim-Irmstett,67442_0170_00020,G,20 RUE DU MOULIN,
266704220,00018,26670422000018,O,1995-12-25,NN,,,2019-11-14T14:00:53,true,3,MAIRIE,89,,RUE,PRINCIPALE,67310,SCHARRACHBERGHEIM-IRMSTETT,,,67442,,,,,,,,,,,,,,,,,,,2017-08-01,F,CCAS DE SCHARRACHBERGHEIM,,,,88.99B,NAFRev2,N,7.497119,48.592767,0.94,housenumber,89 Rue Principale 67310 Scharrachbergheim-Irmstett,67442_0200_00089,G,89 RUE PRINCIPALE,
296702681,00010,29670268100010,O,,,,,2019-11-14T14:00:53,true,1,,,,,MAIRIE,67310,SCHARRACHBERGHEIM-IRMSTETT,,,67442,,,,,,,,,,,,,,,,,,,,F,,,,,90.12,NAP,N,3.0709671,50.6304695,0.92,poi.townhall,Hôtel de Ville Lille,https://osm.org/way/40917078,G,,
296702772,00017,29670277200017,O,,NN,,,2019-11-14T14:00:53,true,1,,,,,MAIRIE,67310,SCHARRACHBERGHEIM-IRMSTETT,,,67442,,,,,,,,,,,,,,,,,,,1995-12-25,F,,,,,70.1C,NAF1993,N,3.0709671,50.6304695,0.92,poi.townhall,Hôtel de Ville Lille,https://osm.org/way/40917078,G,,
303463848,00018,30346384800018,O,,NN,,,2019-11-14T14:00:53,true,1,,136,,RUE,PRINCIPALE,67310,SCHARRACHBERGHEIM-IRMSTETT,,,67442,,,,,,,,,,,,,,,,,,,,F,,,,,48.01,NAP,N,7.486748,48.591553,0.77,street,Rue Principale 67310 Scharrachbergheim-Irmstett,67442_0200,G,RUE PRINCIPALE,
304212632,00026,30421263200026,O,,,,,2019-11-14T14:00:53,true,1,,30,A,RUE,DU MOULIN,67310,SCHARRACHBERGHEIM-IRMSTETT,,,67442,,,,,,,,,,,,,,,,,,,1997-06-30,F,,,,,28.7P,NAF1993,N,7.476861,48.587617,0.94,interpolation,30 Rue du Moulin 67310 Scharrachbergheim-Irmstett,,G,28 RUE DU MOULIN,
307100362,00036,30710036200036,O,2010-12-01,NN,,,2021-02-23T10:37:38,true,1,,64,,RUE,PRINCIPALE,67310,SCHARRACHBERGHEIM-IRMSTETT,,,67442,,,,,,,,,,,,,,,,,,,2010-12-01,A,,,,LA MAISON DE GEORGES,55.20Z,NAFRev2,O,7.494395,48.593107,0.94,housenumber,64 Rue Principale 67310 Scharrachbergheim-Irmstett,67442_0200_00064,G,64 RUE PRINCIPALE,
309296762,00011,30929676200011,O,,NN,,,2019-11-14T14:00:53,true,1,,93,,RUE,DU CHATEAU,67310,SCHARRACHBERGHEIM-IRMSTETT,,,67442,,,,,,,,,,,,,,,,,,,,F,,,,,45.23,NAP,N,7.49535,48.593321,0.8,street,Rue du Château 67310 Scharrachbergheim-Irmstett,67442_0040,G,RUE DU CHATEAU,
312241680,00015,31224168000015,O,1978-01-01,NN,,,2019-11-14T14:00:53,true,1,,22,,RUE,MOULIN IRMSTETT,67310,SCHARRACHBERGHEIM-IRMSTETT,,,67442,,,,,,,,,,,,,,,,,,,2001-01-31,F,,,,,60.2E,NAF1993,N,7.478617,48.587357,0.84,housenumber,22 Rue du Moulin 67310 Scharrachbergheim-Irmstett,67442_0170_00022,G,22 RUE DU MOULIN,
312699762,00026,31269976200026,O,,NN,,,2019-11-14T14:00:53,true,1,,153,A,RUE,DE L ECOLE,67310,SCHARRACHBERGHEIM-IRMSTETT,,,67442,,,,,,,,,,,,,,,,,,,,F,,,,,78.02,NAP,N,7.498978,48.59345,0.74,street,Rue de l'Ecole 67310 Scharrachbergheim-Irmstett,67442_0060,G,RUE DE L ECOLE,
315158360,00018,31515836000018,O,1900-01-01,NN,,,2019-11-14T14:00:53,true,4,,103,,RUE,PRINCIPALE,67310,SCHARRACHBERGHEIM-IRMSTETT,,,67442,,,,,,,,,,,,,,,,,,,1994-12-25,F,,,,,01.1A,NAF1993,N,7.486748,48.591553,0.77,street,Rue Principale 67310 Scharrachbergheim-Irmstett,67442_0200,G,RUE PRINCIPALE,
316063932,00024,31606393200024,O,1900-01-01,NN,,,2019-11-14T14:00:53,true,4,,15,,RUE,DE SOULTZ LES BAINS,67310,SCHARRACHBERGHEIM-IRMSTETT,,,67442,,,,,,,,,,,,,,,,,,,2015-02-28,F,,,,,71.11Z,NAFRev2,N,7.486785,48.589877,0.94,housenumber,15 Rue de Soultz les Bains 67310 Scharrachbergheim-Irmstett,67442_0240_00015,G,15 RUE DE SOULTZ LES BAINS,
316836220,00012,31683622000012,O,1979-01-01,NN,,,2019-11-14T14:00:53,false,3,,121,,RUE,DE L EGLISE,67310,SCHARRACHBERGHEIM-IRMSTETT,,,67442,,,,,,,,,,,,,,,,,,,2006-12-31,F,,,,,92.3A,NAFRev1,N,7.480452,48.587421,0.78,street,Rue de l'Eglise 67310 Scharrachbergheim-Irmstett,67442_0080,G,RUE DE L EGLISE,
317156933,00010,31715693300010,O,1979-01-01,NN,,,2019-11-14T14:00:53,true,1,,27,,RUE,DU MOULIN,67310,SCHARRACHBERGHEIM-IRMSTETT,,,67442,,,,,,,,,,,,,,,,,,,1999-03-17,F,,,,,01.1A,NAF1993,N,7.477552,48.587003,0.94,housenumber,27 Rue du Moulin 67310 Scharrachbergheim-Irmstett,67442_0170_00027,G,27 RUE DU MOULIN,
320015316,00013,32001531600013,O,,,,,2019-11-14T14:00:53,true,1,,148,,RUE,DE L ECOLE,67310,SCHARRACHBERGHEIM-IRMSTETT,,,67442,,,,,,,,,,,,,,,,,,,1990-10-31,F,,,,,83.01,NAP,N,7.498978,48.59345,0.77,street,Rue de l'Ecole 67310 Scharrachbergheim-Irmstett,67442_0060,G,RUE DE L ECOLE,
323454249,00018,32345424900018,O,,,,,2019-11-14T14:00:53,true,1,,21,,RUE,DU GENERAL WURMSER,67310,SCHARRACHBERGHEIM-IRMSTETT,,,67442,,,,,,,,,,,,,,,,,,,1984-12-25,F,,,,,60.09,NAP,N,7.491332,48.595036,0.94,housenumber,21 Rue du Général Wurmser 67310 Scharrachbergheim-Irmstett,67442_0089_00021,G,21 RUE DU GENERAL WURMSER,
323546374,00022,32354637400022,O,2001-12-01,NN,,,2019-11-14T14:00:53,false,4,,45,,RUE,PRINCIPALE,67310,SCHARRACHBERGHEIM-IRMSTETT,,,67442,,,,,,,,,,,,,,,,,,,2010-12-31,F,,,,,86.21Z,NAFRev2,N,7.492821,48.593206,0.94,housenumber,45 Rue Principale 67310 Scharrachbergheim-Irmstett,67442_0200_00045,G,45 RUE PRINCIPALE,
323591081,00019,32359108100019,O,,NN,,,2019-11-14T14:00:53,true,1,,32,,RUE,DE L EGLISE,67310,SCHARRACHBERGHEIM-IRMSTETT,,,67442,,,,,,,,,,,,,,,,,,,1989-12-31,F,,,,,01.80,NAP,N,7.480452,48.587421,0.81,street,Rue de l'Eglise 67310 Scharrachbergheim-Irmstett,67442_0080,G,RUE DE L EGLISE,
324020155,00010,32402015500010,O,1982-01-01,00,2018,,2020-08-25T10:30:32,true,3,,54,,RUE,PRINCIPALE,67310,SCHARRACHBERGHEIM-IRMSTETT,,,67442,,,,,,,,,,,,,,,,,,,2008-01-01,A,,,,,01.21Z,NAFRev2,N,7.49293,48.593128,0.94,housenumber,54 Rue Principale 67310 Scharrachbergheim-Irmstett,67442_0200_00054,G,54 RUE PRINCIPALE,
324079318,00014,32407931800014,O,1982-04-01,NN,,,2019-11-14T14:00:53,true,4,IRMSTETT,5,,,GRANDE ROUTE,67310,SCHARRACHBERGHEIM-IRMSTETT,,,67442,,,,,,,,,,,,,,,,,,,2012-02-03,F,,,,,68.20B,NAFRev2,N,5.7849242,45.9963501,0.9,poi,Grande Route (Pont) Chanay,https://osm.org/way/538118432,G,,
324079326,00017,32407932600017,O,1982-04-01,03,2018,4520AA,2020-08-25T10:30:34,true,4,,5,,RTE,DE MOLSHEIM,67310,SCHARRACHBERGHEIM-IRMSTETT,,,67442,,,,,,,,,,,,,,,,,,,2008-01-01,A,,,,,45.20A,NAFRev2,O,7.47704,48.588205,0.84,housenumber,5 Route de Molsheim 67310 Scharrachbergheim-Irmstett,67442_0158_00005,G,5 ROUTE DE MOLSHEIM,
324949932,00010,32494993200010,O,,NN,,,2019-11-14T14:00:53,true,1,,1,,RUE,DU MOULIN,67310,SCHARRACHBERGHEIM-IRMSTETT,,,67442,,,,,,,,,,,,,,,,,,,,F,,,,,59.13,NAP,N,7.481537,48.588033,0.94,housenumber,1 Rue du Moulin 67310 Scharrachbergheim-Irmstett,67442_0170_00001,G,1 RUE DU MOULIN,
324985282,00015,32498528200015,O,1982-06-01,NN,,,2019-11-14T14:00:53,true,3,,1,,RUE,DU MOULIN,67310,SCHARRACHBERGHEIM-IRMSTETT,,,67442,,,,,,,,,,,,,,,,,,,2008-01-01,A,,,,,68.20B,NAFRev2,N,7.481537,48.588033,0.94,housenumber,1 Rue du Moulin 67310 Scharrachbergheim-Irmstett,67442_0170_00001,G,1 RUE DU MOULIN,
328349436,00019,32834943600019,O,,NN,,,2019-11-14T14:00:53,true,1,,10,,RUE,DE SOULTZ LES BAINS,67310,SCHARRACHBERGHEIM-IRMSTETT,,,67442,,,,,,,,,,,,,,,,,,,1989-02-15,F,,,,,77.05,NAP,N,7.487809,48.591166,0.85,street,Rue de Soultz les Bains 67310 Scharrachbergheim-Irmstett,67442_0240,G,RUE DE SOULTZ LES BAINS,
328861364,00029,32886136400029,O,1990-05-07,11,2018,2562BZ,2021-06-03T19:34:10,true,4,,,,,ZONE ARTISANALE,67310,SCHARRACHBERGHEIM-IRMSTETT,,,67442,,,,,,,,,,,,,,,,,,,2008-01-01,A,,,,,25.62B,NAFRev2,O,2.7640352,42.6301915,0.9,poi.retail,Zone Artisanale (Zone commerciale) Thuir,https://osm.org/way/191039530,G,,
330894106,00013,33089410600013,O,1984-10-01,NN,,1105ZZ,2019-11-14T14:00:53,true,6,,63,,RUE,PRINCIPALE,67310,SCHARRACHBERGHEIM-IRMSTETT,,,67442,,,,,,,,,,,,,,,,,,,2009-01-01,A,,,,,11.05Z,NAFRev2,O,7.49433,48.593226,0.94,housenumber,63 Rue Principale 67310 Scharrachbergheim-Irmstett,67442_0200_00063,G,63 RUE PRINCIPALE,
330927518,00010,33092751800010,O,1984-10-01,00,2018,4332AA,2020-10-30T19:34:10,true,4,,88,,RUE,PRINCIPALE,67310,SCHARRACHBERGHEIM-IRMSTETT,,,67442,,,,,,,,,,,,,,,,,,,2008-01-01,A,,,,,43.32A,NAFRev2,O,7.497023,48.592713,0.94,housenumber,88 Rue Principale 67310 Scharrachbergheim-Irmstett,67442_0200_00088,G,88 RUE PRINCIPALE,
331868406,00017,33186840600017,O,1985-02-04,01,2018,,2020-08-25T10:35:16,true,6,,47,,IMP,DU CHEVALIER DE DETTLINGEN,67310,SCHARRACHBERGHEIM-IRMSTETT,,,67442,,,,,,,,,,,,,,,,,,,2014-05-15,A,,,,,86.21Z,NAFRev2,O,7.49177,48.596057,0.77,street,Impasse du Chevalier Dettlingen 67310 Scharrachbergheim-Irmstett,67442_0045,G,IMPASSE DU CHEVALIER DETTLINGEN,
332383124,00010,33238312400010,O,,NN,,,2019-11-14T14:00:53,true,1,,4,,RUE,DES COMTES DE LA ROCHE,67310,SCHARRACHBERGHEIM-IRMSTETT,,,67442,,,,,,,,,,,,,,,,,,,,F,,,,,55.73,NAP,N,7.490884,48.594137,0.94,housenumber,4 Rue des Comtes de la Roche 67310 Scharrachbergheim-Irmstett,67442_0050_00004,G,4 RUE DES COMTES DE LA ROCHE,
333940484,00020,33394048400020,O,1990-12-20,NN,,,2019-11-14T14:00:53,true,5,,148,,RUE,DE L ECOLE,67310,SCHARRACHBERGHEIM-IRMSTETT,,,67442,,,,,,,,,,,,,,,,,,,2006-03-14,F,,,,,01.1D,NAFRev1,N,7.498978,48.59345,0.77,street,Rue de l'Ecole 67310 Scharrachbergheim-Irmstett,67442_0060,G,RUE DE L ECOLE,
334728284,00012,33472828400012,O,1985-10-09,NN,,,2019-11-14T14:00:53,true,4,,96,,RUE,DU CHATEAU,67310,SCHARRACHBERGHEIM-IRMSTETT,,,67442,,,,,,,,,,,,,,,,,,,2008-01-01,A,,,,,01.21Z,NAFRev2,N,7.49535,48.593321,0.8,street,Rue du Château 67310 Scharrachbergheim-Irmstett,67442_0040,G,RUE DU CHATEAU,
335230900,00011,33523090000011,O,,NN,,,2019-11-14T14:00:53,true,1,,27,,RUE,DU MOULIN,67310,SCHARRACHBERGHEIM-IRMSTETT,,,67442,,,,,,,,,,,,,,,,,,,1988-12-31,F,,,,,01.00,NAP,N,7.477552,48.587003,0.94,housenumber,27 Rue du Moulin 67310 Scharrachbergheim-Irmstett,67442_0170_00027,G,27 RUE DU MOULIN,
335332318,00013,33533231800013,O,,NN,,,2019-11-14T14:00:53,true,1,,40,,RUE,DU GAL WURMSER,67310,SCHARRACHBERGHEIM-IRMSTETT,,,67442,,,,,,,,,,,,,,,,,,,,F,,,,,64.11,NAP,N,7.493209,48.594734,0.72,street,Rue du Général Wurmser 67310 Scharrachbergheim-Irmstett,67442_0089,G,RUE DU GENERAL WURMSER,
338193121,00013,33819312100013,O,,NN,,,2019-11-14T14:00:53,true,1,,76,,RUE,PRINCIPALE,67310,SCHARRACHBERGHEIM-IRMSTETT,,,67442,,,,,,,,,,,,,,,,,,,1995-06-30,F,,,,,01.1A,NAF1993,N,7.4956,48.593006,0.94,housenumber,76 Rue Principale 67310 Scharrachbergheim-Irmstett,67442_0200_00076,G,76 RUE PRINCIPALE,
338660806,00013,33866080600013,O,,NN,,,2019-11-14T14:00:53,true,1,,96,,RUE,DU CHATEAU,67310,SCHARRACHBERGHEIM-IRMSTETT,,,67442,,,,,,,,,,,,,,,,,,,1993-06-08,F,,,,,20.1A,NAF1993,N,7.49535,48.593321,0.8,street,Rue du Château 67310 Scharrachbergheim-Irmstett,67442_0040,G,RUE DU CHATEAU,
340976448,00118,34097644800118,O,1993-05-04,NN,,,2019-11-14T14:00:53,false,5,,145,A,RUE,DES VIGNES,67310,SCHARRACHBERGHEIM-IRMSTETT,,,67442,,,,,,,,,,,,,,,,,,,2008-01-01,F,SERGE COMTESSE,,,,96.02A,NAFRev2,N,7.49876,48.592194,0.72,street,Rue des Vignes 67310 Scharrachbergheim-Irmstett,67442_0300,G,RUE DES VIGNES,
341803120,00029,34180312000029,O,,NN,,,2019-11-14T14:00:53,true,1,,7,,RUE,FROEHN,67310,SCHARRACHBERGHEIM-IRMSTETT,,,67442,,,,,,,,,,,,,,,,,,,1994-12-31,F,,,,,15.1C,NAF1993,N,7.500272,48.593991,0.94,housenumber,7 Rue Froehn 67310 Scharrachbergheim-Irmstett,67442_0088_00007,G,7 RUE FROEHN,
341920429,00014,34192042900014,O,1987-07-07,NN,,,2019-11-14T14:00:53,true,5,,93,,RUE,PRINCIPALE,67310,SCHARRACHBERGHEIM-IRMSTETT,,,67442,,,,,,,,,,,,,,,,,,,2011-12-31,F,,,,,43.22A,NAFRev2,O,7.497517,48.592672,0.94,housenumber,93 Rue Principale 67310 Scharrachbergheim-Irmstett,67442_0200_00093,G,93 RUE PRINCIPALE,
343002887,00028,34300288700028,O,1993-04-30,NN,,,2019-11-14T14:00:53,false,4,,106,,RUE,PRINCIPALE,67310,SCHARRACHBERGHEIM-IRMSTETT,,,67442,,,,,,,,,,,,,,,,,,,2002-03-01,F,,,,,85.1E,NAF1993,N,7.486748,48.591553,0.77,street,Rue Principale 67310 Scharrachbergheim-Irmstett,67442_0200,G,RUE PRINCIPALE,
343002887,00044,34300288700044,O,2002-03-01,NN,,,2019-11-14T14:00:53,false,4,,138,,RUE,PRINCIPALE,67310,SCHARRACHBERGHEIM-IRMSTETT,,,67442,,,,,,,,,,,,,,,,,,,2003-08-15,F,,,,,85.1E,NAFRev1,N,7.486748,48.591553,0.77,street,Rue Principale 67310 Scharrachbergheim-Irmstett,67442_0200,G,RUE PRINCIPALE,
344130901,00012,34413090100012,O,1987-01-01,NN,,,2019-11-14T14:00:53,true,4,,122,,RUE,DE L EGLISE,67310,SCHARRACHBERGHEIM-IRMSTETT,,,67442,,,,,,,,,,,,,,,,,,,2010-07-31,F,,,,,01.21Z,NAFRev2,N,7.480452,48.587421,0.78,street,Rue de l'Eglise 67310 Scharrachbergheim-Irmstett,67442_0080,G,RUE DE L EGLISE,
344333265,00017,34433326500017,O,1988-02-18,NN,,,2019-11-14T14:00:53,true,5,,,,,ZONE ARTISANALE,67310,SCHARRACHBERGHEIM-IRMSTETT,,,67442,,,,,,,,,,,,,,,,,,,2010-03-16,F,,,,,10.89Z,NAFRev2,O,2.7640352,42.6301915,0.9,poi.retail,Zone Artisanale (Zone commerciale) Thuir,https://osm.org/way/191039530,G,,
344815998,00028,34481599800028,O,1996-01-01,NN,,,2019-11-14T14:00:53,true,6,ZA,12,,RUE,FROEHN,67310,SCHARRACHBERGHEIM-IRMSTETT,,,67442,,,,,,,,,,,,,,,,,,,2011-12-31,F,,,,,20.41Z,NAFRev2,N,7.503923,48.594501,0.94,housenumber,12 Rue Froehn 67310 Scharrachbergheim-Irmstett,67442_0088_00012,G,12 RUE FROEHN,
344902820,00010,34490282000010,O,1988-04-25,NN,,,2019-11-14T14:00:53,true,3,,40,,RUE,PRINCIPALE,67310,SCHARRACHBERGHEIM-IRMSTETT,,,67442,,,,,,,,,,,,,,,,,,,2008-01-01,A,,,,,68.20A,NAFRev2,N,7.490962,48.592962,0.94,housenumber,40 Rue Principale 67310 Scharrachbergheim-Irmstett,67442_0200_00040,G,40 RUE PRINCIPALE,
345273726,00017,34527372600017,O,,,,,2019-11-14T14:00:53,true,1,,14,A,RUE,PRINCIPALE,67310,SCHARRACHBERGHEIM-IRMSTETT,,,67442,,,,,,,,,,,,,,,,,,,1992-08-27,F,,,,,51.6L,NAF1993,N,2.061661,50.820766,0.9,poi,Rue Principale (Pont) Zouafques,https://osm.org/way/111379934,G,,
348114455,00010,34811445500010,O,1988-07-04,NN,,,2019-11-14T14:00:53,false,4,,1,,RUE,DU MOULIN,67310,SCHARRACHBERGHEIM-IRMSTETT,,,67442,,,,,,,,,,,,,,,,,,,2001-04-01,F,,,,,51.6L,NAF1993,O,7.481537,48.588033,0.94,housenumber,1 Rue du Moulin 67310 Scharrachbergheim-Irmstett,67442_0170_00001,G,1 RUE DU MOULIN,
348138660,00017,34813866000017,O,1988-09-28,NN,,,2019-11-14T14:00:53,false,4,,57,,RUE,DE LA MONTAGNE,67310,SCHARRACHBERGHEIM-IRMSTETT,,,67442,,,,,,,,,,,,,,,,,,,1993-06-01,F,,,,,45.3F,NAF1993,N,7.493217,48.592785,0.83,street,Rue de la Montagne 67310 Scharrachbergheim-Irmstett,67442_0160,G,RUE DE LA MONTAGNE,
349731844,00016,34973184400016,O,1989-01-01,NN,,,2019-11-14T14:00:53,false,4,,27,,RUE,DU MOULIN,67310,SCHARRACHBERGHEIM-IRMSTETT,,,67442,,,,,,,,,,,,,,,,,,,1999-07-01,F,,,,,01.1G,NAF1993,N,7.477552,48.587003,0.94,housenumber,27 Rue du Moulin 67310 Scharrachbergheim-Irmstett,67442_0170_00027,G,27 RUE DU MOULIN,
349731844,00024,34973184400024,O,1999-07-01,01,2018,,2020-08-25T10:44:18,true,3,,16,,RUE,DU MOULIN,67310,SCHARRACHBERGHEIM-IRMSTETT,,,67442,,,,,,,,,,,,,,,,,,,2008-01-01,A,,,,,01.21Z,NAFRev2,N,7.47959,48.587328,0.94,housenumber,16 Rue du Moulin 67310 Scharrachbergheim-Irmstett,67442_0170_00016,G,16 RUE DU MOULIN,
351689971,00023,35168997100023,O,2014-03-01,,,,2021-06-17T08:39:12,true,2,,64,,RUE,PRINCIPALE,67310,SCHARRACHBERGHEIM-IRMSTETT,,,67442,,,,,,,,,,,,,,,,,,,2021-02-22,F,,,,,68.20B,NAFRev2,N,7.494395,48.593107,0.94,housenumber,64 Rue Principale 67310 Scharrachbergheim-Irmstett,67442_0200_00064,G,64 RUE PRINCIPALE,
352358592,00017,35235859200017,O,,,,,2019-11-14T14:00:53,true,1,,103,,RUE,PRINCIPALE,67310,SCHARRACHBERGHEIM-IRMSTETT,,,67442,,,,,,,,,,,,,,,,,,,1997-03-31,F,,,,,55.3A,NAF1993,N,7.486748,48.591553,0.77,street,Rue Principale 67310 Scharrachbergheim-Irmstett,67442_0200,G,RUE PRINCIPALE,
352646780,00044,35264678000044,O,2006-12-01,01,2018,,2021-02-23T11:05:04,true,3,,4,,,SCHLOSSREBEN,67310,SCHARRACHBERGHEIM-IRMSTETT,,,67442,,,,,,,,,,,,,,,,,,,2009-02-01,A,,,,,46.65Z,NAFRev2,O,7.494515,48.595357,0.87,housenumber,4 Villa Schlossreben 67310 Scharrachbergheim-Irmstett,67442_d0vynt_00004,G,4 VILLA SCHLOSSREBEN,
353172042,00015,35317204200015,O,1989-12-01,NN,,,2019-11-14T14:00:53,true,1,,19,,RUE,PRINCIPALE,67310,SCHARRACHBERGHEIM-IRMSTETT,,,67442,,,,,,,,,,,,,,,,,,,1995-09-30,F,,,,,70.3A,NAF1993,N,7.488838,48.592474,0.94,housenumber,19 Rue Principale 67310 Scharrachbergheim-Irmstett,67442_0200_00019,G,19 RUE PRINCIPALE,
353347198,00015,35334719800015,O,1990-01-01,NN,,,2019-11-14T14:00:53,true,3,,32,,RUE,DE L EGLISE,67310,SCHARRACHBERGHEIM-IRMSTETT,,,67442,,,,,,,,,,,,,,,,,,,2008-01-01,A,,,,,01.61Z,NAFRev2,N,7.480452,48.587421,0.81,street,Rue de l'Eglise 67310 Scharrachbergheim-Irmstett,67442_0080,G,RUE DE L EGLISE,
353347305,00016,35334730500016,O,1989-12-31,NN,,,2019-11-14T14:00:53,true,3,,32,,RUE,DE L EGLISE,67310,SCHARRACHBERGHEIM-IRMSTETT,,,67442,,,,,,,,,,,,,,,,,,,2008-01-01,A,,,,,01.21Z,NAFRev2,N,7.480452,48.587421,0.81,street,Rue de l'Eglise 67310 Scharrachbergheim-Irmstett,67442_0080,G,RUE DE L EGLISE,
353353923,00017,35335392300017,O,1990-01-03,NN,,,2019-11-14T14:00:53,true,4,,135,,RUE,PRINCIPALE,67310,SCHARRACHBERGHEIM-IRMSTETT,,,67442,,,,,,,,,,,,,,,,,,,2005-02-12,F,,,,,52.2C,NAFRev1,O,7.486748,48.591553,0.77,street,Rue Principale 67310 Scharrachbergheim-Irmstett,67442_0200,G,RUE PRINCIPALE,
356000422,01414,35600042201414,O,1991-01-01,NN,,,2019-11-14T14:00:53,false,3,,,,,BATIMENT DE LA MAIRIE,67310,SCHARRACHBERGHEIM-IRMSTETT,,,67442,,,,,,,,,,,,,,,,,,,2006-10-17,F,BUREAU DE POSTE,,,,64.1A,NAFRev1,N,3.1978932,45.7681887,0.84,poi.public_building,Annexe de la mairie de Lempdes (Bâtiment public) Lempdes,https://osm.org/way/63205761,G,,
378866164,00015,37886616400015,O,1990-07-01,NN,,,2019-11-14T14:00:53,true,4,,88,,RUE,PRINCIPALE,67310,SCHARRACHBERGHEIM-IRMSTETT,,,67442,,,,,,,,,,,,,,,,,,,2012-12-31,A,,,,,01.21Z,NAFRev2,O,7.497023,48.592713,0.94,housenumber,88 Rue Principale 67310 Scharrachbergheim-Irmstett,67442_0200_00088,G,88 RUE PRINCIPALE,
379923238,00024,37992323800024,O,2001-01-02,02,2018,2562BZ,2020-09-28T09:37:42,true,4,,4,,RUE,ALTGASSE,67310,SCHARRACHBERGHEIM-IRMSTETT,,,67442,,,,,,,,,,,,,,,,,,,2020-05-01,F,,,,,33.12Z,NAFRev2,O,7.500568,48.595101,0.94,housenumber,4 Rue Altgasse 67310 Scharrachbergheim-Irmstett,67442_0008_00004,G,4 RUE ALTGASSE,
379928674,00041,37992867400041,O,2005-10-28,NN,,,2019-11-14T14:00:53,false,2,,88,,RUE,PRINCIPALE,67310,SCHARRACHBERGHEIM-IRMSTETT,,,67442,,,,,,,,,,,,,,,,,,,2005-12-31,F,,,,,52.2C,NAFRev1,O,7.497023,48.592713,0.94,housenumber,88 Rue Principale 67310 Scharrachbergheim-Irmstett,67442_0200_00088,G,88 RUE PRINCIPALE,
380325795,00025,38032579500025,O,2010-11-16,,,,2019-11-14T14:00:53,true,2,,24,,RUE,DE LA FEODALITE,67310,SCHARRACHBERGHEIM-IRMSTETT,,,67442,,,,,,,,,,,,,,,,,,,2012-04-30,F,,,,,68.20B,NAFRev2,N,7.49184,48.596521,0.94,housenumber,24 Rue de la Féodalité 67310 Scharrachbergheim-Irmstett,67442_0085_00024,G,24 RUE DE LA FEODALITE,
380460782,00010,38046078200010,O,1991-01-01,NN,,,2019-11-14T14:00:53,false,3,,23,,RUE,DU GAL WURMSER,67310,SCHARRACHBERGHEIM-IRMSTETT,,,67442,,,,,,,,,,,,,,,,,,,2004-08-24,F,,,,,60.2E,NAFRev1,N,7.490998,48.594894,0.85,housenumber,23 Rue du Général Wurmser 67310 Scharrachbergheim-Irmstett,67442_0089_00023,G,23 RUE DU GENERAL WURMSER,
380460782,00028,38046078200028,O,2009-12-01,,,,2019-11-14T14:00:53,true,2,,7,,RUE,GENERAL WURMZER,67310,SCHARRACHBERGHEIM-IRMSTETT,,,67442,,,,,,,,,,,,,,,,,,,2010-06-01,F,,,,,49.32Z,NAFRev2,N,7.493481,48.59545,0.78,housenumber,7 Rue du Général Wurmser 67310 Scharrachbergheim-Irmstett,67442_0089_00007,G,7 RUE DU GENERAL WURMSER,
380589960,00018,38058996000018,O,1991-01-01,NN,,,2019-11-14T14:00:53,false,3,P-A MR COYNE JEAN-CLAUDE,120,,RUE,DE L EGLISE,67310,SCHARRACHBERGHEIM-IRMSTETT,,,67442,,,,,,,,,,,,,,,,,,,2003-11-03,F,,,,,92.6C,NAFRev1,N,7.480452,48.587421,0.78,street,Rue de l'Eglise 67310 Scharrachbergheim-Irmstett,67442_0080,G,RUE DE L EGLISE,
380976092,00011,38097609200011,O,1991-02-01,NN,,,2019-11-14T14:00:53,true,3,,82,,RUE,PRINCIPALE,67310,SCHARRACHBERGHEIM-IRMSTETT,,,67442,,,,,,,,,,,,,,,,,,,2008-01-01,A,,,,,68.20B,NAFRev2,N,7.496442,48.59286,0.94,housenumber,82 Rue Principale 67310 Scharrachbergheim-Irmstett,67442_0200_00082,G,82 RUE PRINCIPALE,