siren,nic,siret,statutDiffusionEtablissement,dateCreationEtablissement,trancheEffectifsEtablissement,anneeEffectifsEtablissement,activitePrincipaleRegistreMetiersEtablissement,dateDernierTraitementEtablissement,etablissementSiege,nombrePeriodesEtablissement,complementAdresseEtablissement,numeroVoieEtablissement,indiceRepetitionEtablissement,typeVoieEtablissement,libelleVoieEtablissement,codePostalEtablissement,libelleCommuneEtablissement,libelleCommuneEtrangerEtablissement,distributionSpecialeEtablissement,codeCommuneEtablissement,codeCedexEtablissement,libelleCedexEtablissement,codePaysEtrangerEtablissement,libellePaysEtrangerEtablissement,complementAdresse2Etablissement,numeroVoie2Etablissement,indiceRepetition2Etablissement,typeVoie2Etablissement,libelleVoie2Etablissement,codePostal2Etablissement,libelleCommune2Etablissement,libelleCommuneEtranger2Etablissement,distributionSpeciale2Etablissement,codeCommune2Etablissement,codeCedex2Etablissement,libelleCedex2Etablissement,codePaysEtranger2Etablissement,libellePaysEtranger2Etablissement,dateDebut,etatAdministratifEtablissement,enseigne1Etablissement,enseigne2Etablissement,enseigne3Etablissement,denominationUsuelleEtablissement,activitePrincipaleEtablissement,nomenclatureActivitePrincipaleEtablissement,caractereEmployeurEtablissement,longitude,latitude,geo_score,geo_type,geo_adresse,geo_id,geo_ligne,geo_l4,geo_l5
172502312,00538,17250231200538,O,1994-07-01,,,,2019-01-14T13:28:29,false,3,,8,,PL,DE L HOTEL DE VILLE,70220,FOUGEROLLES-SAINT-VALBERT,,,70245,,,,,,,,,,,,,,,,,,,2004-05-31,F,RECETTE LOCALE DOUANES FOUGEROLLES,,,,75.1A,NAFRev1,N,6.404082,47.885589,0.9,housenumber,8 Place de l'Hotel de Ville 70220 Fougerolles-Saint-Valbert,70245_0101_00008,G,8 PLACE DE L HOTEL DE VILLE,
177002110,00167,17700211000167,O,1983-07-01,NN,,,2019-01-14T13:28:29,false,4,,19,,RUE,DE LA GARE,70220,FOUGEROLLES-SAINT-VALBERT,,,70245,,,,,,,,,,,,,,,,,,,2010-12-01,F,TRESORERIE DE FOUGEROLLES,,,,84.11Z,NAFRev2,N,6.406834,47.887251,0.94,housenumber,19 Rue de la Gare 70220 Fougerolles-Saint-Valbert,70245_0095_00019,G,19 RUE DE LA GARE,
177002219,00091,17700221900091,O,1983-07-01,,,,2019-01-14T13:28:29,false,4,,8,,PL,DE  L'HOTEL DE VILLE,70220,FOUGEROLLES-SAINT-VALBERT,,,70245,,,,,,,,,,,,,,,,,,,1993-02-01,F,RECETTE LOCALE SPECIALISEE CI FOUGEROLLE,,,,75.1A,NAF1993,N,6.404082,47.885589,0.9,housenumber,8 Place de l'Hotel de Ville 70220 Fougerolles-Saint-Valbert,70245_0101_00008,G,8 PLACE DE L HOTEL DE VILLE,
197000078,00018,19700007800018,O,1983-03-01,12,2018,,2020-08-25T10:14:21,true,3,,9,,RUE,DU COLLEGE,70220,FOUGEROLLES-SAINT-VALBERT,,BP 19,70245,,,,,,,,,,,,,,,,,,,2008-01-01,A,,,,,85.31Z,NAFRev2,N,6.405337,47.882662,0.94,housenumber,9 Rue du Collége 70220 Fougerolles-Saint-Valbert,70245_0061_00009,G,9 RUE DU COLLEGE,
200082634,00011,20008263400011,O,2019-01-01,,,,2019-01-14T13:28:29,true,1,,1,,PL,DE L'HOTEL DE VILLE,70220,FOUGEROLLES-SAINT-VALBERT,,,70245,,,,,,,,,,,,,,,,,,,2019-01-01,A,MAIRIE,,,,84.11Z,NAFRev2,O,6.404624,47.885814,0.9,housenumber,1 Place de l'Hotel de Ville 70220 Fougerolles-Saint-Valbert,70245_0101_00001,G,1 PLACE DE L HOTEL DE VILLE,
200082634,00029,20008263400029,O,2019-01-01,,,,2021-02-23T10:30:50,false,1,MAIRIE,1,,PL,DE L HOTEL DE VILLE,70220,FOUGEROLLES-SAINT-VALBERT,,,70245,,,,,,,,,,,,,,,,,,,2019-01-01,A,COMMUNE DELEGUEE DE FOUGEROLLES,,,,84.11Z,NAFRev2,N,6.404624,47.885814,0.9,housenumber,1 Place de l'Hotel de Ville 70220 Fougerolles-Saint-Valbert,70245_0101_00001,G,1 PLACE DE L HOTEL DE VILLE,
200082634,00037,20008263400037,O,2019-01-01,,,,2019-01-14T21:42:41,false,1,MAIRIE,1,,PL,DE L'EGLISE,70300,FOUGEROLLES-SAINT-VALBERT,,,70245,,,,,,,,,,,,,,,,,,,2019-01-01,A,COMMUNE DELEGUEE DE SAINT-VALBERT,,,,84.11Z,NAFRev2,N,6.395753,47.853106,0.84,housenumber,1 Place de l'Eglise 70220 Fougerolles-Saint-Valbert,70475_0015_00001,G,1 PLACE DE L EGLISE,
200082634,00045,20008263400045,O,2019-01-01,,,,2021-02-23T10:30:50,false,1,,10,,RUE,DE BLANZEY,70220,FOUGEROLLES-SAINT-VALBERT,,,70245,,,,,,,,,,,,,,,,,,,2019-01-01,A,ECOLE MATERNELLE DU CENTRE,,,,85.10Z,NAFRev2,N,6.404631,47.885146,0.94,housenumber,10 Rue de Blanzey 70220 Fougerolles-Saint-Valbert,70245_0019_00010,G,10 RUE DE BLANZEY,
200082634,00052,20008263400052,O,2019-01-01,,,,2021-02-23T10:30:50,false,1,,,,RTE,DE BLANZEY,70220,FOUGEROLLES-SAINT-VALBERT,,,70245,,,,,,,,,,,,,,,,,,,2019-01-01,A,ECOLE PRIMAIRE LES FOUGERES,,,,85.20Z,NAFRev2,N,6.402811,47.885723,0.76,street,Rue de Blanzey 70220 Fougerolles-Saint-Valbert,70245_0019,G,RUE DE BLANZEY,
200082634,00060,20008263400060,O,2019-01-01,,,,2021-02-23T10:30:50,false,1,,522,,,LE CHATEAU,70220,FOUGEROLLES-SAINT-VALBERT,,,70245,,,,,,,,,,,,,,,,,,,2019-01-01,A,ECOLE PRIMAIRE LE CHATEAU,,,,85.20Z,NAFRev2,N,6.431382,47.898105,0.94,housenumber,522 Le Chateau 70220 Fougerolles-Saint-Valbert,70245_otk4xy_00522,G,522 LE CHATEAU,
200082634,00078,20008263400078,O,2019-01-01,,,,2021-02-23T10:30:50,false,1,MAIRIE,1,,PL,DE L'HOTEL DE VILLE,70220,FOUGEROLLES-SAINT-VALBERT,,,70245,,,,,,,,,,,,,,,,,,,2019-01-01,A,EAU,,,,36.00Z,NAFRev2,N,6.404624,47.885814,0.9,housenumber,1 Place de l'Hotel de Ville 70220 Fougerolles-Saint-Valbert,70245_0101_00001,G,1 PLACE DE L HOTEL DE VILLE,
200082634,00086,20008263400086,O,2019-01-01,,,,2021-02-23T10:30:50,false,1,MAIRIE,1,,PL,DE L'HOTEL DE VILLE,70220,FOUGEROLLES-SAINT-VALBERT,,,70245,,,,,,,,,,,,,,,,,,,2019-01-01,A,ASSAINISSEMENT,,,,37.00Z,NAFRev2,N,6.404624,47.885814,0.9,housenumber,1 Place de l'Hotel de Ville 70220 Fougerolles-Saint-Valbert,70245_0101_00001,G,1 PLACE DE L HOTEL DE VILLE,
200082659,00018,20008265900018,O,2019-01-01,,,,2019-01-14T13:28:29,true,1,MAIRIE,1,,PL,DE L'HOTEL DE VILLE,70220,FOUGEROLLES-SAINT-VALBERT,,,70245,,,,,,,,,,,,,,,,,,,2019-01-01,A,,,,,88.99B,NAFRev2,N,6.404624,47.885814,0.9,housenumber,1 Place de l'Hotel de Ville 70220 Fougerolles-Saint-Valbert,70245_0101_00001,G,1 PLACE DE L HOTEL DE VILLE,
217002450,00013,21700245000013,O,1983-03-01,12,2018,,2020-08-25T10:18:44,true,5,,,,,,70220,FOUGEROLLES-SAINT-VALBERT,,,70245,,,,,,,,,,,,,,,,,,,2019-01-01,F,MAIRIE,,,,84.11Z,NAFRev2,O,,,0,,,,,,
217002450,00047,21700245000047,O,1983-12-21,02,2018,,2020-08-25T10:18:44,false,4,,10,,RUE,DE BLANZEY,70220,FOUGEROLLES-SAINT-VALBERT,,,70245,,,,,,,,,,,,,,,,,,,2019-01-01,F,ECOLE MATERNELLE DU CENTRE,,,,85.10Z,NAFRev2,N,6.404631,47.885146,0.94,housenumber,10 Rue de Blanzey 70220 Fougerolles-Saint-Valbert,70245_0019_00010,G,10 RUE DE BLANZEY,
217002450,00054,21700245000054,O,1983-12-21,11,2018,,2020-08-25T10:18:44,false,4,,,,,ROUTE DE BLANZEY,70220,FOUGEROLLES-SAINT-VALBERT,,,70245,,,,,,,,,,,,,,,,,,,2019-01-01,F,ECOLE PRIMAIRE DU CENTRE,,,,85.20Z,NAFRev2,N,6.402811,47.885723,0.69,street,Rue de Blanzey 70220 Fougerolles-Saint-Valbert,70245_0019,G,RUE DE BLANZEY,
217002450,00062,21700245000062,O,1983-12-21,01,2018,,2020-08-25T10:18:44,false,4,,522,,,LE CHATEAU,70220,FOUGEROLLES-SAINT-VALBERT,,,70245,,,,,,,,,,,,,,,,,,,2019-01-01,F,ECOLE PRIMAIRE PUBLIQUE,,,,85.20Z,NAFRev2,N,6.431382,47.898105,0.94,housenumber,522 Le Chateau 70220 Fougerolles-Saint-Valbert,70245_otk4xy_00522,G,522 LE CHATEAU,
217002450,00096,21700245000096,O,1996-12-25,01,2018,,2020-08-25T10:18:44,false,3,,,,PL,HOTEL DE VILLE,70220,FOUGEROLLES-SAINT-VALBERT,,,70245,,,,,,,,,,,,,,,,,,,2019-01-01,F,SERVICE EAU,,,,36.00Z,NAFRev2,N,6.404624,47.885814,0.89,street,Place de l'Hotel de Ville 70220 Fougerolles-Saint-Valbert,70245_0101,G,PLACE DE L HOTEL DE VILLE,
217002450,00104,21700245000104,O,1996-12-25,01,2018,,2020-08-25T10:18:44,false,3,,,,PL,HOTEL DE VILLE,70220,FOUGEROLLES-SAINT-VALBERT,,,70245,,,,,,,,,,,,,,,,,,,2019-01-01,F,SERVICE ASSAINISSEMENT,,,,37.00Z,NAFRev2,N,6.404624,47.885814,0.89,street,Place de l'Hotel de Ville 70220 Fougerolles-Saint-Valbert,70245_0101,G,PLACE DE L HOTEL DE VILLE,
217004753,00018,21700475300018,O,1983-03-01,02,2018,,2020-08-25T10:18:45,true,4,,,,,,70300,FOUGEROLLES-SAINT-VALBERT,,,70245,,,,,,,,,,,,,,,,,,,2019-01-01,F,MAIRIE,,,,84.11Z,NAFRev2,O,,,0,,,,,,
217004753,00034,21700475300034,O,1997-07-30,NN,,,2019-01-31T20:01:21,false,4,MAIRIE,,,PL,DE L EGLISE,70300,FOUGEROLLES-SAINT-VALBERT,,,70245,,,,,,,,,,,,,,,,,,,2019-01-01,F,SERVICE DES EAUX,,,,36.00Z,NAFRev2,N,6.395753,47.853106,0.82,street,Place de l'Eglise 70220 Fougerolles-Saint-Valbert,70475_0015,G,PLACE DE L EGLISE,
217004753,00042,21700475300042,O,1997-07-30,NN,,,2019-01-14T21:38:50,false,4,MAIRIE,,,PL,DE L EGLISE,70300,FOUGEROLLES-SAINT-VALBERT,,,70245,,,,,,,,,,,,,,,,,,,2012-12-25,F,SERVICE D ASSAINISSEMENT,,,,37.00Z,NAFRev2,N,6.395753,47.853106,0.82,street,Place de l'Eglise 70220 Fougerolles-Saint-Valbert,70475_0015,G,PLACE DE L EGLISE,
257003095,00011,25700309500011,O,1990-06-26,NN,,,2019-01-14T13:28:29,true,1,,,,,,70220,FOUGEROLLES-SAINT-VALBERT,,,70245,,,,,,,,,,,,,,,,,,,2000-01-07,F,,,,,70.1C,NAF1993,N,,,0,,,,,,
267002459,00019,26700245900019,O,1983-03-01,NN,,,2019-01-31T20:05:32,true,4,,,,,MAIRIE,70220,FOUGEROLLES-SAINT-VALBERT,,,70245,,,,,,,,,,,,,,,,,,,2019-01-01,F,CCAS,,,,88.99B,NAFRev2,N,3.0709671,50.6304695,0.92,poi.townhall,Hôtel de Ville Lille,https://osm.org/way/40917078,G,,
267004752,00015,26700475200015,O,1983-03-01,NN,,,2019-01-14T21:42:41,true,4,,,,,MAIRIE,70300,FOUGEROLLES-SAINT-VALBERT,,,70245,,,,,,,,,,,,,,,,,,,2016-01-01,F,CCAS,,,,88.99B,NAFRev2,N,3.0709671,50.6304695,0.92,poi.townhall,Hôtel de Ville Lille,https://osm.org/way/40917078,G,,
277000352,00017,27700035200017,O,,,,,2019-01-14T13:28:29,true,1,,,,,MAIRIE,70220,FOUGEROLLES-SAINT-VALBERT,,,70245,,,,,,,,,,,,,,,,,,,1995-12-25,F,,,,,41.0Z,NAF1993,N,3.0709671,50.6304695,0.92,poi.townhall,Hôtel de Ville Lille,https://osm.org/way/40917078,G,,
277000360,00010,27700036000010,O,,,,,2019-01-14T13:28:29,true,1,,,,,MAIRIE,70220,FOUGEROLLES-SAINT-VALBERT,,,70245,,,,,,,,,,,,,,,,,,,1995-12-25,F,,,,,41.0Z,NAF1993,N,3.0709671,50.6304695,0.92,poi.townhall,Hôtel de Ville Lille,https://osm.org/way/40917078,G,,
297005951,00019,29700595100019,O,1983-08-10,NN,,,2019-01-14T13:28:29,true,3,,,,,MAIRIE,70220,FOUGEROLLES-SAINT-VALBERT,,,70245,,,,,,,,,,,,,,,,,,,2008-01-01,A,,,,,42.99Z,NAFRev2,N,3.0709671,50.6304695,0.92,poi.townhall,Hôtel de Ville Lille,https://osm.org/way/40917078,G,,
301002655,00019,30100265500019,O,,NN,,,2019-01-14T13:28:29,true,1,,,,,LE PREMOUREZ,70220,FOUGEROLLES-SAINT-VALBERT,,,70245,,,,,,,,,,,,,,,,,,,1987-10-30,F,,,,,86.06,NAP,N,6.429422,47.907037,0.8,street,Le Premourey 70220 Fougerolles-Saint-Valbert,70245_xo29it,G,LE PREMOUREY,
301150819,00011,30115081900011,O,1900-01-01,NN,,,2019-01-14T13:28:29,true,5,,45,,,GRANDE RUE,70220,FOUGEROLLES-SAINT-VALBERT,,,70245,,,,,,,,,,,,,,,,,,,2013-06-30,F,,,,,86.23Z,NAFRev2,O,6.404288,47.888955,0.94,housenumber,45 Grande Rue 70220 Fougerolles-Saint-Valbert,70245_0098_00045,G,45 GRANDE RUE,
301177713,00015,30117771300015,O,1900-01-01,,,,2019-01-14T13:28:29,false,4,,22,,RUE,DU BAS DE LAVAL,70220,FOUGEROLLES-SAINT-VALBERT,,,70245,,,,,,,,,,,,,,,,,,,1993-12-25,F,,,,,52.3A,NAF1993,N,6.403494,47.886819,0.94,housenumber,22 Rue du Bas de Laval 70220 Fougerolles-Saint-Valbert,70245_0016_00022,G,22 RUE DU BAS DE LAVAL,
301177713,00023,30117771300023,O,1993-02-01,NN,,,2019-01-14T13:28:29,true,5,,26,,RUE,DU BAS DE LAVAL,70220,FOUGEROLLES-SAINT-VALBERT,,,70245,,,,,,,,,,,,,,,,,,,2008-01-01,F,,,,,47.73Z,NAFRev2,O,6.403264,47.886073,0.94,housenumber,26 Rue du Bas de Laval 70220 Fougerolles-Saint-Valbert,70245_0016_00026,G,26 RUE DU BAS DE LAVAL,
301450086,00014,30145008600014,O,1900-01-01,NN,,,2019-01-14T13:28:29,true,4,,24,,RUE,DU BAS DE LAVAL,70220,FOUGEROLLES-SAINT-VALBERT,,,70245,,,,,,,,,,,,,,,,,,,2003-06-02,F,,,,,80.4A,NAFRev1,O,6.403436,47.88614,0.94,housenumber,24 Rue du Bas de Laval 70220 Fougerolles-Saint-Valbert,70245_0016_00024,G,24 RUE DU BAS DE LAVAL,
301450318,00011,30145031800011,O,,NN,,,2019-01-14T13:28:29,true,1,,15,,RUE,DU BAS DE LAVAL,70220,FOUGEROLLES-SAINT-VALBERT,,,70245,,,,,,,,,,,,,,,,,,,1995-03-31,F,,,,,52.4N,NAF1993,N,6.403524,47.886077,0.94,housenumber,15 Rue du Bas de Laval 70220 Fougerolles-Saint-Valbert,70245_0016_00015,G,15 RUE DU BAS DE LAVAL,
302044094,00019,30204409400019,O,1963-01-01,NN,,,2021-07-14T03:35:52,true,5,LOT LA GERMENAIN,8,,RUE,DE LA MOTTE,70220,FOUGEROLLES-SAINT-VALBERT,,,70245,,,,,,,,,,,,,,,,,,,2009-09-01,F,,,,,43.99C,NAFRev2,O,6.388992,47.87416,0.94,housenumber,8 Rue de la Motte 70220 Fougerolles-Saint-Valbert,70245_0156_00008,G,8 RUE DE LA MOTTE,
302217518,00018,30221751800018,O,,NN,,,2019-01-14T13:28:29,true,1,,,,AV,GRAND FAHY,70220,FOUGEROLLES-SAINT-VALBERT,,,70245,,,,,,,,,,,,,,,,,,,1995-03-31,F,,,,,52.2A,NAF1993,N,6.396372,47.91842,0.68,street,Le Grand Fahys 70220 Fougerolles-Saint-Valbert,70245_0085,G,LE GRAND FAHYS,
302898465,00059,30289846500059,O,1996-01-01,NN,,,2019-01-14T13:28:29,false,5,,703,,,LE CHATEAU,70220,FOUGEROLLES-SAINT-VALBERT,,,70245,,,,,,,,,,,,,,,,,,,2010-01-16,F,,,,,33.12Z,NAFRev2,N,6.429936,47.895901,0.94,housenumber,703 Le Chateau 70220 Fougerolles-Saint-Valbert,70245_otk4xy_00703,G,703 LE CHATEAU,
302944905,00017,30294490500017,O,1985-07-01,NN,,,2019-01-14T13:28:29,true,3,,29,,,LE CHATEAU,70220,FOUGEROLLES-SAINT-VALBERT,,,70245,,,,,,,,,,,,,,,,,,,2008-01-01,A,,,,,68.20B,NAFRev2,N,6.426794,47.894666,0.94,housenumber,29 Le Chateau 70220 Fougerolles-Saint-Valbert,70245_otk4xy_00029,G,29 LE CHATEAU,
302944913,00011,30294491300011,O,1900-01-01,NN,,,2019-01-14T13:28:29,true,4,,,,,,70220,FOUGEROLLES-SAINT-VALBERT,,,70245,,,,,,,,,,,,,,,,,,,1998-08-04,F,,,,,91.3E,NAF1993,N,,,0,,,,,,
303809941,00022,30380994100022,O,1983-02-10,NN,,,2019-01-14T13:28:29,true,4,,27,,RUE,PASTEUR,70220,FOUGEROLLES-SAINT-VALBERT,,,70245,,,,,,,,,,,,,,,,,,,2009-08-31,F,,,,,63.91Z,NAFRev2,N,6.2535542,49.4845616,0.98,poi,Rue Pasteur (Pont) Puttelange-lès-Thionville,https://osm.org/way/236085579,G,,
304366081,00012,30436608100012,O,1900-01-01,NN,,,2019-01-14T13:28:29,true,3,,,,RTE,DE BLANZEY,70220,FOUGEROLLES-SAINT-VALBERT,,,70245,,,,,,,,,,,,,,,,,,,2008-01-01,A,,,,,94.99Z,NAFRev2,N,6.402811,47.885723,0.76,street,Rue de Blanzey 70220 Fougerolles-Saint-Valbert,70245_0019,G,RUE DE BLANZEY,
304980592,00022,30498059200022,O,1980-07-15,01,2018,1610AQ,2020-08-25T10:23:01,true,6,,334,,LD,LE PREDURUPT,70220,FOUGEROLLES-SAINT-VALBERT,,,70245,,,,,,,,,,,,,,,,,,,2019-12-31,F,,,,,46.77Z,NAFRev2,O,6.382341,47.900588,0.94,housenumber,334 Le Predurupt 70220 Fougerolles-Saint-Valbert,70245_3450un_00334,G,334 LE PREDURUPT,
304980808,00014,30498080800014,O,1964-01-01,NN,,,2019-01-14T13:28:29,true,1,,8,,RUE,DU BAS DE LAVAL,70220,FOUGEROLLES-SAINT-VALBERT,,,70245,,,,,,,,,,,,,,,,,,,1999-03-31,F,,,,,52.4C,NAF1993,O,6.405169,47.886582,0.94,housenumber,8 Rue du Bas de Laval 70220 Fougerolles-Saint-Valbert,70245_0016_00008,G,8 RUE DU BAS DE LAVAL,
305863524,00032,30586352400032,O,2012-01-01,,,,2021-02-23T10:37:16,true,1,,11,,RUE,DU STADE,70220,FOUGEROLLES-SAINT-VALBERT,,,70245,,,,,,,,,,,,,,,,,,,2012-01-01,A,,,,,01.49Z,NAFRev2,N,6.405262,47.879994,0.94,housenumber,11 Rue du Stade 70220 Fougerolles-Saint-Valbert,70245_0225_00011,G,11 RUE DU STADE,
305868200,00067,30586820000067,O,2006-07-01,,,4339ZZ,2020-09-01T03:45:10,false,3,L'ERMITAGE,,,,L ERMITAGE,70300,FOUGEROLLES-SAINT-VALBERT,,,70245,,,,,,,,,,,,,,,,,,,2020-08-31,F,,,,,56.10A,NAFRev2,N,6.396248,47.853733,0.93,street,Rue de l'Ermitage 70220 Fougerolles-Saint-Valbert,70475_0035,G,RUE DE L ERMITAGE,
306043753,00012,30604375300012,O,,NN,,,2019-01-14T13:28:29,true,1,,32,,RUE,DE LA GARE,70220,FOUGEROLLES-SAINT-VALBERT,,,70245,,,,,,,,,,,,,,,,,,,1996-05-13,F,,,,,74.3B,NAF1993,N,6.409202,47.887809,0.94,housenumber,32 Rue de la Gare 70220 Fougerolles-Saint-Valbert,70245_0095_00032,G,32 RUE DE LA GARE,
306084989,00012,30608498900012,O,,,,,2019-01-14T13:28:29,true,1,,32,,,GRANDE RUE,70220,FOUGEROLLES-SAINT-VALBERT,,,70245,,,,,,,,,,,,,,,,,,,1985-12-25,F,,,,,67.01,NAP,N,6.404438,47.889039,0.94,housenumber,32 Grande Rue 70220 Fougerolles-Saint-Valbert,70245_0098_00032,G,32 GRANDE RUE,
306996836,00012,30699683600012,O,1978-01-01,,,,2019-01-14T13:28:29,false,5,,,,,LES CHAVANNES,70220,FOUGEROLLES-SAINT-VALBERT,,,70245,,,,,,,,,,,,,,,,,,,2006-05-11,F,,,,,36.1K,NAFRev1,N,6.386593,47.887772,0.94,street,Les Chavannes 70220 Fougerolles-Saint-Valbert,70245_j0lcxq,G,LES CHAVANNES,
307022772,00015,30702277200015,O,1900-01-01,NN,,,2019-01-14T13:28:29,true,3,,,,,,70220,FOUGEROLLES-SAINT-VALBERT,,,70245,,,,,,,,,,,,,,,,,,,2008-01-01,A,,,,,94.99Z,NAFRev2,N,,,0,,,,,,
307023101,00016,30702310100016,O,1900-01-01,NN,,,2019-01-14T13:28:29,true,3,,5,,RUE,DU STADE,70220,FOUGEROLLES-SAINT-VALBERT,,,70245,,,,,,,,,,,,,,,,,,,2008-01-01,A,,,,,94.99Z,NAFRev2,N,6.404739,47.882577,0.94,housenumber,5 Rue du Stade 70220 Fougerolles-Saint-Valbert,70245_0225_00005,G,5 RUE DU STADE,
307023119,00018,30702311900018,O,1900-01-01,NN,,,2019-01-14T13:28:29,true,3,,,,,CURE,70220,FOUGEROLLES-SAINT-VALBERT,,,70245,,,,,,,,,,,,,,,,,,,2004-12-31,F,,,,,91.3E,NAFRev1,N,6.1182937,47.2251843,0.89,poi.park,Cure (Parc) Saône,https://osm.org/way/408910226,G,,
307573105,00011,30757310500011,O,,NN,,,2019-01-14T13:28:29,true,1,,15,,RUE,GRANDE RUE,70220,FOUGEROLLES-SAINT-VALBERT,,,70245,,,,,,,,,,,,,,,,,,,1987-12-31,F,,,,,64.11,NAP,N,6.405007,47.887424,0.83,housenumber,15 Grande Rue 70220 Fougerolles-Saint-Valbert,70245_0098_00015,G,15 GRANDE RUE,
309202679,00010,30920267900010,O,1977-01-01,NN,,,2019-01-14T13:28:29,true,3,,,,LD,LE CHATEAU,70220,FOUGEROLLES-SAINT-VALBERT,,,70245,,,,,,,,,,,,,,,,,,,2005-09-30,F,,,,,15.1F,NAFRev1,N,6.425573,47.893399,0.94,street,Le Chateau 70220 Fougerolles-Saint-Valbert,70245_otk4xy,G,LE CHATEAU,
309396513,00025,30939651300025,O,2016-07-30,NN,,4399CZ,2019-11-18T20:22:40,true,3,,29,,RUE,DE LA GARE,70220,FOUGEROLLES-SAINT-VALBERT,,,70245,,,,,,,,,,,,,,,,,,,2018-12-31,F,,,,,43.99C,NAFRev2,O,6.408206,47.88872,0.94,housenumber,29 Rue de la Gare 70220 Fougerolles-Saint-Valbert,70245_0095_00029,G,29 RUE DE LA GARE,
309441798,00019,30944179800019,O,1900-01-01,NN,,,2019-01-14T13:28:29,false,3,,16,,,GRANDE RUE,70220,FOUGEROLLES-SAINT-VALBERT,,,70245,,,,,,,,,,,,,,,,,,,1991-12-31,F,,,,,81.21,NAP,N,6.405071,47.887559,0.94,housenumber,16 Grande Rue 70220 Fougerolles-Saint-Valbert,70245_0098_00016,G,16 GRANDE RUE,
309441798,00027,30944179800027,O,2016-05-01,,,,2021-02-23T10:38:16,true,1,,26,,,LA GABIOTTE,70220,FOUGEROLLES-SAINT-VALBERT,,,70245,,,,,,,,,,,,,,,,,,,2016-05-01,A,,,,,47.99A,NAFRev2,N,6.387491,47.869444,0.94,housenumber,26 La Gabiotte 70220 Fougerolles-Saint-Valbert,70245_mcg585_00026,G,26 LA GABIOTTE,
309443034,00017,30944303400017,O,,NN,,,2019-01-14T13:28:29,true,1,,16,,,GRANDE RUE,70220,FOUGEROLLES-SAINT-VALBERT,,,70245,,,,,,,,,,,,,,,,,,,1991-12-31,F,,,,,81.21,NAP,N,6.405071,47.887559,0.94,housenumber,16 Grande Rue 70220 Fougerolles-Saint-Valbert,70245_0098_00016,G,16 GRANDE RUE,
310014501,00012,31001450100012,O,1900-01-01,NN,,,2019-01-14T13:28:29,true,4,,,,,,70220,FOUGEROLLES-SAINT-VALBERT,,,70245,,,,,,,,,,,,,,,,,,,1995-12-25,F,,,,,52.2C,NAF1993,N,,,0,,,,,,
310035902,00017,31003590200017,O,,NN,,,2019-01-14T13:28:29,true,1,,,,RTE,DE GROSLIERES,70220,FOUGEROLLES-SAINT-VALBERT,,,70245,,,,,,,,,,,,,,,,,,,1995-12-31,F,,,,,45.4J,NAF1993,N,6.448606,47.890003,0.59,street,Hameau de Croslieres 70220 Fougerolles-Saint-Valbert,70245_b421,G,HAMEAU DE CROSLIERES,
310143805,00029,31014380500029,O,1983-10-17,NN,,,2019-01-14T13:28:29,true,3,,17,,RTE,DE LUXEUIL,70220,FOUGEROLLES-SAINT-VALBERT,,,70245,,,,,,,,,,,,,,,,,,,2008-01-01,A,,,,,68.20B,NAFRev2,N,6.397811,47.883883,0.79,housenumber,17 Rue de Luxeuil 70220 Fougerolles-Saint-Valbert,70245_0130_00017,G,17 RUE DE LUXEUIL,
310380001,00027,31038000100027,O,,NN,,,2019-01-14T13:28:29,true,1,,,,,,70220,FOUGEROLLES-SAINT-VALBERT,,,70245,,,,,,,,,,,,,,,,,,,,F,,,,,62.46,NAP,N,,,0,,,,,,
310600077,00021,31060007700021,O,1991-01-01,NN,,,2019-01-14T13:28:29,true,6,,18,,RUE,DU BAS DE LAVAL,70220,FOUGEROLLES-SAINT-VALBERT,,,70245,,,,,,,,,,,,,,,,,,,2015-10-01,F,,,,,86.21Z,NAFRev2,O,6.40404,47.886499,0.94,housenumber,18 Rue du Bas de Laval 70220 Fougerolles-Saint-Valbert,70245_0016_00018,G,18 RUE DU BAS DE LAVAL,
310629340,00020,31062934000020,O,1987-10-01,NN,,,2019-01-14T13:28:29,true,4,,69,,,LE PRE DURUPT,70220,FOUGEROLLES-SAINT-VALBERT,,,70245,,,,,,,,,,,,,,,,,,,2005-12-31,F,,,,,45.3E,NAFRev1,O,6.387766,47.902783,0.79,housenumber,69 Le Predurupt 70220 Fougerolles-Saint-Valbert,70245_3450un_00069,G,69 LE PREDURUPT,
310661863,00012,31066186300012,O,1977-01-01,NN,,,2019-01-14T13:28:29,true,4,,,,LD,GRAND FAHYS,70220,FOUGEROLLES-SAINT-VALBERT,,,70245,,,,,,,,,,,,,,,,,,,2011-10-31,F,,,,,43.32A,NAFRev2,N,6.396372,47.91842,0.93,street,Le Grand Fahys 70220 Fougerolles-Saint-Valbert,70245_0085,G,LE GRAND FAHYS,
311022081,00013,31102208100013,O,,,,,2019-01-14T13:28:29,true,1,,,,,LOTISSEMENT GERMENAIN,70220,FOUGEROLLES-SAINT-VALBERT,,,70245,,,,,,,,,,,,,,,,,,,1984-12-25,F,,,,,77.10,NAP,N,6.383754,47.868575,0.51,locality,Bois de la Germenain 1er C (Fougerolles) 70220 Fougerolles-Saint-Valbert,70245_b024,G,BOIS DE LA GERMENAIN 1ER C,FOUGEROLLES
311471155,00029,31147115500029,O,1982-12-13,NN,,,2019-01-14T13:28:29,true,7,,,,RUE,DE LA MOTTE,70220,FOUGEROLLES-SAINT-VALBERT,,,70245,,,,,,,,,,,,,,,,,,,2011-06-30,F,,,,,68.20B,NAFRev2,N,6.390142,47.874982,0.94,street,Rue de la Motte 70220 Fougerolles-Saint-Valbert,70245_0156,G,RUE DE LA MOTTE,
311501464,00029,31150146400029,O,,NN,,,2019-01-14T13:28:29,true,1,,332,,,LE PREDURUPT,70220,FOUGEROLLES-SAINT-VALBERT,,,70245,,,,,,,,,,,,,,,,,,,1992-10-01,F,,,,,51.1R,NAF1993,N,6.38388,47.901358,0.94,housenumber,332 Le Predurupt 70220 Fougerolles-Saint-Valbert,70245_3450un_00332,G,332 LE PREDURUPT,
312478266,00561,31247826600561,O,2002-12-11,NN,,,2019-01-14T13:28:29,false,4,RESIDENCE LA COMBEAUTE,,,PL,CHARLES DE GAULLE,70220,FOUGEROLLES-SAINT-VALBERT,,,70245,,,,,,,,,,,,,,,,,,,2010-03-01,F,,,,,56.29A,NAFRev2,O,6.403807,47.88636,0.86,street,Place Charles de Gaulle 70220 Fougerolles-Saint-Valbert,70245_13rebv,G,PLACE CHARLES DE GAULLE,
312663792,00025,31266379200025,O,,NN,,,2019-01-14T13:28:29,true,1,,32,,,GRANDE RUE,70220,FOUGEROLLES-SAINT-VALBERT,,,70245,,,,,,,,,,,,,,,,,,,,F,,,,,67.01,NAP,N,6.404438,47.889039,0.94,housenumber,32 Grande Rue 70220 Fougerolles-Saint-Valbert,70245_0098_00032,G,32 GRANDE RUE,
312886765,00022,31288676500022,O,1987-08-31,01,2018,4399CZ,2020-08-25T10:25:33,true,3,,44,,,LES GRANGES,70220,FOUGEROLLES-SAINT-VALBERT,,,70245,,,,,,,,,,,,,,,,,,,2008-01-01,A,,,,,81.30Z,NAFRev2,N,6.401427,47.870552,0.94,housenumber,44 Les Granges 70220 Fougerolles-Saint-Valbert,70245_42ujzu_00044,G,44 LES GRANGES,
312902760,00056,31290276000056,O,1996-01-15,NN,,,2019-01-14T13:28:29,false,4,,11,A,RUE,DU BAS DE LAVAL,70220,FOUGEROLLES-SAINT-VALBERT,,,70245,,,,,,,,,,,,,,,,,,,2009-05-28,F,,,,,71.11Z,NAFRev2,N,6.403841,47.886157,0.87,housenumber,11 a Rue du Bas de Laval 70220 Fougerolles-Saint-Valbert,70245_0016_00011_a,G,11 A RUE DU BAS DE LAVAL,
313157141,00026,31315714100026,O,1981-10-19,NN,,,2019-01-14T13:28:29,true,5,,9,,RUE,PASTEUR,70220,FOUGEROLLES-SAINT-VALBERT,,,70245,,,,,,,,,,,,,,,,,,,2008-03-31,F,,,,,43.22A,NAFRev2,O,6.395658,47.882656,0.87,housenumber,9 Rue Louis Pasteur 70220 Fougerolles-Saint-Valbert,70245_0175_00009,G,9 RUE LOUIS PASTEUR,
313433732,00028,31343373200028,O,1986-09-01,NN,,,2019-01-14T13:28:29,true,5,,45,,,GRANDE RUE,70220,FOUGEROLLES-SAINT-VALBERT,,,70245,,,,,,,,,,,,,,,,,,,2013-06-30,F,,,,,86.23Z,NAFRev2,O,6.404288,47.888955,0.94,housenumber,45 Grande Rue 70220 Fougerolles-Saint-Valbert,70245_0098_00045,G,45 GRANDE RUE,
313903478,00011,31390347800011,O,1978-01-01,NN,,,2019-01-14T13:28:29,true,3,,,,,LE PETIT FAHYS,70220,FOUGEROLLES-SAINT-VALBERT,,,70245,,,,,,,,,,,,,,,,,,,2005-12-31,F,,,,,01.2G,NAFRev1,N,6.401526,47.905374,0.94,street,Le Petit Fahys 70220 Fougerolles-Saint-Valbert,70245_0086,G,LE PETIT FAHYS,
314137399,00015,31413739900015,O,,NN,,,2019-01-14T13:28:29,true,1,,,,,,70220,FOUGEROLLES-SAINT-VALBERT,,,70245,,,,,,,,,,,,,,,,,,,1986-06-30,F,,,,,62.46,NAP,N,,,0,,,,,,