siren,nic,siret,statutDiffusionEtablissement,dateCreationEtablissement,trancheEffectifsEtablissement,anneeEffectifsEtablissement,activitePrincipaleRegistreMetiersEtablissement,dateDernierTraitementEtablissement,etablissementSiege,nombrePeriodesEtablissement,complementAdresseEtablissement,numeroVoieEtablissement,indiceRepetitionEtablissement,typeVoieEtablissement,libelleVoieEtablissement,codePostalEtablissement,libelleCommuneEtablissement,libelleCommuneEtrangerEtablissement,distributionSpecialeEtablissement,codeCommuneEtablissement,codeCedexEtablissement,libelleCedexEtablissement,codePaysEtrangerEtablissement,libellePaysEtrangerEtablissement,complementAdresse2Etablissement,numeroVoie2Etablissement,indiceRepetition2Etablissement,typeVoie2Etablissement,libelleVoie2Etablissement,codePostal2Etablissement,libelleCommune2Etablissement,libelleCommuneEtranger2Etablissement,distributionSpeciale2Etablissement,codeCommune2Etablissement,codeCedex2Etablissement,libelleCedex2Etablissement,codePaysEtranger2Etablissement,libellePaysEtranger2Etablissement,dateDebut,etatAdministratifEtablissement,enseigne1Etablissement,enseigne2Etablissement,enseigne3Etablissement,denominationUsuelleEtablissement,activitePrincipaleEtablissement,nomenclatureActivitePrincipaleEtablissement,caractereEmployeurEtablissement,longitude,latitude,geo_score,geo_type,geo_adresse,geo_id,geo_ligne,geo_l4,geo_l5
218502292,00012,21850229200012,O,1983-03-01,02,2018,,2020-08-25T10:19:27,true,4,,21,,RUE,DE LA MAIRIE,85120,SAINT-HILAIRE-DE-VOUST,,,85229,,,,,,,,,,,,,,,,,,,2008-01-01,A,MAIRIE,,,,84.11Z,NAFRev2,O,-0.647985,46.589368,0.94,housenumber,21 Rue de la Mairie 85120 Saint-Hilaire-de-Voust,85229_0023_00021,G,21 RUE DE LA MAIRIE,
218502292,00046,21850229200046,O,2001-01-01,NN,,,2019-11-14T14:01:02,false,4,MAIRIE,21,,RUE,DE LA MAIRIE,85120,SAINT-HILAIRE-DE-VOUST,,,85229,,,,,,,,,,,,,,,,,,,2008-01-01,F,LOTISSEMENT,,,,42.99Z,NAFRev2,N,-0.647985,46.589368,0.94,housenumber,21 Rue de la Mairie 85120 Saint-Hilaire-de-Voust,85229_0023_00021,G,21 RUE DE LA MAIRIE,
258500438,00019,25850043800019,O,1983-03-01,NN,,,2019-11-14T14:01:02,true,5,MAIRIE,21,,RUE,DE LA MAIRIE,85120,SAINT-HILAIRE-DE-VOUST,,,85229,,,,,,,,,,,,,,,,,,,2010-12-23,F,,,,,84.13Z,NAFRev2,N,-0.647985,46.589368,0.94,housenumber,21 Rue de la Mairie 85120 Saint-Hilaire-de-Voust,85229_0023_00021,G,21 RUE DE LA MAIRIE,
268502689,00048,26850268900048,O,2006-03-07,11,2018,,2020-08-25T10:21:25,false,2,,,,RUE,DE L ECOLE,85120,SAINT-HILAIRE-DE-VOUST,,,85229,,,,,,,,,,,,,,,,,,,2009-03-08,A,MARPA LA FRAGONNETTE,,,,87.30A,NAFRev2,O,-0.649181,46.59081,0.94,street,Rue de l'Ecole 85120 Saint-Hilaire-de-Voust,85229_0022,G,RUE DE L ECOLE,
268503760,00012,26850376000012,O,1993-01-01,NN,,,2019-11-14T14:01:02,true,4,MAIRIE,21,,RUE,DE LA MAIRIE,85120,SAINT-HILAIRE-DE-VOUST,,,85229,,,,,,,,,,,,,,,,,,,2016-01-01,F,CCAS,,,,88.99B,NAFRev2,N,-0.647985,46.589368,0.94,housenumber,21 Rue de la Mairie 85120 Saint-Hilaire-de-Voust,85229_0023_00021,G,21 RUE DE LA MAIRIE,
300377728,00013,30037772800013,O,,,,,2019-11-14T14:01:02,true,1,,,,,,85120,SAINT-HILAIRE-DE-VOUST,,,85229,,,,,,,,,,,,,,,,,,,,F,,,,,92.12,NAP,N,,,0,,,,,,
301184255,00018,30118425500018,O,,NN,,,2019-11-14T14:01:02,true,1,,,,,BOURG,85120,SAINT-HILAIRE-DE-VOUST,,,85229,,,,,,,,,,,,,,,,,,,,F,,,,,67.08,NAP,N,-1.229143,44.2011043,0.89,poi.school,École du bourg Mimizan,https://osm.org/way/35215942,G,,
302314273,00012,30231427300012,O,1975-01-01,NN,,,2019-11-14T14:01:02,true,5,,27,,RUE,DU MESNIL,85120,SAINT-HILAIRE-DE-VOUST,,,85229,,,,,,,,,,,,,,,,,,,2008-06-30,F,,,,,43.99C,NAFRev2,O,-0.648804,46.592456,0.94,housenumber,27 Rue du Mesnil 85120 Saint-Hilaire-de-Voust,85229_0039_00027,G,27 RUE DU MESNIL,
302620380,00022,30262038000022,O,,NN,,,2019-11-14T14:01:02,true,1,,,,,BOURG,85120,SAINT-HILAIRE-DE-VOUST,,,85229,,,,,,,,,,,,,,,,,,,1993-12-15,F,,,,,45.3F,NAF1993,N,-1.229143,44.2011043,0.89,poi.school,École du bourg Mimizan,https://osm.org/way/35215942,G,,
305810475,00015,30581047500015,O,,NN,,,2019-11-14T14:01:02,true,1,,,,,LE BOURG,85120,SAINT-HILAIRE-DE-VOUST,,,85229,,,,,,,,,,,,,,,,,,,1994-12-31,F,,,,,45.2V,NAF1993,O,2.212915,47.9910304,0.9,poi.bar,Le Bourg (Bar) Ingrannes,https://osm.org/node/1718543174,G,,
307119867,00025,30711986700025,O,1983-09-09,NN,,,2019-11-14T14:01:02,true,4,,8,,RUE,DU RELAIS,85120,SAINT-HILAIRE-DE-VOUST,,,85229,,,,,,,,,,,,,,,,,,,2010-03-31,F,,,,,43.34Z,NAFRev2,N,-0.649351,46.589324,0.94,housenumber,8 Rue du Relais 85120 Saint-Hilaire-de-Voust,85229_0043_00008,G,8 RUE DU RELAIS,
307413443,00010,30741344300010,O,,,,,2019-11-14T14:01:02,true,1,,,,,BOURG,85120,SAINT-HILAIRE-DE-VOUST,,,85229,,,,,,,,,,,,,,,,,,,1985-12-25,F,,,,,00.32,NAP,N,-1.229143,44.2011043,0.89,poi.school,École du bourg Mimizan,https://osm.org/way/35215942,G,,
308230564,00012,30823056400012,O,,,,,2019-11-14T14:01:02,true,1,,,,,BOURG,85120,SAINT-HILAIRE-DE-VOUST,,,85229,,,,,,,,,,,,,,,,,,,1984-12-25,F,,,,,62.11,NAP,N,-1.229143,44.2011043,0.89,poi.school,École du bourg Mimizan,https://osm.org/way/35215942,G,,
308847011,00019,30884701100019,O,,NN,,,2019-11-14T14:01:02,true,1,,,,,BOURG,85120,SAINT-HILAIRE-DE-VOUST,,,85229,,,,,,,,,,,,,,,,,,,,F,,,,,67.01,NAP,N,-1.229143,44.2011043,0.89,poi.school,École du bourg Mimizan,https://osm.org/way/35215942,G,,
310188834,00025,31018883400025,O,1900-01-01,32,2018,,2020-08-25T10:24:32,true,4,,,,RTE,DE LA CHATAIGNERAIE,85120,SAINT-HILAIRE-DE-VOUST,,,85229,,,,,,,,,,,,,,,,,,,2008-01-01,A,,,,,25.62B,NAFRev2,O,-0.660786,46.594518,0.86,locality,Route de la Chataigneraie 85120 Saint-Hilaire-de-Voust,85229_0015,G,ROUTE DE LA CHATAIGNERAIE,
315025114,00010,31502511400010,O,,NN,,,2019-11-14T14:01:02,true,1,,,,,L ARLANDIERE,85120,SAINT-HILAIRE-DE-VOUST,,,85229,,,,,,,,,,,,,,,,,,,1987-02-23,F,,,,,01.07,NAP,N,-0.676679,46.598426,0.38,locality,La Haute Levraudiere 85120 Saint-Hilaire-de-Voust,85229_b149,G,LA HAUTE LEVRAUDIERE,
316537273,00013,31653727300013,O,,,,,2019-11-14T14:01:02,true,1,,,,,LA LIBAUDIERE,85120,SAINT-HILAIRE-DE-VOUST,,,85229,,,,,,,,,,,,,,,,,,,1996-12-31,F,,,,,01.3Z,NAF1993,N,-1.112177,47.488545,0.89,poi.residential,La Libaudière (Zone résidentielle) Vallons-de-l'Erdre,https://osm.org/way/381939008,G,,
316537315,00012,31653731500012,O,,NN,,,2020-08-20T03:48:55,true,1,,,,,LA BODIMATIERE,85120,SAINT-HILAIRE-DE-VOUST,,,85229,,,,,,,,,,,,,,,,,,,1988-01-01,F,,,,,01.56,NAP,N,-0.675743,46.597575,0.45,locality,La Basse Levraudiere 85120 Saint-Hilaire-de-Voust,85229_b008,G,LA BASSE LEVRAUDIERE,
317726198,00045,31772619800045,O,1998-11-01,,,,2019-11-14T14:01:02,false,3,,,,,LA BOIZOTIERE,85120,SAINT-HILAIRE-DE-VOUST,,,85229,,,,,,,,,,,,,,,,,,,1999-03-31,F,,,,,74.2C,NAF1993,N,-0.675743,46.597575,0.47,locality,La Basse Levraudiere 85120 Saint-Hilaire-de-Voust,85229_b008,G,LA BASSE LEVRAUDIERE,
320167737,00016,32016773700016,O,1980-08-01,NN,,,2019-11-14T14:01:02,true,5,,,,,LA CLAVELIERE,85120,SAINT-HILAIRE-DE-VOUST,,,85229,,,,,,,,,,,,,,,,,,,2015-10-23,F,,,,,01.24Z,NAFRev2,N,4.8169128,45.709658,0.89,poi.school,Collège La Clavelière (École) Oullins,https://osm.org/way/172755383,G,,
320922396,00017,32092239600017,O,1980-10-01,01,2018,,2020-08-25T10:28:57,true,3,,,,,LA JAUDONNIERE,85120,SAINT-HILAIRE-DE-VOUST,,,85229,,,,,,,,,,,,,,,,,,,2008-01-01,A,,,,,01.41Z,NAFRev2,N,-0.9595912,46.6599053,0.9,poi.quarry,(Carrière) La Jaudonnière,https://osm.org/way/248209591,G,,
321812653,00012,32181265300012,O,,NN,,,2019-11-14T14:01:02,true,1,,,,,BOURG,85120,SAINT-HILAIRE-DE-VOUST,,,85229,,,,,,,,,,,,,,,,,,,1995-06-30,F,,,,,52.1B,NAF1993,N,-1.229143,44.2011043,0.89,poi.school,École du bourg Mimizan,https://osm.org/way/35215942,G,,
322575341,00019,32257534100019,O,1977-01-01,NN,,,2019-11-14T14:01:02,true,4,,,,,LA ROUSSIERE,85120,SAINT-HILAIRE-DE-VOUST,,,85229,,,,,,,,,,,,,,,,,,,2002-06-30,F,,,,,74.8K,NAF1993,N,-0.648129,46.605184,0.85,locality,La Petite Roussiere 85120 Saint-Hilaire-de-Voust,85229_b193,G,LA PETITE ROUSSIERE,
325186468,00014,32518646800014,O,1982-03-03,NN,,,2019-11-14T14:01:02,true,4,,,,,LA VERGNAIE,85120,SAINT-HILAIRE-DE-VOUST,,,85229,,,,,,,,,,,,,,,,,,,2008-01-01,A,,,,,01.41Z,NAFRev2,N,-1.4962439,46.8995233,0.89,poi.track,Chemin de la Vergnaie Rocheservière,https://osm.org/way/58572362,G,,
326020906,00011,32602090600011,O,1982-12-01,NN,,,2019-11-14T14:01:02,true,3,,,,,LA CROISINIERE,85120,SAINT-HILAIRE-DE-VOUST,,,85229,,,,,,,,,,,,,,,,,,,2008-01-01,A,,,,,77.31Z,NAFRev2,N,-0.648129,46.605184,0.4,locality,La Petite Roussiere 85120 Saint-Hilaire-de-Voust,85229_b193,G,LA PETITE ROUSSIERE,
326243086,00013,32624308600013,O,1977-04-01,01,2018,,2021-02-23T10:48:22,true,5,,,,,LA FRANCHISSIERE,85120,SAINT-HILAIRE-DE-VOUST,,,85229,,,,,,,,,,,,,,,,,,,2010-12-31,A,,,,,01.46Z,NAFRev2,O,-0.648129,46.605184,0.45,locality,La Petite Roussiere 85120 Saint-Hilaire-de-Voust,85229_b193,G,LA PETITE ROUSSIERE,
328718432,00011,32871843200011,O,1983-11-01,NN,,,2019-11-14T14:01:02,false,3,,,,LD,ARLANDIERE,85120,SAINT-HILAIRE-DE-VOUST,,,85229,,,,,,,,,,,,,,,,,,,2006-10-11,F,,,,,01.3Z,NAFRev1,N,-0.676679,46.598426,0.43,locality,La Haute Levraudiere 85120 Saint-Hilaire-de-Voust,85229_b149,G,LA HAUTE LEVRAUDIERE,
328718432,00029,32871843200029,O,2006-10-12,,,,2019-11-14T14:01:02,true,2,,,,,LA CLAVELIERE,85120,SAINT-HILAIRE-DE-VOUST,,,85229,,,,,,,,,,,,,,,,,,,2008-01-01,A,,,,,01.11Z,NAFRev2,N,4.8169128,45.709658,0.89,poi.school,Collège La Clavelière (École) Oullins,https://osm.org/way/172755383,G,,
329235774,00018,32923577400018,O,,,,,2019-11-14T14:01:02,true,1,,,,LD,LA MAISON NEUVE,85120,SAINT-HILAIRE-DE-VOUST,,,85229,,,,,,,,,,,,,,,,,,,1997-12-31,F,,,,,71.3A,NAF1993,N,-0.649464,46.593861,0.94,street,La Maison Neuve 85120 Saint-Hilaire-de-Voust,85229_b159,G,LA MAISON NEUVE,
329622104,00019,32962210400019,O,,NN,,,2019-11-14T14:01:02,true,1,,,,,LE PRESBYTERE,85120,SAINT-HILAIRE-DE-VOUST,,,85229,,,,,,,,,,,,,,,,,,,1988-12-25,F,,,,,97.22,NAP,N,2.9156717,43.7557678,0.9,poi.alpine_hut,Le Presbytère (Refuge) Brusque,https://osm.org/node/4343789589,G,,
329835763,00015,32983576300015,O,1984-10-01,NN,,,2019-11-14T14:01:02,true,4,,,,,LA CHESNELIERE,85120,SAINT-HILAIRE-DE-VOUST,,,85229,,,,,,,,,,,,,,,,,,,2014-01-01,A,,,,,01.50Z,NAFRev2,N,-0.6494614,46.591108,0.89,poi.castle,Logis de la Chesnelière (Château) Saint-Hilaire-de-Voust,https://osm.org/node/2584839753,G,,
329835763,00023,32983576300023,O,2018-06-01,,,,2019-11-14T14:01:02,false,1,,,,,LA LAUDINIERE,85120,SAINT-HILAIRE-DE-VOUST,,,85229,,,,,,,,,,,,,,,,,,,2018-06-01,A,,,,,35.11Z,NAFRev2,N,-0.676679,46.598426,0.57,locality,La Haute Levraudiere 85120 Saint-Hilaire-de-Voust,85229_b149,G,LA HAUTE LEVRAUDIERE,
330616764,00016,33061676400016,O,1984-08-01,NN,,,2019-11-14T14:01:02,true,3,,10,,RUE,DE LA VENDEE,85120,SAINT-HILAIRE-DE-VOUST,,,85229,,,,,,,,,,,,,,,,,,,2006-12-31,F,,,,,52.2C,NAFRev1,N,-0.649744,46.591279,0.94,housenumber,10 Rue de la Vendée 85120 Saint-Hilaire-de-Voust,85229_0025_00010,G,10 RUE DE LA VENDEE,
330892514,00077,33089251400077,O,2013-01-01,,,,2021-01-15T08:39:22,true,12,,26,,RUE,DE LA VENDEE,85120,SAINT-HILAIRE-DE-VOUST,,,85229,,,,,,,,,,,,,,,,,,,2020-12-16,F,,,,,80.20Z,NAFRev2,N,-0.6502,46.592309,0.94,housenumber,26 Rue de la Vendée 85120 Saint-Hilaire-de-Voust,85229_0025_00026,G,26 RUE DE LA VENDEE,
331266486,00017,33126648600017,O,,NN,,,2019-11-14T14:01:02,true,1,,,,,LA PIERRE AU MAIL,85120,SAINT-HILAIRE-DE-VOUST,,,85229,,,,,,,,,,,,,,,,,,,,F,,,,,51.11,NAP,N,-0.642215,46.581893,0.75,locality,La Pierre Mail 85120 Saint-Hilaire-de-Voust,85229_b197,G,LA PIERRE MAIL,
331340539,00013,33134053900013,O,,,,,2019-11-14T14:01:02,true,1,,,,,LA FRENELIERE,85120,SAINT-HILAIRE-DE-VOUST,,,85229,,,,,,,,,,,,,,,,,,,1997-01-01,F,,,,,01.3Z,NAF1993,N,-1.7090665,47.3301301,0.89,poi.information,La Frénelière (Informations) Vigneux-de-Bretagne,https://osm.org/node/2450725206,G,,
331375956,00017,33137595600017,O,1974-08-28,NN,,,2019-11-14T14:01:02,true,3,,,,,LA ROUSSIERE,85120,SAINT-HILAIRE-DE-VOUST,,,85229,,,,,,,,,,,,,,,,,,,2004-03-31,F,,,,,01.2A,NAFRev1,N,-0.648129,46.605184,0.85,locality,La Petite Roussiere 85120 Saint-Hilaire-de-Voust,85229_b193,G,LA PETITE ROUSSIERE,
331602052,00010,33160205200010,O,,NN,,,2019-11-14T14:01:02,true,1,,,,,LE BOURG,85120,SAINT-HILAIRE-DE-VOUST,,,85229,,,,,,,,,,,,,,,,,,,,F,,,,,67.08,NAP,N,2.212915,47.9910304,0.9,poi.bar,Le Bourg (Bar) Ingrannes,https://osm.org/node/1718543174,G,,
331721415,00015,33172141500015,O,1985-01-30,NN,,,2019-11-14T14:01:02,true,3,,,,LD,L'HOMMERE,85120,SAINT-HILAIRE-DE-VOUST,,,85229,,,,,,,,,,,,,,,,,,,2008-01-01,A,,,,,01.42Z,NAFRev2,N,,,0,,,,,,
332642693,00011,33264269300011,O,,,,,2019-11-14T14:01:02,true,1,,,,,,85120,SAINT-HILAIRE-DE-VOUST,,,85229,,,,,,,,,,,,,,,,,,,1988-03-31,F,,,,,29.13,NAP,N,,,0,,,,,,
332867423,00011,33286742300011,O,,NN,,,2019-11-14T14:01:02,true,1,,,,,LA LAUDINIERE,85120,SAINT-HILAIRE-DE-VOUST,,,85229,,,,,,,,,,,,,,,,,,,1988-01-01,F,,,,,01.07,NAP,N,-0.676679,46.598426,0.57,locality,La Haute Levraudiere 85120 Saint-Hilaire-de-Voust,85229_b149,G,LA HAUTE LEVRAUDIERE,
332886639,00019,33288663900019,O,1976-03-01,NN,,,2019-11-14T14:01:02,true,1,,,,,LE FIEF,85120,SAINT-HILAIRE-DE-VOUST,,,85229,,,,,,,,,,,,,,,,,,,1998-08-31,F,,,,,01.3Z,NAF1993,N,4.3892003,45.428482,0.89,poi.pub,Le Fief (Pub) Saint-Étienne,https://osm.org/node/664567532,G,,
333030336,00015,33303033600015,O,,NN,,,2019-11-14T14:01:02,true,1,,101,,,LE TUDET,85120,SAINT-HILAIRE-DE-VOUST,,,85229,,,,,,,,,,,,,,,,,,,,F,,,,,62.46,NAP,N,-0.652843,46.596852,0.3,locality,Petit Tude 85120 Saint-Hilaire-de-Voust,85229_b189,G,PETIT TUDE,
333972321,00017,33397232100017,O,1985-10-01,,,,2019-11-14T14:01:02,true,1,,5,,RUE,DU RELAIS,85120,SAINT-HILAIRE-DE-VOUST,,,85229,,,,,,,,,,,,,,,,,,,2000-11-30,F,,,,,60.2E,NAF1993,N,-0.649254,46.589263,0.94,housenumber,5 Rue du Relais 85120 Saint-Hilaire-de-Voust,85229_0043_00005,G,5 RUE DU RELAIS,
334297017,00017,33429701700017,O,1985-09-01,NN,,,2019-11-14T14:01:02,true,1,,,,,BOURG,85120,SAINT-HILAIRE-DE-VOUST,,,85229,,,,,,,,,,,,,,,,,,,1998-06-30,F,,,,,55.3A,NAF1993,O,-1.229143,44.2011043,0.89,poi.school,École du bourg Mimizan,https://osm.org/way/35215942,G,,
334475951,00011,33447595100011,O,1985-11-02,NN,,,2021-07-19T09:28:13,true,3,,,,LD,LA CLAVELIERE,85120,SAINT-HILAIRE-DE-VOUST,,,85229,,,,,,,,,,,,,,,,,,,2008-01-01,A,,,,,68.20B,NAFRev2,N,4.8169128,45.709658,0.89,poi.school,Collège La Clavelière (École) Oullins,https://osm.org/way/172755383,G,,
334863024,00017,33486302400017,O,,NN,,,2019-11-14T14:01:02,true,1,,,,,LA FAUCHERIE,85120,SAINT-HILAIRE-DE-VOUST,,,85229,,,,,,,,,,,,,,,,,,,1990-12-31,F,,,,,01.50,NAP,N,-1.977079,46.8737315,0.89,poi.track,Chemin de la Faucherie Sallertaine,https://osm.org/way/40700360,G,,
335271607,00012,33527160700012,O,,NN,,,2019-11-14T14:01:02,true,1,,,,,BOURG,85120,SAINT-HILAIRE-DE-VOUST,,,85229,,,,,,,,,,,,,,,,,,,1987-03-31,F,,,,,64.49,NAP,N,-1.229143,44.2011043,0.89,poi.school,École du bourg Mimizan,https://osm.org/way/35215942,G,,
337589345,00020,33758934500020,O,1997-09-01,NN,,,2019-11-14T14:01:02,true,1,,,,,LA BAROTIERE,85120,SAINT-HILAIRE-DE-VOUST,,,85229,,,,,,,,,,,,,,,,,,,2002-03-30,F,,,,,51.2A,NAF1993,O,-1.0969617,46.859771,0.89,poi.cemetery,(Cimetière) Mesnard-la-Barotière,https://osm.org/way/75892215,G,,
337747497,00010,33774749700010,O,1986-01-01,NN,,,2019-11-14T14:01:02,true,3,,,,,LA JAUMARIERE,85120,SAINT-HILAIRE-DE-VOUST,,,85229,,,,,,,,,,,,,,,,,,,2008-01-01,A,,,,,01.43Z,NAFRev2,N,-0.676679,46.598426,0.41,locality,La Haute Levraudiere 85120 Saint-Hilaire-de-Voust,85229_b149,G,LA HAUTE LEVRAUDIERE,
338123771,00010,33812377100010,O,,,,,2019-11-14T14:01:02,true,1,,,,,LA LEVRAUDIERE,85120,SAINT-HILAIRE-DE-VOUST,,,85229,,,,,,,,,,,,,,,,,,,1997-09-30,F,,,,,01.2A,NAF1993,N,-0.676679,46.598426,0.87,locality,La Haute Levraudiere 85120 Saint-Hilaire-de-Voust,85229_b149,G,LA HAUTE LEVRAUDIERE,
338855950,00014,33885595000014,O,,NN,,,2019-11-14T14:01:02,true,1,,,,LD,LA GUEDEZIERE,85120,SAINT-HILAIRE-DE-VOUST,,,85229,,,,,,,,,,,,,,,,,,,1996-12-31,F,,,,,15.6A,NAF1993,O,-0.676679,46.598426,0.41,locality,La Haute Levraudiere 85120 Saint-Hilaire-de-Voust,85229_b149,G,LA HAUTE LEVRAUDIERE,
339640674,00018,33964067400018,O,1986-12-01,NN,,,2021-04-21T03:40:55,true,4,,,,,LA CROISINIERE,85120,SAINT-HILAIRE-DE-VOUST,,,85229,,,,,,,,,,,,,,,,,,,2020-05-11,F,,,,,01.43Z,NAFRev2,N,-0.648129,46.605184,0.4,locality,La Petite Roussiere 85120 Saint-Hilaire-de-Voust,85229_b193,G,LA PETITE ROUSSIERE,
339826166,00011,33982616600011,O,1986-11-01,NN,,,2019-11-14T14:01:02,false,4,,,,,LA FAVERIE,85120,SAINT-HILAIRE-DE-VOUST,,,85229,,,,,,,,,,,,,,,,,,,2005-05-17,F,,,,,01.1A,NAFRev1,N,-0.9185533,47.3033598,0.89,poi.farmyard,La Faverie (Corps de ferme) Montrevault-sur-Èvre,https://osm.org/way/397324751,G,,
339826166,00029,33982616600029,O,2005-05-17,NN,,,2021-02-09T03:39:59,true,3,,,,,LE TUDE,85120,SAINT-HILAIRE-DE-VOUST,,,85229,,,,,,,,,,,,,,,,,,,2020-09-30,F,,,,,01.50Z,NAFRev2,O,0.0682916,45.3056705,0.77,poi.farmyard,Le Potager de la Tude (Corps de ferme) Montboyer,https://osm.org/way/220234853,G,,
340464312,00016,34046431200016,O,,,,,2019-11-14T14:01:02,true,1,,,,,LA BABINIERE,85120,SAINT-HILAIRE-DE-VOUST,,,85229,,,,,,,,,,,,,,,,,,,1997-12-31,F,,,,,01.2J,NAF1993,N,-1.0034833,47.2478267,0.89,poi.water,Étang de la Babinière (Eau) Montrevault-sur-Èvre,https://osm.org/way/396056650,G,,
341600302,00010,34160030200010,O,1987-06-20,NN,,,2019-11-14T14:01:02,true,4,,,,,LA BERDERIE,85120,SAINT-HILAIRE-DE-VOUST,,,85229,,,,,,,,,,,,,,,,,,,2010-02-28,F,,,,,01.50Z,NAFRev2,N,2.4653536,43.2812614,0.74,poi.track,Chemin de la Bergerie Villarzel-Cabardès,https://osm.org/way/205754610,G,,
343067500,00011,34306750000011,O,,NN,,,2019-11-14T14:01:02,true,1,,,,LD,LE TUDE,85120,SAINT-HILAIRE-DE-VOUST,,,85229,,,,,,,,,,,,,,,,,,,1988-02-09,F,,,,,55.60,NAP,N,0.0682916,45.3056705,0.77,poi.farmyard,Le Potager de la Tude (Corps de ferme) Montboyer,https://osm.org/way/220234853,G,,
343619813,00011,34361981300011,O,1988-01-01,01,2018,,2020-08-25T10:41:27,true,4,,,,,LA LAUDINIERE,85120,SAINT-HILAIRE-DE-VOUST,,,85229,,,,,,,,,,,,,,,,,,,2012-12-31,A,,,,,01.50Z,NAFRev2,O,-0.676679,46.598426,0.57,locality,La Haute Levraudiere 85120 Saint-Hilaire-de-Voust,85229_b149,G,LA HAUTE LEVRAUDIERE,
343717971,00018,34371797100018,O,,NN,,,2019-11-14T14:01:02,true,1,,,,,LA BODINATIERE,85120,SAINT-HILAIRE-DE-VOUST,,,85229,,,,,,,,,,,,,,,,,,,1989-12-25,F,,,,,01.50,NAP,N,-0.675743,46.597575,0.45,locality,La Basse Levraudiere 85120 Saint-Hilaire-de-Voust,85229_b008,G,LA BASSE LEVRAUDIERE,
343774071,00025,34377407100025,O,1991-01-01,,,,2019-11-14T14:01:02,false,3,,40,,RUE,DE LA MAIRIE,85120,SAINT-HILAIRE-DE-VOUST,,,85229,,,,,,,,,,,,,,,,,,,1993-01-04,F,RENAULT,,,,50.2Z,NAF1993,N,-0.646406,46.588284,0.94,housenumber,40 Rue de la Mairie 85120 Saint-Hilaire-de-Voust,85229_0023_00040,G,40 RUE DE LA MAIRIE,
344045992,00023,34404599200023,O,2003-02-01,NN,,,2019-11-14T14:01:02,false,4,,1,,RUE,DE L ECOLE,85120,SAINT-HILAIRE-DE-VOUST,,,85229,,,,,,,,,,,,,,,,,,,2008-01-01,F,,,,,46.49Z,NAFRev2,N,-0.649181,46.59081,0.84,street,Rue de l'Ecole 85120 Saint-Hilaire-de-Voust,85229_0022,G,RUE DE L ECOLE,
344490289,00016,34449028900016,O,1988-04-05,NN,,,2019-11-14T14:01:02,true,3,,11,,RUE,DU STADE,85120,SAINT-HILAIRE-DE-VOUST,,,85229,,,,,,,,,,,,,,,,,,,2006-06-30,F,,,,,45.4C,NAFRev1,N,-0.645577,46.591838,0.94,housenumber,11 Rue du Stade 85120 Saint-Hilaire-de-Voust,85229_0044_00011,G,11 RUE DU STADE,
348022583,00028,34802258300028,O,,NN,,,2019-11-14T14:01:02,true,1,,40,,RUE,DE LA MAIRIE,85120,SAINT-HILAIRE-DE-VOUST,,,85229,,,,,,,,,,,,,,,,,,,1991-01-01,F,,,,,65.06,NAP,N,-0.646406,46.588284,0.94,housenumber,40 Rue de la Mairie 85120 Saint-Hilaire-de-Voust,85229_0023_00040,G,40 RUE DE LA MAIRIE,
348326976,00019,34832697600019,O,1988-07-08,NN,,,2019-11-14T14:01:02,true,4,,,,,LA BODINATIERE,85120,SAINT-HILAIRE-DE-VOUST,,,85229,,,,,,,,,,,,,,,,,,,2011-09-30,F,,,,,01.41Z,NAFRev2,N,-0.675743,46.597575,0.45,locality,La Basse Levraudiere 85120 Saint-Hilaire-de-Voust,85229_b008,G,LA BASSE LEVRAUDIERE,
350570586,00031,35057058600031,O,2002-03-30,NN,,,2019-11-14T14:01:02,true,5,,,,,LA BAROTIERE,85120,SAINT-HILAIRE-DE-VOUST,,,85229,,,,,,,,,,,,,,,,,,,2010-01-31,F,,,,,46.21Z,NAFRev2,O,-1.0969617,46.859771,0.89,poi.cemetery,(Cimetière) Mesnard-la-Barotière,https://osm.org/way/75892215,G,,
350786216,00019,35078621600019,O,1971-09-01,NN,,,2019-11-14T14:01:02,false,5,,,,,LA ROUSSIERE,85120,SAINT-HILAIRE-DE-VOUST,,,85229,,,,,,,,,,,,,,,,,,,2008-12-31,F,,,,,01.42Z,NAFRev2,N,-0.648129,46.605184,0.85,locality,La Petite Roussiere 85120 Saint-Hilaire-de-Voust,85229_b193,G,LA PETITE ROUSSIERE,
350910873,00016,35091087300016,O,1989-01-01,NN,,,2019-11-14T14:01:02,true,3,,,,,LA BERNERIE,85120,SAINT-HILAIRE-DE-VOUST,,,85229,,,,,,,,,,,,,,,,,,,2004-05-31,F,,,,,01.3Z,NAFRev1,N,-2.0415276,47.080906,0.89,poi.beach,(Plage) La Bernerie-en-Retz,https://osm.org/way/219321239,G,,
351010863,00014,35101086300014,O,1989-01-01,NN,,,2019-11-14T14:01:02,true,4,,,,,L AUBRETIERE,85120,SAINT-HILAIRE-DE-VOUST,,,85229,,,,,,,,,,,,,,,,,,,2013-02-28,F,,,,,01.42Z,NAFRev2,N,-1.9980465,46.9948203,0.89,poi,Pont de l'Aubretière Bouin,https://osm.org/way/37014478,G,,
351229877,00011,35122987700011,O,,,,,2019-11-14T14:01:02,true,1,,,,,LA MAISON NEUVE,85120,SAINT-HILAIRE-DE-VOUST,,,85229,,,,,,,,,,,,,,,,,,,1997-03-31,F,,,,,01.3Z,NAF1993,N,-0.649464,46.593861,0.94,street,La Maison Neuve 85120 Saint-Hilaire-de-Voust,85229_b159,G,LA MAISON NEUVE,
352308001,00010,35230800100010,O,1989-10-01,NN,,,2019-11-14T14:01:02,false,4,,,,,LA MAISON NEUVE,85120,SAINT-HILAIRE-DE-VOUST,,,85229,,,,,,,,,,,,,,,,,,,2010-01-21,F,,,,,90.01Z,NAFRev2,N,-0.649464,46.593861,0.94,street,La Maison Neuve 85120 Saint-Hilaire-de-Voust,85229_b159,G,LA MAISON NEUVE,
352308001,00028,35230800100028,O,2004-11-29,,,,2019-11-14T14:01:02,true,1,,,,,MAIRIE,85120,SAINT-HILAIRE-DE-VOUST,,,85229,,,,,,,,,,,,,,,,,,,2004-11-29,A,,,,,90.01Z,NAFRev2,N,-0.649478,46.59063,0.91,street,Rue de la Mairie 85120 Saint-Hilaire-de-Voust,85229_0023,G,RUE DE LA MAIRIE,
352538433,00017,35253843300017,O,1988-12-25,NN,,,2019-11-14T14:01:02,true,1,,,,,MAIRIE,85120,SAINT-HILAIRE-DE-VOUST,,,85229,,,,,,,,,,,,,,,,,,,1999-01-01,F,,,,,66.0G,NAF1993,O,-0.649478,46.59063,0.91,street,Rue de la Mairie 85120 Saint-Hilaire-de-Voust,85229_0023,G,RUE DE LA MAIRIE,
352586556,00016,35258655600016,O,,NN,,,2019-11-14T14:01:02,true,1,,9,,RUE,DE LA VENDEE,85120,SAINT-HILAIRE-DE-VOUST,,,85229,,,,,,,,,,,,,,,,,,,1994-08-31,F,,,,,29.2F,NAF1993,N,-0.650425,46.591578,0.94,housenumber,9 Rue de la Vendée 85120 Saint-Hilaire-de-Voust,85229_0025_00009,G,9 RUE DE LA VENDEE,
356000521,07378,35600052107378,O,1991-01-01,NN,,,2019-11-14T14:01:02,false,3,,,,PL,DE L'EGLISE,85120,SAINT-HILAIRE-DE-VOUST,,,85229,,,,,,,,,,,,,,,,,,,2004-03-25,F,BUREAU JUMELE,,,,64.1A,NAFRev1,O,-1.1676989,44.0766928,0.78,poi.park,Place de l'Église (Parc) Mézos,https://osm.org/way/37053988,G,,
378105514,00012,37810551400012,O,,,,,2019-11-14T14:01:02,true,1,,,,,LA FAUCHERIE,85120,SAINT-HILAIRE-DE-VOUST,,,85229,,,,,,,,,,,,,,,,,,,1997-01-31,F,,,,,01.3Z,NAF1993,N,-1.977079,46.8737315,0.89,poi.track,Chemin de la Faucherie Sallertaine,https://osm.org/way/40700360,G,,
379781941,00032,37978194100032,O,2014-05-12,,,,2019-11-14T14:01:02,true,2,,2,B,RUE,DE L'ECOLE,85120,SAINT-HILAIRE-DE-VOUST,,,85229,,,,,,,,,,,,,,,,,,,2015-12-31,F,,,,,47.81Z,NAFRev2,N,-0.648782,46.590412,0.8,housenumber,2 bis Rue de l'Ecole 85120 Saint-Hilaire-de-Voust,85229_0022_00002_bis,G,2 BIS RUE DE L ECOLE,
380522433,00016,38052243300016,O,1991-01-07,,,,2019-11-14T14:01:02,true,5,,9,,RUE,DU STADE,85120,SAINT-HILAIRE-DE-VOUST,,,85229,,,,,,,,,,,,,,,,,,,2008-01-01,F,,,,,33.12Z,NAFRev2,N,-0.645816,46.59164,0.94,housenumber,9 Rue du Stade 85120 Saint-Hilaire-de-Voust,85229_0044_00009,G,9 RUE DU STADE,
380663617,00013,38066361700013,O,,NN,,,2019-11-14T14:01:02,true,1,,,,,LA FAUCHERIE,85120,SAINT-HILAIRE-DE-VOUST,,,85229,,,,,,,,,,,,,,,,,,,1996-12-31,F,,,,,01.3Z,NAF1993,N,-1.977079,46.8737315,0.89,poi.track,Chemin de la Faucherie Sallertaine,https://osm.org/way/40700360,G,,