siren,nic,siret,statutDiffusionEtablissement,dateCreationEtablissement,trancheEffectifsEtablissement,anneeEffectifsEtablissement,activitePrincipaleRegistreMetiersEtablissement,dateDernierTraitementEtablissement,etablissementSiege,nombrePeriodesEtablissement,complementAdresseEtablissement,numeroVoieEtablissement,indiceRepetitionEtablissement,typeVoieEtablissement,libelleVoieEtablissement,codePostalEtablissement,libelleCommuneEtablissement,libelleCommuneEtrangerEtablissement,distributionSpecialeEtablissement,codeCommuneEtablissement,codeCedexEtablissement,libelleCedexEtablissement,codePaysEtrangerEtablissement,libellePaysEtrangerEtablissement,complementAdresse2Etablissement,numeroVoie2Etablissement,indiceRepetition2Etablissement,typeVoie2Etablissement,libelleVoie2Etablissement,codePostal2Etablissement,libelleCommune2Etablissement,libelleCommuneEtranger2Etablissement,distributionSpeciale2Etablissement,codeCommune2Etablissement,codeCedex2Etablissement,libelleCedex2Etablissement,codePaysEtranger2Etablissement,libellePaysEtranger2Etablissement,dateDebut,etatAdministratifEtablissement,enseigne1Etablissement,enseigne2Etablissement,enseigne3Etablissement,denominationUsuelleEtablissement,activitePrincipaleEtablissement,nomenclatureActivitePrincipaleEtablissement,caractereEmployeurEtablissement,longitude,latitude,geo_score,geo_type,geo_adresse,geo_id,geo_ligne,geo_l4,geo_l5
218602886,00010,21860288600010,O,1983-03-01,03,2018,,2020-08-25T10:19:30,true,4,,20,,,GRAND'RUE,86260,VICQ-SUR-GARTEMPE,,,86288,,,,,,,,,,,,,,,,,,,2008-01-01,A,MAIRIE,,,,84.11Z,NAFRev2,O,0.861969,46.721194,0.94,housenumber,20 Grand Rue 86260 Vicq-sur-Gartempe,86288_0060_00020,G,20 GRAND RUE,
218602886,00028,21860288600028,O,1983-12-21,01,2018,,2020-08-25T10:19:30,false,3,,20,,RUE,GRAND RUE,86260,VICQ-SUR-GARTEMPE,,,86288,,,,,,,,,,,,,,,,,,,2008-01-01,A,ECOLE PRIMAIRE PUBLIQUE,,,,85.20Z,NAFRev2,N,0.861969,46.721194,0.81,housenumber,20 Grand Rue 86260 Vicq-sur-Gartempe,86288_0060_00020,G,20 GRAND RUE,
218602886,00036,21860288600036,O,1996-01-01,NN,,,2019-11-14T14:01:03,false,4,MAIRIE,20,,,GRAND'RUE,86260,VICQ-SUR-GARTEMPE,,,86288,,,,,,,,,,,,,,,,,,,2016-12-31,F,SERVICE ASSAINISSEMENT,,,,37.00Z,NAFRev2,N,0.861969,46.721194,0.94,housenumber,20 Grand Rue 86260 Vicq-sur-Gartempe,86288_0060_00020,G,20 GRAND RUE,
218602886,00044,21860288600044,O,1998-04-01,NN,,,2019-11-14T14:01:03,false,3,MAIRIE,20,,,GRAND'RUE,86260,VICQ-SUR-GARTEMPE,,,86288,,,,,,,,,,,,,,,,,,,2004-12-25,F,POMPES FUNEBRES,,,,93.0H,NAFRev1,N,0.861969,46.721194,0.94,housenumber,20 Grand Rue 86260 Vicq-sur-Gartempe,86288_0060_00020,G,20 GRAND RUE,
218602886,00051,21860288600051,O,1995-12-25,NN,,,2019-11-14T14:01:03,false,3,MAIRIE,20,,,GRAND'RUE,86260,VICQ-SUR-GARTEMPE,,,86288,,,,,,,,,,,,,,,,,,,2008-01-01,A,CAMPING MUNICIPAL LES RIVIERES,,,,55.30Z,NAFRev2,N,0.861969,46.721194,0.94,housenumber,20 Grand Rue 86260 Vicq-sur-Gartempe,86288_0060_00020,G,20 GRAND RUE,
258600832,00012,25860083200012,O,1983-03-01,NN,,,2019-11-14T14:01:03,true,5,,20,,,GRAND'RUE,86260,VICQ-SUR-GARTEMPE,,,86288,,,,,,,,,,,,,,,,,,,2014-12-31,F,,,,,84.12Z,NAFRev2,O,0.861969,46.721194,0.94,housenumber,20 Grand Rue 86260 Vicq-sur-Gartempe,86288_0060_00020,G,20 GRAND RUE,
258600840,00015,25860084000015,O,1983-03-01,NN,,,2019-11-14T14:01:03,true,4,MAIRIE,20,,,GRAND'RUE,86260,VICQ-SUR-GARTEMPE,,,86288,,,,,,,,,,,,,,,,,,,2013-12-31,F,,,,,84.13Z,NAFRev2,N,0.861969,46.721194,0.94,housenumber,20 Grand Rue 86260 Vicq-sur-Gartempe,86288_0060_00020,G,20 GRAND RUE,
268601192,00019,26860119200019,O,1995-12-25,NN,,,2019-11-14T14:01:03,true,3,,,,,GRAND RUE,86260,VICQ-SUR-GARTEMPE,,,86288,,,,,,,,,,,,,,,,,,,2016-01-01,F,CCAS,,,,88.99B,NAFRev2,N,0.862082,46.72111,0.94,street,Grand Rue 86260 Vicq-sur-Gartempe,86288_0060,G,GRAND RUE,
298601121,00015,29860112100015,O,1983-08-10,NN,,,2019-11-14T14:01:03,true,3,MAIRIE,20,,,GRAND'RUE,86260,VICQ-SUR-GARTEMPE,,,86288,,,,,,,,,,,,,,,,,,,2008-01-01,A,,,,,42.99Z,NAFRev2,N,0.861969,46.721194,0.94,housenumber,20 Grand Rue 86260 Vicq-sur-Gartempe,86288_0060_00020,G,20 GRAND RUE,
301481792,00010,30148179200010,O,1900-01-01,NN,,,2019-11-14T14:01:03,false,5,,,,,,86260,VICQ-SUR-GARTEMPE,,,86288,,,,,,,,,,,,,,,,,,,2013-03-31,F,,,,,43.99C,NAFRev2,O,,,0,,,,,,
301769352,00016,30176935200016,O,1986-09-01,NN,,,2019-11-14T14:01:03,true,4,,,,,,86260,VICQ-SUR-GARTEMPE,,,86288,,,,,,,,,,,,,,,,,,,2006-06-27,F,,,,,15.1A,NAFRev1,N,,,0,,,,,,
301769352,00057,30176935200057,O,1987-12-31,NN,,,2019-11-14T14:01:03,false,3,,,,RTE,DE LA ROCHE,86260,VICQ-SUR-GARTEMPE,,,86288,,,,,,,,,,,,,,,,,,,2006-06-27,F,,,,,01.1A,NAFRev1,N,0.862123,46.722101,0.86,street,Route de la Roche Posay 86260 Vicq-sur-Gartempe,86288_0089,G,ROUTE DE LA ROCHE POSAY,
301936811,00019,30193681100019,O,,NN,,,2019-11-14T14:01:03,true,1,,,,,,86260,VICQ-SUR-GARTEMPE,,,86288,,,,,,,,,,,,,,,,,,,1991-09-30,F,,,,,57.06,NAP,N,,,0,,,,,,
305090649,00024,30509064900024,O,,,,,2019-11-14T14:01:03,true,1,,,,,,86260,VICQ-SUR-GARTEMPE,,,86288,,,,,,,,,,,,,,,,,,,1993-03-24,F,,,,,52.2C,NAF1993,N,,,0,,,,,,
305297574,00017,30529757400017,O,,NN,,,2019-11-14T14:01:03,true,1,,,,,,86260,VICQ-SUR-GARTEMPE,,,86288,,,,,,,,,,,,,,,,,,,1991-09-30,F,,,,,67.04,NAP,N,,,0,,,,,,
309865095,00033,30986509500033,O,1986-03-01,NN,,,2019-11-14T14:01:03,true,3,,,,RTE,DE LA ROCHE POSAY,86260,VICQ-SUR-GARTEMPE,,,86288,,,,,,,,,,,,,,,,,,,2006-09-30,F,,,,,45.3E,NAFRev1,N,0.862123,46.722101,0.88,street,Route de la Roche Posay 86260 Vicq-sur-Gartempe,86288_0089,G,ROUTE DE LA ROCHE POSAY,
309984938,00022,30998493800022,O,2007-03-08,,,,2019-11-14T14:01:03,true,3,,45,,RTE,DE LA ROCHE POSAY,86260,VICQ-SUR-GARTEMPE,,,86288,,,,,,,,,,,,,,,,,,,2017-12-31,F,,,,,86.21Z,NAFRev2,N,0.86166,46.727863,0.88,housenumber,45 Route de la Roche Posay 86260 Vicq-sur-Gartempe,86288_0089_00045,G,45 ROUTE DE LA ROCHE POSAY,
312134653,00012,31213465300012,O,,NN,,,2019-11-14T14:01:03,true,1,,,,RTE,DE PLEUMARTIN,86260,VICQ-SUR-GARTEMPE,,,86288,,,,,,,,,,,,,,,,,,,1996-12-31,F,,,,,51.3E,NAF1993,N,0.861484,46.7219,0.87,street,Route de Pleumartin 86260 Vicq-sur-Gartempe,86288_0085,G,ROUTE DE PLEUMARTIN,
312142987,00014,31214298700014,O,,NN,,,2019-11-14T14:01:03,true,1,,,,RTE,DE PLEUMARTIN,86260,VICQ-SUR-GARTEMPE,,,86288,,,,,,,,,,,,,,,,,,,1994-09-30,F,,,,,51.3E,NAF1993,N,0.861484,46.7219,0.87,street,Route de Pleumartin 86260 Vicq-sur-Gartempe,86288_0085,G,ROUTE DE PLEUMARTIN,
312222102,00013,31222210200013,O,1978-01-01,NN,,,2019-11-14T14:01:03,true,3,,,,LD,MONTIN,86260,VICQ-SUR-GARTEMPE,,,86288,,,,,,,,,,,,,,,,,,,2005-12-25,F,,,,,01.4A,NAFRev1,N,0.828944,46.726853,0.91,street,Lieu Dit Montin 86260 Vicq-sur-Gartempe,86288_v69y9p,G,LIEU DIT MONTIN,
312233984,00011,31223398400011,O,,NN,,,2019-11-14T14:01:03,true,1,,,,RTE,DE PLEUMARTIN,86260,VICQ-SUR-GARTEMPE,,,86288,,,,,,,,,,,,,,,,,,,1996-12-31,F,,,,,51.3E,NAF1993,O,0.861484,46.7219,0.87,street,Route de Pleumartin 86260 Vicq-sur-Gartempe,86288_0085,G,ROUTE DE PLEUMARTIN,
312639198,00018,31263919800018,O,1964-01-01,NN,,,2019-11-14T14:01:03,true,3,,,,,,86260,VICQ-SUR-GARTEMPE,,,86288,,,,,,,,,,,,,,,,,,,2008-01-01,A,,,,,68.20B,NAFRev2,N,,,0,,,,,,
315342949,00023,31534294900023,O,2005-01-01,,,,2019-11-14T14:01:03,true,3,,,,LD,LA BALIERE,86260,VICQ-SUR-GARTEMPE,,,86288,,,,,,,,,,,,,,,,,,,2008-01-01,F,,,,,90.01Z,NAFRev2,N,0.860439,46.751125,0.92,street,Lieu Dit la Baliere 86260 Vicq-sur-Gartempe,86288_ijp7dx,G,LIEU DIT LA BALIERE,
315342949,00031,31534294900031,O,2008-03-03,,,,2019-11-14T14:01:03,false,2,,,,,LA BALIERE,86260,VICQ-SUR-GARTEMPE,,,86288,,,,,,,,,,,,,,,,,,,2008-03-03,F,,,,,43.99C,NAFRev2,N,0.860439,46.751125,0.92,street,Lieu Dit la Baliere 86260 Vicq-sur-Gartempe,86288_ijp7dx,G,LIEU DIT LA BALIERE,
316245687,00017,31624568700017,O,,,,,2019-11-14T14:01:03,true,1,,,,,,86260,VICQ-SUR-GARTEMPE,,,86288,,,,,,,,,,,,,,,,,,,1985-12-25,F,,,,,87.03,NAP,N,,,0,,,,,,
317062263,00015,31706226300015,O,1979-01-01,NN,,,2020-01-08T11:45:18,true,4,,,,,MONTIN,86260,VICQ-SUR-GARTEMPE,,,86288,,,,,,,,,,,,,,,,,,,2018-09-30,F,,,,,01.50Z,NAFRev2,N,0.828944,46.726853,0.91,street,Lieu Dit Montin 86260 Vicq-sur-Gartempe,86288_v69y9p,G,LIEU DIT MONTIN,
317872216,00021,31787221600021,O,1989-01-01,NN,,,2019-11-14T14:01:03,true,3,,,,,CHANTEGROS,86260,VICQ-SUR-GARTEMPE,,,86288,,,,,,,,,,,,,,,,,,,2007-12-31,F,,,,,01.1D,NAFRev1,N,0.851705,46.74349,0.91,street,Lieu Dit Chantegros 86260 Vicq-sur-Gartempe,86288_hrwr2f,G,LIEU DIT CHANTEGROS,
318001633,00011,31800163300011,O,,,,,2019-11-14T14:01:03,true,1,,,,LD,LA PAPELOTIERE,86260,VICQ-SUR-GARTEMPE,,,86288,,,,,,,,,,,,,,,,,,,1984-12-25,F,,,,,55.71,NAP,N,0.818762,46.718016,0.92,street,Lieu Dit la Papelotiere 86260 Vicq-sur-Gartempe,86288_f4lpb8,G,LIEU DIT LA PAPELOTIERE,
320483688,00018,32048368800018,O,1981-01-01,NN,,,2019-11-14T14:01:03,true,1,,,,LD,LA PINTARNIERE,86260,VICQ-SUR-GARTEMPE,,,86288,,,,,,,,,,,,,,,,,,,2000-10-31,F,,,,,74.7Z,NAF1993,N,0.780564,46.731405,0.92,street,Lieu Dit la Pintarniere 86260 Vicq-sur-Gartempe,86288_cdm4en,G,LIEU DIT LA PINTARNIERE,
320693922,00017,32069392200017,O,1981-01-05,NN,,,2019-11-14T14:01:03,true,1,,,,,LA BERTHOMIERE,86260,VICQ-SUR-GARTEMPE,,,86288,,,,,,,,,,,,,,,,,,,2002-12-31,F,,,,,45.4C,NAF1993,O,0.854124,46.713863,0.86,street,Lieu Dit la Berthommiere 86260 Vicq-sur-Gartempe,86288_r14zkp,G,LIEU DIT LA BERTHOMMIERE,
323350470,00023,32335047000023,O,1987-11-03,NN,,,2019-11-14T14:01:03,true,1,,,,RTE,,86260,VICQ-SUR-GARTEMPE,,,86288,,,,,,,,,,,,,,,,,,,1999-10-19,F,,,,,15.8C,NAF1993,O,3.1206907,45.7709538,0.88,poi.industrial,RTE (Zone industrielle) Clermont-Ferrand,https://osm.org/way/43852862,G,,
326357076,00016,32635707600016,O,,NN,,,2019-11-14T14:01:03,true,1,,,,LD,LA FORET,86260,VICQ-SUR-GARTEMPE,,,86288,,,,,,,,,,,,,,,,,,,1990-10-26,F,,,,,01.00,NAP,N,0.849301,46.72416,0.91,street,Lieu Dit la Foret 86260 Vicq-sur-Gartempe,86288_pfgy54,G,LIEU DIT LA FORET,
326517521,00018,32651752100018,O,,NN,,,2019-11-14T14:01:03,true,1,,,,LD,LA CRECHERE,86260,VICQ-SUR-GARTEMPE,,,86288,,,,,,,,,,,,,,,,,,,1988-07-31,F,,,,,55.71,NAP,N,0.787359,46.733252,0.92,street,Lieu Dit la Crechere 86260 Vicq-sur-Gartempe,86288_yrs6ov,G,LIEU DIT LA CRECHERE,
326767787,00012,32676778700012,O,1983-03-01,NN,,,2019-11-14T14:01:03,false,4,,,,LD,LA BORDE,86260,VICQ-SUR-GARTEMPE,,,86288,,,,,,,,,,,,,,,,,,,2012-03-06,F,,,,,77.31Z,NAFRev2,N,0.8265,46.727368,0.91,street,Lieu Dit la Borde 86260 Vicq-sur-Gartempe,86288_v5ndwh,G,LIEU DIT LA BORDE,
326767787,00038,32676778700038,O,2019-02-06,,,,2021-02-23T10:48:39,true,1,CHEZ MR NEUVY LAURENT,7,,,LES TOUCHES,86260,VICQ-SUR-GARTEMPE,,,86288,,,,,,,,,,,,,,,,,,,2019-02-06,A,,,,,77.31Z,NAFRev2,N,0.857463,46.732435,0.92,housenumber,7 Lieu Dit les Touches 86260 Vicq-sur-Gartempe,86288_hfewhg_00007,G,7 LIEU DIT LES TOUCHES,
326970480,00025,32697048000025,O,,NN,,,2019-11-14T14:01:03,true,1,,,,LD,LA GUILLONNERIE,86260,VICQ-SUR-GARTEMPE,,,86288,,,,,,,,,,,,,,,,,,,1997-09-29,F,,,,,01.3Z,NAF1993,N,0.867628,46.717167,0.94,street,La Guillonnerie 86260 Vicq-sur-Gartempe,86288_n9php4,G,LA GUILLONNERIE,
327080446,00096,32708044600096,O,1993-07-01,NN,,,2019-11-14T14:01:03,false,4,,,,,LA BRIDERAIE,86260,VICQ-SUR-GARTEMPE,,,86288,,,,,,,,,,,,,,,,,,,2002-12-31,F,,,,,74.1J,NAF1993,O,0.81573,46.731612,0.92,street,Lieu Dit la Brideraie 86260 Vicq-sur-Gartempe,86288_7vc1v5,G,LIEU DIT LA BRIDERAIE,
327270559,00013,32727055900013,O,1983-04-22,,,,2019-11-14T14:01:03,false,4,,,,LD,LA GAUGRIERE,86260,VICQ-SUR-GARTEMPE,,,86288,,,,,,,,,,,,,,,,,,,1997-01-22,F,,,,,71.3A,NAF1993,N,0.805313,46.713209,0.92,street,Lieu Dit la Gaugriere 86260 Vicq-sur-Gartempe,86288_j9rc82,G,LIEU DIT LA GAUGRIERE,
329526347,00011,32952634700011,O,,NN,,,2019-11-14T14:01:03,true,1,,,,RTE,DE LA ROCHE POSAY,86260,VICQ-SUR-GARTEMPE,,,86288,,,,,,,,,,,,,,,,,,,,F,,,,,84.12,NAP,N,0.862123,46.722101,0.88,street,Route de la Roche Posay 86260 Vicq-sur-Gartempe,86288_0089,G,ROUTE DE LA ROCHE POSAY,
329696108,00045,32969610800045,O,2002-05-01,NN,,,2019-11-14T14:01:03,true,3,,,,,,86260,VICQ-SUR-GARTEMPE,,,86288,,,,,,,,,,,,,,,,,,,2008-01-01,A,,,,,68.20B,NAFRev2,N,,,0,,,,,,
329978753,00039,32997875300039,O,2005-05-09,,,,2021-02-23T10:50:37,true,2,,6,,PL,DU BOURG,86260,VICQ-SUR-GARTEMPE,,,86288,,,,,,,,,,,,,,,,,,,2008-01-01,A,,,,,90.01Z,NAFRev2,N,0.862055,46.721537,0.8,housenumber,6 Place du Bourg 86260 Vicq-sur-Gartempe,86288_0020_00006,G,6 PLACE DU BOURG,
330905209,00012,33090520900012,O,1980-01-01,NN,,,2019-11-14T14:01:03,true,4,,,,LD,MONTIN,86260,VICQ-SUR-GARTEMPE,,,86288,,,,,,,,,,,,,,,,,,,2003-05-31,F,,,,,01.1A,NAFRev1,N,0.828944,46.726853,0.91,street,Lieu Dit Montin 86260 Vicq-sur-Gartempe,86288_v69y9p,G,LIEU DIT MONTIN,
331126474,00013,33112647400013,O,,NN,,,2019-11-14T14:01:03,true,1,,,,LD,SANVY,86260,VICQ-SUR-GARTEMPE,,,86288,,,,,,,,,,,,,,,,,,,1989-12-31,F,,,,,01.50,NAP,N,0.882214,46.713051,0.94,street,Sanvy 86260 Vicq-sur-Gartempe,86288_xf3xih,G,SANVY,
331643718,00017,33164371800017,O,,NN,,,2019-11-14T14:01:03,true,1,,,,LD,LA BALIERE,86260,VICQ-SUR-GARTEMPE,,,86288,,,,,,,,,,,,,,,,,,,1988-09-01,F,,,,,01.07,NAP,N,0.860439,46.751125,0.92,street,Lieu Dit la Baliere 86260 Vicq-sur-Gartempe,86288_ijp7dx,G,LIEU DIT LA BALIERE,
333319044,00017,33331904400017,O,,NN,,,2019-11-14T14:01:03,true,1,,,,LD,LA BERNARDIERE,86260,VICQ-SUR-GARTEMPE,,,86288,,,,,,,,,,,,,,,,,,,1989-10-31,F,,,,,87.07,NAP,N,0.815006,46.715595,0.92,street,Lieu Dit la Bernardiere 86260 Vicq-sur-Gartempe,86288_bipcor,G,LIEU DIT LA BERNARDIERE,
334162930,00013,33416293000013,O,1985-11-04,NN,,,2019-11-14T14:01:03,true,3,,,,LD,LA PINTARNIERE,86260,VICQ-SUR-GARTEMPE,,,86288,,,,,,,,,,,,,,,,,,,2007-02-19,F,,,,,01.1A,NAFRev1,N,0.780564,46.731405,0.92,street,Lieu Dit la Pintarniere 86260 Vicq-sur-Gartempe,86288_cdm4en,G,LIEU DIT LA PINTARNIERE,
334266319,00014,33426631900014,O,1985-12-19,NN,,,2019-11-14T14:01:03,true,3,,,,LD,LES TOUCHES,86260,VICQ-SUR-GARTEMPE,,,86288,,,,,,,,,,,,,,,,,,,2008-01-01,A,,,,,01.11Z,NAFRev2,N,0.857907,46.731773,0.91,street,Lieu Dit les Touches 86260 Vicq-sur-Gartempe,86288_hfewhg,G,LIEU DIT LES TOUCHES,
334551553,00012,33455155300012,O,,NN,,,2019-11-14T14:01:03,true,1,,,,LD,JEU,86260,VICQ-SUR-GARTEMPE,,,86288,,,,,,,,,,,,,,,,,,,1992-12-31,F,,,,,01.1A,NAF1993,N,0.868796,46.719997,0.9,street,Lieu Dit Jeu 86260 Vicq-sur-Gartempe,86288_drwvh0,G,LIEU DIT JEU,
337499594,00014,33749959400014,O,1986-01-01,NN,,,2021-02-23T10:54:19,true,4,,,,LD,LES TOUCHES,86260,VICQ-SUR-GARTEMPE,,,86288,,,,,,,,,,,,,,,,,,,2012-12-26,A,,,,,68.20B,NAFRev2,N,0.857907,46.731773,0.91,street,Lieu Dit les Touches 86260 Vicq-sur-Gartempe,86288_hfewhg,G,LIEU DIT LES TOUCHES,
338650633,00013,33865063300013,O,,,,,2019-11-14T14:01:03,true,1,,,,,LA PLACE,86260,VICQ-SUR-GARTEMPE,,,86288,,,,,,,,,,,,,,,,,,,,F,,,,,62.46,NAP,N,0.861429,46.721122,0.91,street,Impasse de la Place 86260 Vicq-sur-Gartempe,86288_0080,G,IMPASSE DE LA PLACE,
339340564,00014,33934056400014,O,,NN,,,2019-11-14T14:01:03,true,1,,,,,,86260,VICQ-SUR-GARTEMPE,,,86288,,,,,,,,,,,,,,,,,,,1987-06-14,F,,,,,62.43,NAP,N,,,0,,,,,,
340385269,00014,34038526900014,O,1987-01-01,NN,,,2019-11-14T14:01:03,true,3,,8,,,CHANGOBERT,86260,VICQ-SUR-GARTEMPE,,,86288,,,,,,,,,,,,,,,,,,,2008-01-01,A,,,,,01.50Z,NAFRev2,N,0.806091,46.740406,0.65,housenumber,8 Lieu Dit Champgobert 86260 Vicq-sur-Gartempe,86288_2acrc5_00008,G,8 LIEU DIT CHAMPGOBERT,
340385905,00013,34038590500013,O,1987-01-01,NN,,,2019-11-14T14:01:03,true,3,,4,,,LA GAUGRIERE,86260,VICQ-SUR-GARTEMPE,,,86288,,,,,,,,,,,,,,,,,,,2008-01-01,A,,,,,01.11Z,NAFRev2,N,0.804143,46.712738,0.92,housenumber,4 Lieu Dit la Gaugriere 86260 Vicq-sur-Gartempe,86288_j9rc82_00004,G,4 LIEU DIT LA GAUGRIERE,
340393453,00048,34039345300048,O,2002-01-01,NN,,,2021-02-23T10:56:25,true,5,,4,,RUE,DE L'EGLISE,86260,VICQ-SUR-GARTEMPE,,,86288,,,,,,,,,,,,,,,,,,,2011-12-21,A,,,,,90.03A,NAFRev2,N,0.861192,46.719432,0.94,housenumber,4 Rue de l'Eglise 86260 Vicq-sur-Gartempe,86288_0040_00004,G,4 RUE DE L EGLISE,
340731462,00032,34073146200032,O,1994-09-01,NN,,,2019-11-14T14:01:03,true,3,,,,,LA GAUGRIERE,86260,VICQ-SUR-GARTEMPE,,,86288,,,,,,,,,,,,,,,,,,,1995-05-24,F,,,,,52.6G,NAF1993,N,0.805313,46.713209,0.92,street,Lieu Dit la Gaugriere 86260 Vicq-sur-Gartempe,86288_j9rc82,G,LIEU DIT LA GAUGRIERE,
342185204,00019,34218520400019,O,1987-10-01,NN,,,2019-11-14T14:01:03,true,4,,,,,LA BOURELIERE,86260,VICQ-SUR-GARTEMPE,,,86288,,,,,,,,,,,,,,,,,,,2008-01-01,A,,,,,68.20B,NAFRev2,N,0.798521,46.711114,0.86,street,Lieu Dit la Bourreliere 86260 Vicq-sur-Gartempe,86288_tncy0w,G,LIEU DIT LA BOURRELIERE,
343359287,00012,34335928700012,O,1988-01-09,01,2018,9529ZF,2020-08-25T10:41:16,true,6,,19,,RTE,DE PLEUMARTIN,86260,VICQ-SUR-GARTEMPE,,,86288,,,,,,,,,,,,,,,,,,,2015-06-01,A,,,,,81.21Z,NAFRev2,N,0.858,46.724182,0.87,housenumber,19 Route de Pleumartin 86260 Vicq-sur-Gartempe,86288_0085_00019,G,19 ROUTE DE PLEUMARTIN,
343566501,00031,34356650100031,O,2014-09-08,,,,2019-11-14T14:01:03,true,2,,,,LD,LA BROSSE,86260,VICQ-SUR-GARTEMPE,,,86288,,,,,,,,,,,,,,,,,,,2014-10-01,A,,,,,01.11Z,NAFRev2,N,0.897251,46.719186,0.91,street,Lieu Dit la Brosse 86260 Vicq-sur-Gartempe,86288_auxpqh,G,LIEU DIT LA BROSSE,
344750492,00037,34475049200037,O,1999-12-01,,,,2019-11-14T14:01:03,true,1,,22,,RTE,DE LA ROCHE POSAY,86260,VICQ-SUR-GARTEMPE,,,86288,,,,,,,,,,,,,,,,,,,2000-12-31,F,,,,,51.1R,NAF1993,N,0.862412,46.724539,0.88,housenumber,22 Route de la Roche Posay 86260 Vicq-sur-Gartempe,86288_0089_00022,G,22 ROUTE DE LA ROCHE POSAY,
348036740,00010,34803674000010,O,1988-06-14,NN,,,2019-11-14T14:01:03,true,4,,,,,LE BOURG,86260,VICQ-SUR-GARTEMPE,,,86288,,,,,,,,,,,,,,,,,,,2012-09-11,F,,,,,56.30Z,NAFRev2,N,0.860562,46.720119,0.92,locality,Le Bourg Sud 86260 Vicq-sur-Gartempe,86288_b035,G,LE BOURG SUD,
348036740,00028,34803674000028,O,1988-05-18,NN,,,2019-11-14T14:01:03,false,4,,,,,LE BOURG,86260,VICQ-SUR-GARTEMPE,,,86288,,,,,,,,,,,,,,,,,,,2012-09-11,F,,,,,01.11Z,NAFRev2,N,0.860562,46.720119,0.92,locality,Le Bourg Sud 86260 Vicq-sur-Gartempe,86288_b035,G,LE BOURG SUD,
348209859,00019,34820985900019,O,1988-07-01,01,2018,4520AB,2020-08-25T10:43:15,true,4,,,,RTE,DE LE ROCHE POSAY,86260,VICQ-SUR-GARTEMPE,,,86288,,,,,,,,,,,,,,,,,,,2008-01-01,A,,,,,45.20A,NAFRev2,O,0.862123,46.722101,0.76,street,Route de la Roche Posay 86260 Vicq-sur-Gartempe,86288_0089,G,ROUTE DE LA ROCHE POSAY,
348599671,00032,34859967100032,O,1997-01-17,,,,2019-11-14T14:01:03,false,3,,15,,,GRAND RUE,86260,VICQ-SUR-GARTEMPE,,,86288,,,,,,,,,,,,,,,,,,,1997-12-25,F,,,,,52.5Z,NAF1993,N,0.861726,46.720415,0.94,housenumber,15 Grand Rue 86260 Vicq-sur-Gartempe,86288_0060_00015,G,15 GRAND RUE,
348599671,00057,34859967100057,O,1998-07-10,NN,,,2019-11-14T14:01:03,false,3,,8,,,GRAND'RUE,86260,VICQ-SUR-GARTEMPE,,,86288,,,,,,,,,,,,,,,,,,,2004-08-13,F,,,,,52.5Z,NAFRev1,N,0.861955,46.720753,0.94,housenumber,8 Grand Rue 86260 Vicq-sur-Gartempe,86288_0060_00008,G,8 GRAND RUE,
348599671,00065,34859967100065,O,2004-08-13,NN,,,2019-11-14T14:01:03,true,5,,17,,RTE,DE LA ROCHE POSAY,86260,VICQ-SUR-GARTEMPE,,,86288,,,,,,,,,,,,,,,,,,,2015-05-10,A,,,,ABGRALL JEAN-LOUP,47.89Z,NAFRev2,N,0.86215,46.722876,0.88,housenumber,17 Route de la Roche Posay 86260 Vicq-sur-Gartempe,86288_0089_00017,G,17 ROUTE DE LA ROCHE POSAY,
350438636,00010,35043863600010,O,,NN,,,2019-11-14T14:01:03,true,1,,,,,CHAMPFOUCHE,86260,VICQ-SUR-GARTEMPE,,,86288,,,,,,,,,,,,,,,,,,,1991-12-31,F,,,,,01.00,NAP,N,,,0,,,,,,
353290919,00011,35329091900011,O,1990-01-01,NN,,,2019-11-14T14:01:03,true,4,,,,LD,SANVY,86260,VICQ-SUR-GARTEMPE,,,86288,,,,,,,,,,,,,,,,,,,2003-04-30,F,,,,,01.3Z,NAFRev1,N,0.882214,46.713051,0.94,street,Sanvy 86260 Vicq-sur-Gartempe,86288_xf3xih,G,SANVY,
356000000,40539,35600000040539,O,2012-01-01,,,,2019-11-14T14:01:03,false,3,,1,,PL,DU BOURG,86260,VICQ-SUR-GARTEMPE,,,86288,,,,,,,,,,,,,,,,,,,2018-12-31,F,LA POSTE,,,,53.10Z,NAFRev2,N,0.861474,46.721442,0.8,housenumber,1 Place du Bourg 86260 Vicq-sur-Gartempe,86288_0020_00001,G,1 PLACE DU BOURG,
356000547,05807,35600054705807,O,1991-01-01,NN,,,2019-11-14T14:01:03,false,4,,,,,VI GARTEMPE,86260,VICQ-SUR-GARTEMPE,,,86288,,,,,,,,,,,,,,,,,,,2009-03-18,F,BUREAU DE POSTE,,,,53.10Z,NAFRev2,O,0.839667,46.730253,0.77,municipality,Vicq-sur-Gartempe,86288,G,VICQ SUR GARTEMPE,
378021281,00019,37802128100019,O,1990-01-01,NN,,,2019-11-14T14:01:03,true,3,,,,LD,LA BRASSE,86260,VICQ-SUR-GARTEMPE,,,86288,,,,,,,,,,,,,,,,,,,2006-12-31,F,,,,,01.1A,NAFRev1,N,2.6588536,45.2825632,0.72,poi.cafe,La Brass' (Café) Riom-ès-Montagnes,https://osm.org/node/4006144518,G,,
380920371,00016,38092037100016,O,1991-01-01,NN,,,2019-11-14T14:01:03,true,3,,,,,L'AUGE,86260,VICQ-SUR-GARTEMPE,,,86288,,,,,,,,,,,,,,,,,,,2008-01-01,A,,,,,01.11Z,NAFRev2,N,2.8083124,47.3545388,0.89,poi.track,Chemin de l'Auge Verdigny,https://osm.org/way/223890021,G,,
381452838,00018,38145283800018,O,1991-04-03,NN,,,2019-11-14T14:01:03,true,6,,4,,,LA MORALIERE,86260,VICQ-SUR-GARTEMPE,,,86288,,,,,,,,,,,,,,,,,,,2017-09-30,F,,,,,47.99B,NAFRev2,N,0.815288,46.724006,0.92,housenumber,4 Lieu Dit la Moraliere 86260 Vicq-sur-Gartempe,86288_6wylly_00004,G,4 LIEU DIT LA MORALIERE,
381790120,00012,38179012000012,O,,NN,,,2019-11-14T14:01:03,true,1,,,,,LE BOURG,86260,VICQ-SUR-GARTEMPE,,,86288,,,,,,,,,,,,,,,,,,,1991-06-07,F,,,,,55.4B,NAF1993,N,0.860562,46.720119,0.92,locality,Le Bourg Sud 86260 Vicq-sur-Gartempe,86288_b035,G,LE BOURG SUD,
382287803,00011,38228780300011,O,1991-07-02,NN,,,2019-11-14T14:01:03,true,1,,,,,LE BOURG,86260,VICQ-SUR-GARTEMPE,,,86288,,,,,,,,,,,,,,,,,,,1999-06-30,F,,,,,55.3A,NAF1993,N,0.860562,46.720119,0.92,locality,Le Bourg Sud 86260 Vicq-sur-Gartempe,86288_b035,G,LE BOURG SUD,
383992138,00016,38399213800016,O,1992-01-02,02,2018,,2020-08-25T10:21:02,true,3,,,,,RIS,86260,VICQ-SUR-GARTEMPE,,,86288,,,,,,,,,,,,,,,,,,,2008-01-01,A,,,,,47.21Z,NAFRev2,N,0.858475,46.754388,0.9,street,Lieu Dit Ris 86260 Vicq-sur-Gartempe,86288_vfyt5f,G,LIEU DIT RIS,
383992138,00024,38399213800024,O,1992-01-01,NN,,,2019-11-14T14:01:03,false,3,,,,,LE RIS,86260,VICQ-SUR-GARTEMPE,,,86288,,,,,,,,,,,,,,,,,,,2008-01-01,A,,,,,01.11Z,NAFRev2,N,0.8144013,46.7357734,0.89,poi.culvert,Le Ris (Buse) Vicq-sur-Gartempe,https://osm.org/way/407221968,G,,
384535522,00013,38453552200013,O,1992-01-01,NN,,,2019-11-14T14:01:03,true,3,,,,LD,CHAMPFOUCHE,86260,VICQ-SUR-GARTEMPE,,,86288,,,,,,,,,,,,,,,,,,,2008-01-01,A,,,,,01.11Z,NAFRev2,N,,,0,,,,,,
384632485,00015,38463248500015,O,1992-01-01,NN,,,2020-01-08T10:12:30,true,5,,8,,LD,BOISGARNAULT,86260,VICQ-SUR-GARTEMPE,,,86288,,,,,,,,,,,,,,,,,,,2019-12-01,A,,,,,01.19Z,NAFRev2,N,0.869901,46.742755,0.86,housenumber,8 Lieu Dit Boisgarnault 86260 Vicq-sur-Gartempe,86288_km036d_00008,G,8 LIEU DIT BOISGARNAULT,
384956942,00047,38495694200047,O,2019-04-01,,,,2021-02-23T11:13:05,false,1,,1,,,TERRIER SAINTE SERENNE,86260,VICQ-SUR-GARTEMPE,,,86288,,,,,,,,,,,,,,,,,,,2019-04-01,A,,,,,90.03A,NAFRev2,N,0.861567,46.719775,0.94,housenumber,1 Terrier Sainte Serenne 86260 Vicq-sur-Gartempe,86288_teikam_00001,G,1 TERRIER SAINTE SERENNE,
387694227,00019,38769422700019,O,,NN,,,2019-11-14T14:01:03,true,1,,,,,LA SERENNE,86260,VICQ-SUR-GARTEMPE,,,86288,,,,,,,,,,,,,,,,,,,1992-06-15,F,,,,,55.2E,NAF1993,N,0.832544,46.720824,0.91,street,Lieu Dit la Serenne 86260 Vicq-sur-Gartempe,86288_wji5ad,G,LIEU DIT LA SERENNE,
392533295,00011,39253329500011,O,1992-01-26,NN,,,2019-11-14T14:01:03,true,4,,,,,LA BALIERE,86260,VICQ-SUR-GARTEMPE,,,86288,,,,,,,,,,,,,,,,,,,1996-12-25,F,,,,,92.3A,NAF1993,N,0.860439,46.751125,0.92,street,Lieu Dit la Baliere 86260 Vicq-sur-Gartempe,86288_ijp7dx,G,LIEU DIT LA BALIERE,
392546453,00037,39254645300037,O,2001-06-14,NN,,,2019-11-14T14:01:03,false,4,,6,,PL,DU BOURG,86260,VICQ-SUR-GARTEMPE,,,86288,,,,,,,,,,,,,,,,,,,2002-06-04,F,,,,,92.3A,NAF1993,N,0.862055,46.721537,0.8,housenumber,6 Place du Bourg 86260 Vicq-sur-Gartempe,86288_0020_00006,G,6 PLACE DU BOURG,