siren,nic,siret,statutDiffusionEtablissement,dateCreationEtablissement,trancheEffectifsEtablissement,anneeEffectifsEtablissement,activitePrincipaleRegistreMetiersEtablissement,dateDernierTraitementEtablissement,etablissementSiege,nombrePeriodesEtablissement,complementAdresseEtablissement,numeroVoieEtablissement,indiceRepetitionEtablissement,typeVoieEtablissement,libelleVoieEtablissement,codePostalEtablissement,libelleCommuneEtablissement,libelleCommuneEtrangerEtablissement,distributionSpecialeEtablissement,codeCommuneEtablissement,codeCedexEtablissement,libelleCedexEtablissement,codePaysEtrangerEtablissement,libellePaysEtrangerEtablissement,complementAdresse2Etablissement,numeroVoie2Etablissement,indiceRepetition2Etablissement,typeVoie2Etablissement,libelleVoie2Etablissement,codePostal2Etablissement,libelleCommune2Etablissement,libelleCommuneEtranger2Etablissement,distributionSpeciale2Etablissement,codeCommune2Etablissement,codeCedex2Etablissement,libelleCedex2Etablissement,codePaysEtranger2Etablissement,libellePaysEtranger2Etablissement,dateDebut,etatAdministratifEtablissement,enseigne1Etablissement,enseigne2Etablissement,enseigne3Etablissement,denominationUsuelleEtablissement,activitePrincipaleEtablissement,nomenclatureActivitePrincipaleEtablissement,caractereEmployeurEtablissement,longitude,latitude,geo_score,geo_type,geo_adresse,geo_id,geo_ligne,geo_l4,geo_l5
130001688,00022,13000168800022,O,2006-01-01,,,,2019-11-14T14:01:03,false,3,,,,,LA GARE,87700,AIXE-SUR-VIENNE,,,87001,,,,,,,,,,,,,,,,,,,2011-09-14,F,CEI D'AIXE SUR VIENNE,,,,84.13Z,NAFRev2,O,2.750937,45.0837488,0.89,poi,Gare (Pont) Laveissière,https://osm.org/way/204365569,G,,
130012941,00154,13001294100154,O,2010-11-01,01,2018,,2020-08-25T10:13:19,false,1,,38,,AV,DU PRESIDENT WILSON,87700,AIXE-SUR-VIENNE,,BP   51,87001,,,,,,,,,,,,,,,,,,,2010-11-01,A,TRESORERIE DE AIXE-SUR-VIENNE,,,,84.11Z,NAFRev2,N,1.136952,45.796787,0.88,housenumber,38 Avenue du President Wilson 87700 Aixe-sur-Vienne,87001_0620_00038,G,38 AVENUE DU PRESIDENT WILSON,
178702114,00327,17870211400327,O,1983-03-29,,,,2019-11-14T14:01:03,false,4,,38,,AV,DU PRESIDENT WILSON,87700,AIXE-SUR-VIENNE,,,87001,,,,,,,,,,,,,,,,,,,2010-11-01,F,TRESORERIE D'AIXE-SUR-VIENNE,,,,84.11Z,NAFRev2,N,1.136952,45.796787,0.88,housenumber,38 Avenue du President Wilson 87700 Aixe-sur-Vienne,87001_0620_00038,G,38 AVENUE DU PRESIDENT WILSON,
198700015,00011,19870001500011,O,1983-03-01,21,2018,,2020-08-25T10:14:28,true,5,,,,RUE,DES GRANGETTES,87700,AIXE-SUR-VIENNE,,,87001,,,,,,,,,,,,,,,,,,,2011-01-16,A,,,,,85.31Z,NAFRev2,O,1.132845,45.794954,0.95,street,Rue des Grangettes 87700 Aixe-sur-Vienne,87001_0240,G,RUE DES GRANGETTES,
200024743,00011,20002474300011,O,2010-03-19,02,2018,,2020-08-25T10:14:43,true,2,POLE ADMINISTRATIF DES ECURIES,38,,AV,DU PRESIDENT WILSON,87700,AIXE-SUR-VIENNE,,,87001,,,,,,,,,,,,,,,,,,,2012-02-12,A,,,,,84.13Z,NAFRev2,O,1.136952,45.796787,0.88,housenumber,38 Avenue du President Wilson 87700 Aixe-sur-Vienne,87001_0620_00038,G,38 AVENUE DU PRESIDENT WILSON,
200080307,00016,20008030700016,O,2018-01-01,11,2018,,2020-08-25T10:15:19,false,2,,2,,AV,FRANCOIS MITTERRAND,87700,AIXE-SUR-VIENNE,,,87001,,,,,,,,,,,,,,,,,,,2019-08-30,F,,,,,36.00Z,NAFRev2,O,1.130401,45.795735,0.87,housenumber,2 Avenue Francois Mitterrand 87700 Aixe-sur-Vienne,87001_0192_00002,G,2 AVENUE FRANCOIS MITTERRAND,
200080307,00024,20008030700024,O,2019-08-30,,,,2019-11-14T14:01:03,true,1,,3,,ALL,GEORGES CUVIER,87700,AIXE-SUR-VIENNE,,,87001,,,,,,,,,,,,,,,,,,,2019-08-30,A,,,,,36.00Z,NAFRev2,O,1.119723,45.799314,0.86,housenumber,3 Allée Georges Cuvier 87700 Aixe-sur-Vienne,87001_0227_00003,G,3 ALLEE GEORGES CUVIER,
218700102,00013,21870010200013,O,1983-03-01,21,2018,,2020-08-25T10:19:30,true,4,,44,,AV,DU PRESIDENT WILSON,87700,AIXE-SUR-VIENNE,,,87001,,,,,,,,,,,,,,,,,,,2008-01-01,A,MAIRIE,,,,84.11Z,NAFRev2,O,1.136187,45.796673,0.88,housenumber,44 Avenue du President Wilson 87700 Aixe-sur-Vienne,87001_0620_00044,G,44 AVENUE DU PRESIDENT WILSON,
218700102,00047,21870010200047,O,1983-03-16,NN,,,2019-11-14T14:01:03,false,3,,,,PL,RENE GILLET,87700,AIXE-SUR-VIENNE,,,87001,,,,,,,,,,,,,,,,,,,2008-01-01,A,CTRE COMM LOISIRS POUR ENFANTS,,,,90.04Z,NAFRev2,N,1.11607,45.800093,0.34,street,Rue Rene Dumont 87700 Aixe-sur-Vienne,87001_0081,G,RUE RENE DUMONT,
218700102,00054,21870010200054,O,1983-12-21,12,2018,,2020-08-25T10:19:30,false,3,,,,RUE,GEORGES EMMANUEL CLANCIER,87700,AIXE-SUR-VIENNE,,,87001,,,,,,,,,,,,,,,,,,,2008-01-01,A,ECOLE MATERNELLE PUBL G E CLANCIER,,,,85.20Z,NAFRev2,N,1.134545,45.7983138,0.82,poi.school,École maternelle Georges Emmanuel Clancier Aixe-sur-Vienne,https://osm.org/way/550259870,G,,
218700102,00062,21870010200062,O,1983-12-21,11,2018,,2020-08-25T10:19:30,false,3,,,,PL,RENE GILLET,87700,AIXE-SUR-VIENNE,,,87001,,,,,,,,,,,,,,,,,,,2008-01-01,A,ECOLE PRIMAIRE PUBLIQUE,,,,85.20Z,NAFRev2,N,1.11607,45.800093,0.34,street,Rue Rene Dumont 87700 Aixe-sur-Vienne,87001_0081,G,RUE RENE DUMONT,
218700102,00070,21870010200070,O,1983-12-21,NN,,,2019-11-14T14:01:03,false,4,,,,PL,RENE GILLET,87700,AIXE-SUR-VIENNE,,,87001,,,,,,,,,,,,,,,,,,,1997-12-31,F,ECOLE PRIMAIRE PUBLIQUE AIXE 2,,,,80.1Z,NAF1993,N,1.11607,45.800093,0.34,street,Rue Rene Dumont 87700 Aixe-sur-Vienne,87001_0081,G,RUE RENE DUMONT,
218700102,00088,21870010200088,O,1995-12-25,NN,,,2019-11-14T14:01:03,false,3,MAIRIE,44,,AV,DU PRESIDENT WILSON,87700,AIXE-SUR-VIENNE,,,87001,,,,,,,,,,,,,,,,,,,1997-12-31,F,TRANSPORTS SCOLAIRES BUDGET ANEXE,,,,60.2A,NAF1993,N,1.136187,45.796673,0.88,housenumber,44 Avenue du President Wilson 87700 Aixe-sur-Vienne,87001_0620_00044,G,44 AVENUE DU PRESIDENT WILSON,
218700102,00096,21870010200096,O,1998-01-01,NN,,,2019-11-14T14:01:03,false,4,MAIRIE,,,AV,DU PRESIDENT WILSON,87700,AIXE-SUR-VIENNE,,,87001,,,,,,,,,,,,,,,,,,,2012-12-25,F,LOTISSEMENTS COMMUNAUX,,,,42.99Z,NAFRev2,N,1.1412,45.79676,0.87,street,Avenue du President Wilson 87700 Aixe-sur-Vienne,87001_0620,G,AVENUE DU PRESIDENT WILSON,
218700102,00104,21870010200104,O,1998-01-01,02,2018,,2020-08-25T10:19:30,false,3,MAIRIE,,,AV,DU PRESIDENT WILSON,87700,AIXE-SUR-VIENNE,,,87001,,,,,,,,,,,,,,,,,,,2008-01-01,A,POMPES FUNEBRES,,,,96.03Z,NAFRev2,N,1.1412,45.79676,0.87,street,Avenue du President Wilson 87700 Aixe-sur-Vienne,87001_0620,G,AVENUE DU PRESIDENT WILSON,
218700102,00112,21870010200112,O,2000-01-01,NN,,,2019-11-14T14:01:03,false,3,MAIRIE,44,,AV,DU PRESIDENT WILSON,87700,AIXE-SUR-VIENNE,,,87001,,,,,,,,,,,,,,,,,,,2008-01-01,A,ATELIER-RELAIS,,,,68.20B,NAFRev2,N,1.136187,45.796673,0.88,housenumber,44 Avenue du President Wilson 87700 Aixe-sur-Vienne,87001_0620_00044,G,44 AVENUE DU PRESIDENT WILSON,
218700102,00120,21870010200120,O,1999-12-25,01,2018,,2021-04-09T09:30:54,false,3,,44,,AV,DU PRESIDENT WILSON,87700,AIXE-SUR-VIENNE,,,87001,,,,,,,,,,,,,,,,,,,2020-01-01,F,SERVICE D'ASSAINISSEMENT,,,,37.00Z,NAFRev2,N,1.136187,45.796673,0.88,housenumber,44 Avenue du President Wilson 87700 Aixe-sur-Vienne,87001_0620_00044,G,44 AVENUE DU PRESIDENT WILSON,
218700102,00138,21870010200138,O,2001-06-06,NN,,,2019-11-14T14:01:03,false,4,MAIRIE,44,,AV,DU PRESIDENT WILSON,87700,AIXE-SUR-VIENNE,,,87001,,,,,,,,,,,,,,,,,,,2012-12-25,F,LOTISSEMENT COMMUNAL DE  GRANDE TERRE,,,,42.99Z,NAFRev2,N,1.136187,45.796673,0.88,housenumber,44 Avenue du President Wilson 87700 Aixe-sur-Vienne,87001_0620_00044,G,44 AVENUE DU PRESIDENT WILSON,
218700102,00146,21870010200146,O,2003-01-01,03,2018,,2020-08-25T10:19:30,false,3,MAIRIE,44,,AV,DU PRESIDENT WILSON,87700,AIXE-SUR-VIENNE,,,87001,,,,,,,,,,,,,,,,,,,2008-01-01,A,RESTAURANT SCOLAIRE,,,,56.29B,NAFRev2,N,1.136187,45.796673,0.88,housenumber,44 Avenue du President Wilson 87700 Aixe-sur-Vienne,87001_0620_00044,G,44 AVENUE DU PRESIDENT WILSON,
218700102,00153,21870010200153,O,2003-05-01,NN,,,2019-11-14T14:01:03,false,3,,,,RUE,JEAN CLAUDE PAPON,87700,AIXE-SUR-VIENNE,,,87001,,,,,,,,,,,,,,,,,,,2008-01-01,A,CAMPING MUNICIPAL LES GREVES,,,,55.30Z,NAFRev2,N,1.138495,45.797116,0.95,street,Rue Jean-claude Papon 87700 Aixe-sur-Vienne,87001_0260,G,RUE JEAN CLAUDE PAPON,
228708517,00096,22870851700096,O,1985-01-01,03,2018,,2020-08-25T10:19:57,false,4,,1,T,AV,FRANCOIS MITTERRAND,87700,AIXE-SUR-VIENNE,,,87001,,,,,,,,,,,,,,,,,,,2008-01-01,A,MSD OUEST LIMOUSIN AIXE SUR VIENNE,,,,88.99B,NAFRev2,N,1.130441,45.795218,0.77,housenumber,1 ter Avenue Francois Mitterrand 87700 Aixe-sur-Vienne,87001_0192_00001_ter,G,1 TER AVENUE FRANCOIS MITTERRAND,
248719288,00016,24871928800016,O,2000-12-18,NN,,,2019-11-14T14:01:03,false,5,MAIRIE,44,,AV,DU PRESIDENT WILSON,87700,AIXE-SUR-VIENNE,,,87001,,,,,,,,,,,,,,,,,,,2008-01-01,F,,,,,84.11Z,NAFRev2,O,1.136187,45.796673,0.88,housenumber,44 Avenue du President Wilson 87700 Aixe-sur-Vienne,87001_0620_00044,G,44 AVENUE DU PRESIDENT WILSON,
248719288,00065,24871928800065,O,2002-01-01,NN,,,2019-11-14T14:01:03,false,3,,24,,AV,DU PRESIDENT WILSON,87700,AIXE-SUR-VIENNE,,,87001,,,,,,,,,,,,,,,,,,,2008-01-01,A,LOTISSEMENT COMMUNAL,,,,42.99Z,NAFRev2,N,1.139535,45.797373,0.88,housenumber,24 Avenue du President Wilson 87700 Aixe-sur-Vienne,87001_0620_00024,G,24 AVENUE DU PRESIDENT WILSON,
248719288,00073,24871928800073,O,2003-01-01,01,2018,,2021-02-23T10:34:37,false,5,,24,,AV,DU PRESIDENT WILSON,87700,AIXE-SUR-VIENNE,,,87001,,,,,,,,,,,,,,,,,,,2020-04-01,A,SPANC,,,,84.12Z,NAFRev2,O,1.139535,45.797373,0.88,housenumber,24 Avenue du President Wilson 87700 Aixe-sur-Vienne,87001_0620_00024,G,24 AVENUE DU PRESIDENT WILSON,
248719288,00123,24871928800123,O,2004-03-01,NN,,,2019-11-14T14:01:03,false,3,,19,,RUE,SABOTERIE,87700,AIXE-SUR-VIENNE,,,87001,,,,,,,,,,,,,,,,,,,2008-01-01,A,LOTISSEMENT L'AURENCE,,,,42.99Z,NAFRev2,N,1.135454,45.795571,0.95,housenumber,19 Rue Saboterie 87700 Aixe-sur-Vienne,87001_0660_00019,G,19 RUE SABOTERIE,
248719288,00131,24871928800131,O,2004-03-01,NN,,,2019-11-14T14:01:03,false,4,,19,,RUE,SABOTERIE,87700,AIXE-SUR-VIENNE,,,87001,,,,,,,,,,,,,,,,,,,2010-12-31,F,VILLAGE GITES VERNEUIL,,,,55.20Z,NAFRev2,N,1.135454,45.795571,0.95,housenumber,19 Rue Saboterie 87700 Aixe-sur-Vienne,87001_0660_00019,G,19 RUE SABOTERIE,
248719288,00164,24871928800164,O,2005-06-10,22,2018,,2021-02-23T10:34:37,true,1,,24,,AV,DU PRESIDENT WILSON,87700,AIXE-SUR-VIENNE,,,87001,,,,,,,,,,,,,,,,,,,2005-06-10,A,,,,,84.11Z,NAFRev2,O,1.139535,45.797373,0.88,housenumber,24 Avenue du President Wilson 87700 Aixe-sur-Vienne,87001_0620_00024,G,24 AVENUE DU PRESIDENT WILSON,
248719288,00180,24871928800180,O,2015-07-01,01,2018,,2020-08-25T10:20:10,false,1,,46,,AV,DU PRESIDENT WILSON,87700,AIXE-SUR-VIENNE,,,87001,,,,,,,,,,,,,,,,,,,2015-07-01,A,OFFICE DE TOURISME,,,,79.90Z,NAFRev2,O,1.135753,45.79661,0.88,housenumber,46 Avenue du President Wilson 87700 Aixe-sur-Vienne,87001_0620_00046,G,46 AVENUE DU PRESIDENT WILSON,
248719288,00206,24871928800206,O,2020-01-01,,,,2021-02-23T10:34:37,false,2,,24,,AV,DU PRESIDENT WILSON,87700,AIXE-SUR-VIENNE,,,87001,,,,,,,,,,,,,,,,,,,2020-04-06,A,ASSAINISSEMENT COLLECTIF,,,,37.00Z,NAFRev2,O,1.139535,45.797373,0.88,housenumber,24 Avenue du President Wilson 87700 Aixe-sur-Vienne,87001_0620_00024,G,24 AVENUE DU PRESIDENT WILSON,
258700103,00017,25870010300017,O,1983-03-01,NN,,,2019-11-14T14:01:03,true,5,,2,,AV,FRANCOIS MITTERRAND,87700,AIXE-SUR-VIENNE,,BP 41,87001,,,,,,,,,,,,,,,,,,,2018-01-01,F,,,,,36.00Z,NAFRev2,O,1.130401,45.795735,0.87,housenumber,2 Avenue Francois Mitterrand 87700 Aixe-sur-Vienne,87001_0192_00002,G,2 AVENUE FRANCOIS MITTERRAND,
258700103,00025,25870010300025,O,1997-01-01,NN,,,2019-11-14T14:01:03,false,4,,,,RUE,DES TUILIERES,87700,AIXE-SUR-VIENNE,,,87001,,,,,,,,,,,,,,,,,,,2008-01-01,F,MAITRISE D'OEUVRE BUDGET ANNEXE,,,,71.12B,NAFRev2,N,1.131236,45.79505,0.95,street,Rue des Tuilieres 87700 Aixe-sur-Vienne,87001_0749,G,RUE DES TUILIERES,
258700111,00010,25870011100010,O,1989-05-10,NN,,,2019-11-14T14:01:03,true,5,MAIRIE,,,AV,DU PRESIDENT WILSON,87700,AIXE-SUR-VIENNE,,,87001,,,,,,,,,,,,,,,,,,,2010-03-19,F,,,,,42.99Z,NAFRev2,O,1.1412,45.79676,0.87,street,Avenue du President Wilson 87700 Aixe-sur-Vienne,87001_0620,G,AVENUE DU PRESIDENT WILSON,
258707504,00027,25870750400027,O,1994-02-21,NN,,,2019-11-14T14:01:03,true,3,BP 41,2,,AV,FRANCOIS MITTERRAND,87700,AIXE-SUR-VIENNE,,,87001,,,,,,,,,,,,,,,,,,,2006-12-31,F,,,,,90.0A,NAFRev1,N,1.130401,45.795735,0.87,housenumber,2 Avenue Francois Mitterrand 87700 Aixe-sur-Vienne,87001_0192_00002,G,2 AVENUE FRANCOIS MITTERRAND,
268700101,00010,26870010100010,O,1983-08-10,NN,,,2019-11-14T14:01:03,true,4,HOTEL DE VILLE,44,,AV,DU PRESIDENT WILSON,87700,AIXE-SUR-VIENNE,,,87001,,,,,,,,,,,,,,,,,,,2009-12-25,A,,,,,88.99B,NAFRev2,N,1.136187,45.796673,0.88,housenumber,44 Avenue du President Wilson 87700 Aixe-sur-Vienne,87001_0620_00044,G,44 AVENUE DU PRESIDENT WILSON,
268700101,00028,26870010100028,O,2010-12-02,,,,2019-11-14T14:01:03,false,2,,24,,AV,DU PRESIDENT WILSON,87700,AIXE-SUR-VIENNE,,,87001,,,,,,,,,,,,,,,,,,,2011-03-11,A,SCE PORTAGE DE REPAS A DOMICILE,,,,88.99B,NAFRev2,N,1.139535,45.797373,0.88,housenumber,24 Avenue du President Wilson 87700 Aixe-sur-Vienne,87001_0620_00024,G,24 AVENUE DU PRESIDENT WILSON,
278700109,00012,27870010900012,O,,,,,2019-11-14T14:01:03,true,1,,44,,AV,DU PRESIDENT WILSON,87700,AIXE-SUR-VIENNE,,,87001,,,,,,,,,,,,,,,,,,,1995-12-25,F,,,,,90.0A,NAF1993,N,1.136187,45.796673,0.88,housenumber,44 Avenue du President Wilson 87700 Aixe-sur-Vienne,87001_0620_00044,G,44 AVENUE DU PRESIDENT WILSON,
300124336,00011,30012433600011,O,,NN,,,2019-11-14T14:01:03,true,1,,,,,LE MASNEUF,87700,AIXE-SUR-VIENNE,,,87001,,,,,,,,,,,,,,,,,,,1991-09-30,F,,,,,53.03,NAP,N,1.9223254,46.0112371,0.72,poi.3,Dolmen n° 1 du Masneuf (Patrimoine national) La Chapelle-Saint-Martial,https://osm.org/node/3412802129,G,,
300401114,00016,30040111400016,O,,NN,,,2019-11-14T14:01:03,true,1,,,,RUE,DU PUY PANARD,87700,AIXE-SUR-VIENNE,,,87001,,,,,,,,,,,,,,,,,,,1995-12-31,F,,,,,19.3Z,NAF1993,O,1.1624184,45.7959759,0.75,poi.farm,La ferme du Puy Panard (Agricoles) Aixe-sur-Vienne,https://osm.org/node/5571007242,G,,
300897717,00025,30089771700025,O,1980-08-01,01,2018,,2020-10-20T08:35:10,true,5,,,,PL,RENE GILLET,87700,AIXE-SUR-VIENNE,,,87001,,,,,,,,,,,,,,,,,,,2020-03-31,A,,,,,82.19Z,NAFRev2,N,1.11607,45.800093,0.34,street,Rue Rene Dumont 87700 Aixe-sur-Vienne,87001_0081,G,RUE RENE DUMONT,
300937166,00050,30093716600050,O,1985-01-01,NN,,,2019-11-14T14:01:03,true,4,,30,B,AV,PASTEUR,87700,AIXE-SUR-VIENNE,,,87001,,,,,,,,,,,,,,,,,,,2013-06-30,F,,,,,86.90E,NAFRev2,N,-0.6559079,44.8010318,0.73,poi,Avenue Pasteur (Pont) Pessac,https://osm.org/way/22929438,G,,
301096418,00019,30109641800019,O,1900-01-01,NN,,,2019-11-14T14:01:03,true,4,,44,,AV,DU PRESIDENT WILSON,87700,AIXE-SUR-VIENNE,,,87001,,,,,,,,,,,,,,,,,,,2015-06-30,A,,,,,79.90Z,NAFRev2,N,1.136187,45.796673,0.88,housenumber,44 Avenue du President Wilson 87700 Aixe-sur-Vienne,87001_0620_00044,G,44 AVENUE DU PRESIDENT WILSON,
301251229,00029,30125122900029,O,2006-01-01,,,,2019-11-14T14:01:03,true,2,,,,,PUY NEMARD,87700,AIXE-SUR-VIENNE,,,87001,,,,,,,,,,,,,,,,,,,2006-09-13,F,,,,,52.6D,NAFRev1,N,1.146517,45.810582,0.95,locality,Puy Nemard 87700 Aixe-sur-Vienne,87001_b088,G,PUY NEMARD,
301569810,00023,30156981000023,O,1991-01-01,NN,,,2019-11-14T14:01:03,false,4,,,,,MOULIN CHEYROUX,87700,AIXE-SUR-VIENNE,,BP 29,87001,,,,,,,,,,,,,,,,,,,2002-12-31,F,ISEF,,,,22.2J,NAF1993,O,1.114471,45.801984,0.95,locality,Moulin Cheyroux 87700 Aixe-sur-Vienne,87001_b064,G,MOULIN CHEYROUX,
301590188,00019,30159018800019,O,1974-01-01,NN,,,2019-11-14T14:01:03,true,5,,60,,AV,DU PRESIDENT WILSON,87700,AIXE-SUR-VIENNE,,,87001,,,,,,,,,,,,,,,,,,,2012-09-22,F,,,,,25.62B,NAFRev2,O,1.134124,45.796365,0.88,housenumber,60 Avenue du President Wilson 87700 Aixe-sur-Vienne,87001_0620_00060,G,60 AVENUE DU PRESIDENT WILSON,
301607867,00019,30160786700019,O,,,,,2019-11-14T14:01:03,true,1,,39,,AV,DU PRESIDENT WILSON,87700,AIXE-SUR-VIENNE,,,87001,,,,,,,,,,,,,,,,,,,1991-01-16,F,,,,,67.05,NAP,N,1.137176,45.796719,0.88,housenumber,39 Avenue du President Wilson 87700 Aixe-sur-Vienne,87001_0620_00039,G,39 AVENUE DU PRESIDENT WILSON,
301891883,00011,30189188300011,O,,NN,,,2019-11-14T14:01:03,true,1,,,,,LE COTEAU,87700,AIXE-SUR-VIENNE,,,87001,,,,,,,,,,,,,,,,,,,1991-02-13,F,,,,,55.60,NAP,N,4.089552,46.029255,0.89,poi.townhall,Mairie du Coteau (Hôtel de ville) Le Coteau,https://osm.org/way/166711973,G,,
301892519,00010,30189251900010,O,1965-01-01,NN,,9602AA,2019-11-14T14:01:03,true,5,,56,,AV,DU PRESIDENT WILSON,87700,AIXE-SUR-VIENNE,,,87001,,,,,,,,,,,,,,,,,,,2014-06-30,F,,,,,96.02A,NAFRev2,O,1.134375,45.796405,0.88,housenumber,56 Avenue du President Wilson 87700 Aixe-sur-Vienne,87001_0620_00056,G,56 AVENUE DU PRESIDENT WILSON,
301965620,00018,30196562000018,O,1900-01-01,NN,,,2019-11-14T14:01:03,false,4,,10,,AV,PASTEUR,87700,AIXE-SUR-VIENNE,,,87001,,,,,,,,,,,,,,,,,,,2001-12-31,F,,,,,85.1G,NAF1993,O,1.132455,45.79612,0.8,housenumber,10 Avenue Louis Pasteur 87700 Aixe-sur-Vienne,87001_0600_00010,G,10 AVENUE LOUIS PASTEUR,
301965620,00026,30196562000026,O,2001-09-01,NN,,,2019-11-14T14:01:03,true,3,,1,,AV,RAYMOND POINCARE,87700,AIXE-SUR-VIENNE,,,87001,,,,,,,,,,,,,,,,,,,2008-01-01,A,,,,,86.90E,NAFRev2,O,1.125654,45.795269,0.86,housenumber,1 Avenue Raymond Poincaré 87700 Aixe-sur-Vienne,87001_0632_00001,G,1 AVENUE RAYMOND POINCARE,
301965638,00010,30196563800010,O,,,,,2019-11-14T14:01:03,true,1,,,,AV,DU PRESIDENT WILSON,87700,AIXE-SUR-VIENNE,,,87001,,,,,,,,,,,,,,,,,,,1984-12-25,F,,,,,00.10,NAP,N,1.1412,45.79676,0.87,street,Avenue du President Wilson 87700 Aixe-sur-Vienne,87001_0620,G,AVENUE DU PRESIDENT WILSON,
301966149,00017,30196614900017,O,1974-01-01,NN,,,2019-11-14T14:01:03,true,4,,60,,AV,DU PRESIDENT WILSON,87700,AIXE-SUR-VIENNE,,,87001,,,,,,,,,,,,,,,,,,,2010-02-28,F,,,,,68.20B,NAFRev2,N,1.134124,45.796365,0.88,housenumber,60 Avenue du President Wilson 87700 Aixe-sur-Vienne,87001_0620_00060,G,60 AVENUE DU PRESIDENT WILSON,
302302302,00013,30230230200013,O,,NN,,,2019-11-14T14:01:03,true,1,,40,,AV,DU PRESIDENT WILSON,87700,AIXE-SUR-VIENNE,,,87001,,,,,,,,,,,,,,,,,,,2002-12-31,F,,,,,70.2C,NAF1993,N,1.136724,45.796756,0.88,housenumber,40 Avenue du President Wilson 87700 Aixe-sur-Vienne,87001_0620_00040,G,40 AVENUE DU PRESIDENT WILSON,
303211650,00013,30321165000013,O,1973-01-01,NN,,,2019-11-14T14:01:03,true,4,,13,,AV,RAYMOND POINCARE,87700,AIXE-SUR-VIENNE,,,87001,,,,,,,,,,,,,,,,,,,2013-09-01,F,,,,,68.20B,NAFRev2,N,1.123231,45.796408,0.87,housenumber,13 Avenue Raymond Poincaré 87700 Aixe-sur-Vienne,87001_0632_00013,G,13 AVENUE RAYMOND POINCARE,
303311260,00051,30331126000051,O,1996-04-09,NN,,,2019-11-14T14:01:03,true,3,,17,,RUE,REMBRANDT,87700,AIXE-SUR-VIENNE,,,87001,,,,,,,,,,,,,,,,,,,2006-07-18,F,,,,,67.1C,NAFRev1,N,1.160373,45.804849,0.95,housenumber,17 Rue Rembrandt 87700 Aixe-sur-Vienne,87001_0638_00017,G,17 RUE REMBRANDT,
303445514,00050,30344551400050,O,,NN,,,2019-11-14T14:01:03,true,1,,16,,RUE,JEANNE D ALBRET,87700,AIXE-SUR-VIENNE,,,87001,,,,,,,,,,,,,,,,,,,1987-12-31,F,,,,,62.46,NAP,N,1.14282,45.795972,0.95,housenumber,16 Rue Jeanne d'Albret 87700 Aixe-sur-Vienne,87001_0380_00016,G,16 RUE JEANNE D ALBRET,
303524243,00027,30352424300027,O,2001-05-11,NN,,,2019-11-14T14:01:03,true,4,,5,,AV,DU GENERAL DE GAULLE,87700,AIXE-SUR-VIENNE,,,87001,,,,,,,,,,,,,,,,,,,2006-07-31,F,,,,,55.1A,NAFRev1,N,1.144542,45.797632,0.88,housenumber,5 Avenue du General de Gaulle 87700 Aixe-sur-Vienne,87001_0223_00005,G,5 AVENUE DU GENERAL DE GAULLE,
303577365,00073,30357736500073,O,2014-08-13,,,,2019-11-14T14:01:03,true,2,,,,,LA BOUCHIE,87700,AIXE-SUR-VIENNE,,,87001,,,,,,,,,,,,,,,,,,,2014-12-15,F,,,,,43.21A,NAFRev2,N,1.101816,45.787912,0.95,street,La Bouchie 87700 Aixe-sur-Vienne,87001_07ofr9,G,LA BOUCHIE,
304705999,00015,30470599900015,O,,NN,,,2019-11-14T14:01:03,true,1,,,,AV,DE MALASSERT,87700,AIXE-SUR-VIENNE,,,87001,,,,,,,,,,,,,,,,,,,,F,,,,,48.07,NAP,N,1.140685,45.7948,0.83,street,Avenue de Malassert 87700 Aixe-sur-Vienne,87001_0460,G,AVENUE DE MALASSERT,
304808595,00017,30480859500017,O,,,,,2019-11-14T14:01:03,true,1,,12,,PL,AYMARD FAYARD,87700,AIXE-SUR-VIENNE,,,87001,,,,,,,,,,,,,,,,,,,1990-10-30,F,,,,,38.50,NAP,N,1.136257,45.795782,0.84,housenumber,12 Place Aymard Fayard 87700 Aixe-sur-Vienne,87001_0010_00012,G,12 PLACE AYMARD FAYARD,
305104994,00028,30510499400028,O,,,,,2019-11-14T14:01:03,true,1,,,,AV,DU PRESIDENT WILSON,87700,AIXE-SUR-VIENNE,,,87001,,,,,,,,,,,,,,,,,,,1984-12-25,F,,,,,00.97,NAP,N,1.1412,45.79676,0.87,street,Avenue du President Wilson 87700 Aixe-sur-Vienne,87001_0620,G,AVENUE DU PRESIDENT WILSON,
305213696,00035,30521369600035,O,1992-01-01,NN,,,2019-11-14T14:01:03,true,1,,,,,TABAILLOU,87700,AIXE-SUR-VIENNE,,,87001,,,,,,,,,,,,,,,,,,,1997-05-11,F,,,,,01.3Z,NAF1993,N,4.061281,48.2590229,0.71,poi.pub,Le Cabaillou (Pub) Rosières-près-Troyes,https://osm.org/way/72754846,G,,
305466195,00016,30546619500016,O,,,,,2019-11-14T14:01:03,true,1,,,,AV,JEANNE PICHENAUD,87700,AIXE-SUR-VIENNE,,,87001,,,,,,,,,,,,,,,,,,,1985-12-25,F,,,,,22.02,NAP,N,1.136855,45.794394,0.85,street,Avenue Jeanne Pichenaud 87700 Aixe-sur-Vienne,87001_0400,G,AVENUE JEANNE PICHENAUD,
305466203,00018,30546620300018,O,1976-01-01,NN,,,2019-11-14T14:01:03,true,1,,5,,AV,JEANNE PICHENAUD,87700,AIXE-SUR-VIENNE,,,87001,,,,,,,,,,,,,,,,,,,1998-03-30,F,,,,,29.3C,NAF1993,N,1.136984,45.794132,0.86,housenumber,5 Avenue Jeanne Pichenaud 87700 Aixe-sur-Vienne,87001_0400_00005,G,5 AVENUE JEANNE PICHENAUD,
306061490,00018,30606149000018,O,,,,,2019-11-14T14:01:03,true,1,,33,,AV,DU GENERAL DE GAULLE,87700,AIXE-SUR-VIENNE,,,87001,,,,,,,,,,,,,,,,,,,1990-03-31,F,,,,,65.06,NAP,N,1.147271,45.796429,0.88,housenumber,33 Avenue du General de Gaulle 87700 Aixe-sur-Vienne,87001_0223_00033,G,33 AVENUE DU GENERAL DE GAULLE,
306125824,00020,30612582400020,O,,NN,,,2019-11-14T14:01:03,true,1,,2,,PL,DE L EGLISE,87700,AIXE-SUR-VIENNE,,,87001,,,,,,,,,,,,,,,,,,,1991-06-30,F,,,,,64.46,NAP,N,-1.1676989,44.0766928,0.78,poi.park,Place de l'Église (Parc) Mézos,https://osm.org/way/37053988,G,,
306183898,00031,30618389800031,O,1990-11-30,NN,,,2019-11-14T14:01:03,true,4,,12,,PL,AYMARD FAYARD,87700,AIXE-SUR-VIENNE,,,87001,,,,,,,,,,,,,,,,,,,2008-09-30,F,,,,,10.71D,NAFRev2,O,1.136257,45.795782,0.84,housenumber,12 Place Aymard Fayard 87700 Aixe-sur-Vienne,87001_0010_00012,G,12 PLACE AYMARD FAYARD,
306436650,00031,30643665000031,O,,,,,2019-11-14T14:01:03,true,1,,,,IMP,JULES MICHELET,87700,AIXE-SUR-VIENNE,,,87001,,,,,,,,,,,,,,,,,,,1984-12-25,F,,,,,55.60,NAP,N,1.127671,45.792818,0.85,street,Impasse Jules Michelet 87700 Aixe-sur-Vienne,87001_0407,G,IMPASSE JULES MICHELET,
306482324,00010,30648232400010,O,1965-01-01,NN,,,2019-11-14T14:01:03,false,4,,29,,AV,PASTEUR,87700,AIXE-SUR-VIENNE,,,87001,,,,,,,,,,,,,,,,,,,1996-12-25,F,,,,,50.2Z,NAF1993,O,-0.6559079,44.8010318,0.73,poi,Avenue Pasteur (Pont) Pessac,https://osm.org/way/22929438,G,,
306593880,00025,30659388000025,O,1900-01-01,,,,2019-11-14T14:01:03,false,4,,28,,AV,DU PRESIDENT WILSON,87700,AIXE-SUR-VIENNE,,,87001,,,,,,,,,,,,,,,,,,,2008-01-01,A,,,,,69.10Z,NAFRev2,O,1.13831,45.796992,0.88,housenumber,28 Avenue du President Wilson 87700 Aixe-sur-Vienne,87001_0620_00028,G,28 AVENUE DU PRESIDENT WILSON,
306593880,00041,30659388000041,O,1974-07-23,11,2018,,2020-08-25T10:23:32,false,4,,61,,AV,DU PRESIDENT WILSON,87700,AIXE-SUR-VIENNE,,,87001,,,,,,,,,,,,,,,,,,,2011-12-31,A,,,,,69.10Z,NAFRev2,O,1.135104,45.796414,0.88,housenumber,61 Avenue du President Wilson 87700 Aixe-sur-Vienne,87001_0620_00061,G,61 AVENUE DU PRESIDENT WILSON,
306624248,00028,30662424800028,O,,,,,2019-11-14T14:01:03,true,1,,4,,RUE,DU DOCTEUR DUVERGER,87700,AIXE-SUR-VIENNE,,,87001,,,,,,,,,,,,,,,,,,,1988-02-29,F,,,,,64.11,NAP,N,1.136643,45.796242,0.95,housenumber,4 Rue du Docteur Duverger 87700 Aixe-sur-Vienne,87001_0080_00004,G,4 RUE DU DOCTEUR DUVERGER,
307154138,00027,30715413800027,O,,NN,,,2019-11-14T14:01:03,true,1,,32,,RUE,D ARLIQUET,87700,AIXE-SUR-VIENNE,,,87001,,,,,,,,,,,,,,,,,,,1991-06-29,F,,,,,57.08,NAP,N,1.151818,45.798868,0.95,housenumber,32 Rue d'Arliquet 87700 Aixe-sur-Vienne,87001_0008_00032,G,32 RUE D ARLIQUET,