siren,nic,siret,statutDiffusionEtablissement,dateCreationEtablissement,trancheEffectifsEtablissement,anneeEffectifsEtablissement,activitePrincipaleRegistreMetiersEtablissement,dateDernierTraitementEtablissement,etablissementSiege,nombrePeriodesEtablissement,complementAdresseEtablissement,numeroVoieEtablissement,indiceRepetitionEtablissement,typeVoieEtablissement,libelleVoieEtablissement,codePostalEtablissement,libelleCommuneEtablissement,libelleCommuneEtrangerEtablissement,distributionSpecialeEtablissement,codeCommuneEtablissement,codeCedexEtablissement,libelleCedexEtablissement,codePaysEtrangerEtablissement,libellePaysEtrangerEtablissement,complementAdresse2Etablissement,numeroVoie2Etablissement,indiceRepetition2Etablissement,typeVoie2Etablissement,libelleVoie2Etablissement,codePostal2Etablissement,libelleCommune2Etablissement,libelleCommuneEtranger2Etablissement,distributionSpeciale2Etablissement,codeCommune2Etablissement,codeCedex2Etablissement,libelleCedex2Etablissement,codePaysEtranger2Etablissement,libellePaysEtranger2Etablissement,dateDebut,etatAdministratifEtablissement,enseigne1Etablissement,enseigne2Etablissement,enseigne3Etablissement,denominationUsuelleEtablissement,activitePrincipaleEtablissement,nomenclatureActivitePrincipaleEtablissement,caractereEmployeurEtablissement,longitude,latitude,geo_score,geo_type,geo_adresse,geo_id,geo_ligne,geo_l4,geo_l5
210207767,00018,21020776700018,O,1983-03-01,02,2018,,2020-08-25T10:15:30,true,3,,10,,RUE,SAINT JEAN,02160,LA VILLE-AUX-BOIS-LES-PONTAVERT,,,02803,,,,,,,,,,,,,,,,,,,2008-01-01,A,MAIRIE,,,,84.11Z,NAFRev2,N,3.849956,49.427071,0.94,housenumber,10 Rue Saint Jean 02160 La Ville-aux-Bois-lès-Pontavert,02803_0050_00010,G,10 RUE SAINT JEAN,
210207767,00034,21020776700034,O,1997-01-01,NN,,,2019-11-14T14:00:14,false,3,MAIRIE,10,,RUE,SAINT JEAN,02160,LA VILLE-AUX-BOIS-LES-PONTAVERT,,,02803,,,,,,,,,,,,,,,,,,,2008-01-01,A,SERVICE D'EAU,,,,36.00Z,NAFRev2,N,3.849956,49.427071,0.94,housenumber,10 Rue Saint Jean 02160 La Ville-aux-Bois-lès-Pontavert,02803_0050_00010,G,10 RUE SAINT JEAN,
210207767,00042,21020776700042,O,2004-10-01,,,,2019-11-14T14:00:14,false,3,MAIRIE,10,,RUE,SAINT JEAN,02160,LA VILLE-AUX-BOIS-LES-PONTAVERT,,,02803,,,,,,,,,,,,,,,,,,,2008-01-01,A,SYLVICULTURE,,,,02.10Z,NAFRev2,N,3.849956,49.427071,0.94,housenumber,10 Rue Saint Jean 02160 La Ville-aux-Bois-lès-Pontavert,02803_0050_00010,G,10 RUE SAINT JEAN,
260207865,00015,26020786500015,O,1983-03-01,NN,,,2019-11-14T14:00:14,true,4,MAIRIE,10,,RUE,SAINT JEAN,02160,LA VILLE-AUX-BOIS-LES-PONTAVERT,,,02803,,,,,,,,,,,,,,,,,,,2017-08-01,F,CCAS,,,,88.99B,NAFRev2,N,3.849956,49.427071,0.94,housenumber,10 Rue Saint Jean 02160 La Ville-aux-Bois-lès-Pontavert,02803_0050_00010,G,10 RUE SAINT JEAN,
302736202,00011,30273620200011,O,1900-01-01,NN,,,2019-11-14T14:00:14,true,3,,,,,,02160,LA VILLE-AUX-BOIS-LES-PONTAVERT,,,02803,,,,,,,,,,,,,,,,,,,2008-01-01,A,,,,,01.11Z,NAFRev2,N,,,0,,,,,,
307749432,00026,30774943200026,O,1982-07-30,NN,,,2019-11-14T14:00:14,true,3,,,,,,02160,LA VILLE-AUX-BOIS-LES-PONTAVERT,,,02803,,,,,,,,,,,,,,,,,,,2008-01-01,A,,,,,02.10Z,NAFRev2,N,,,0,,,,,,
311869739,00012,31186973900012,O,1974-01-01,NN,,,2019-11-14T14:00:14,true,3,,,,,,02160,LA VILLE-AUX-BOIS-LES-PONTAVERT,,,02803,,,,,,,,,,,,,,,,,,,2008-01-01,A,,,,,01.11Z,NAFRev2,N,,,0,,,,,,
312326044,00012,31232604400012,O,1978-01-01,NN,,,2019-11-14T14:00:14,false,8,,,,,RN44,02160,LA VILLE-AUX-BOIS-LES-PONTAVERT,,,02803,,,,,,,,,,,,,,,,,,,2014-11-10,F,LE CHALET MOBILE,,,,41.20B,NAFRev2,O,,,0,,,,,,
312962475,00017,31296247500017,O,1978-01-01,,,,2019-11-14T14:00:14,true,5,,,,,,02160,LA VILLE-AUX-BOIS-LES-PONTAVERT,,,02803,,,,,,,,,,,,,,,,,,,2008-01-01,F,,,,,01.11Z,NAFRev2,N,,,0,,,,,,
313590234,00016,31359023400016,O,1978-01-01,NN,,,2019-11-14T14:00:14,true,3,,,,,,02160,LA VILLE-AUX-BOIS-LES-PONTAVERT,,,02803,,,,,,,,,,,,,,,,,,,1998-12-25,F,,,,,70.2C,NAF1993,N,,,0,,,,,,
316812064,00012,31681206400012,O,,,,,2019-11-14T14:00:14,true,1,,,,,,02160,LA VILLE-AUX-BOIS-LES-PONTAVERT,,,02803,,,,,,,,,,,,,,,,,,,1985-08-01,F,,,,,55.4B,NAF1993,N,,,0,,,,,,
317606366,00043,31760636600043,O,,,,,2019-11-14T14:00:14,true,1,,,,,,02160,LA VILLE-AUX-BOIS-LES-PONTAVERT,,,02803,,,,,,,,,,,,,,,,,,,1989-11-08,F,,,,,67.01,NAP,N,,,0,,,,,,
321782799,00019,32178279900019,O,1981-01-01,01,2018,,2021-01-09T03:36:26,true,4,,12,,RTE,DEPARTEMENTALE 1044,02160,LA VILLE-AUX-BOIS-LES-PONTAVERT,,,02803,,,,,,,,,,,,,,,,,,,2012-12-31,A,,,,,01.49Z,NAFRev2,O,3.873001,49.423523,0.9,housenumber,12 Route Departementale 1044 02160 La Ville-aux-Bois-lès-Pontavert,02803_ox2qot_00012,G,12 ROUTE DEPARTEMENTALE 1044,
323389676,00020,32338967600020,O,,,,,2019-11-14T14:00:14,true,1,,,,,,02160,LA VILLE-AUX-BOIS-LES-PONTAVERT,,,02803,,,,,,,,,,,,,,,,,,,1990-12-26,F,,,,,59.13,NAP,N,,,0,,,,,,
325345882,00022,32534588200022,O,1982-06-27,NN,,,2021-09-24T03:49:31,true,6,,10,,RTE,DEPARTEMENTALE 1044,02160,LA VILLE-AUX-BOIS-LES-PONTAVERT,,,02803,,,,,,,,,,,,,,,,,,,2021-09-23,F,,,,,56.10A,NAFRev2,N,3.869948,49.425957,0.9,housenumber,10 Route Departementale 1044 02160 La Ville-aux-Bois-lès-Pontavert,02803_ox2qot_00010,G,10 ROUTE DEPARTEMENTALE 1044,
338026545,00016,33802654500016,O,1986-06-17,,,,2019-11-14T14:00:14,false,4,,,,,,02160,LA VILLE-AUX-BOIS-LES-PONTAVERT,,,02803,,,,,,,,,,,,,,,,,,,1993-12-25,F,COMPAGRI,,,,51.2A,NAF1993,N,,,0,,,,,,
341706943,00014,34170694300014,O,1987-07-06,NN,,,2019-11-14T14:00:14,true,4,,,,,B P 12,02160,LA VILLE-AUX-BOIS-LES-PONTAVERT,,,02803,,,,,,,,,,,,,,,,,,,1994-12-25,F,,,,,60.2L,NAF1993,N,,,0,,,,,,
342313095,00016,34231309500016,O,1987-07-01,NN,,,2019-11-14T14:00:14,true,4,,23,,RTE,DE CRAONNE,02160,LA VILLE-AUX-BOIS-LES-PONTAVERT,,,02803,,,,,,,,,,,,,,,,,,,1995-12-25,F,,,,,45.4J,NAF1993,N,3.848778,49.427797,0.84,housenumber,23 Route de Craonne 02160 La Ville-aux-Bois-lès-Pontavert,02803_0015_00023,G,23 ROUTE DE CRAONNE,
383603636,00010,38360363600010,O,,NN,,,2019-11-14T14:00:14,true,1,,,,,,02160,LA VILLE-AUX-BOIS-LES-PONTAVERT,,,02803,,,,,,,,,,,,,,,,,,,1996-04-01,F,,,,,55.3A,NAF1993,O,,,0,,,,,,
387574213,00022,38757421300022,O,2015-05-07,,,,2019-11-14T14:00:14,true,1,,12,,,RD 1044 LA FAISANDERIE,02160,LA VILLE-AUX-BOIS-LES-PONTAVERT,,,02803,,,,,,,,,,,,,,,,,,,2015-05-07,A,,,,,68.20B,NAFRev2,N,,,0,,,,,,
387834435,00027,38783443500027,O,2001-03-01,NN,,,2019-11-14T14:00:14,false,3,,4,,RTE,NATIONALE,02160,LA VILLE-AUX-BOIS-LES-PONTAVERT,,,02803,,,,,,,,,,,,,,,,,,,2004-06-30,F,,,,,74.1J,NAFRev1,N,3.862163,49.43209,0.43,housenumber,4 Route Departementale 1044 02160 La Ville-aux-Bois-lès-Pontavert,02803_ox2qot_00004,G,4 ROUTE DEPARTEMENTALE 1044,
400704532,00011,40070453200011,O,1993-07-21,NN,,,2020-07-20T10:48:17,false,4,,,,,,02160,LA VILLE-AUX-BOIS-LES-PONTAVERT,,,02803,,,,,,,,,,,,,,,,,,,2020-01-01,F,,,,,01.49Z,NAFRev2,N,,,0,,,,,,
400704532,00037,40070453200037,O,2019-06-26,,,,2020-01-22T13:49:36,false,1,,12,,RTE,DEPARTEMENTALE 1044,02160,LA VILLE-AUX-BOIS-LES-PONTAVERT,,,02803,,,,,,,,,,,,,,,,,,,2019-06-26,A,,,,,68.20B,NAFRev2,N,3.873001,49.423523,0.9,housenumber,12 Route Departementale 1044 02160 La Ville-aux-Bois-lès-Pontavert,02803_ox2qot_00012,G,12 ROUTE DEPARTEMENTALE 1044,
401794821,00017,40179482100017,O,1995-07-15,NN,,,2019-11-14T14:00:14,false,4,,39,,RTE,DE CRAONNE,02160,LA VILLE-AUX-BOIS-LES-PONTAVERT,,,02803,,,,,,,,,,,,,,,,,,,1996-12-25,F,,,,,74.1G,NAF1993,N,3.845533,49.427893,0.84,housenumber,39 Route de Craonne 02160 La Ville-aux-Bois-lès-Pontavert,02803_0015_00039,G,39 ROUTE DE CRAONNE,
403182702,00015,40318270200015,O,1995-12-19,NN,,,2019-11-14T14:00:14,false,4,,21,,RTE,DE CRAONNE,02160,LA VILLE-AUX-BOIS-LES-PONTAVERT,,,02803,,,,,,,,,,,,,,,,,,,2005-07-18,F,,,,,45.4M,NAFRev1,N,3.848893,49.427791,0.84,housenumber,21 Route de Craonne 02160 La Ville-aux-Bois-lès-Pontavert,02803_0015_00021,G,21 ROUTE DE CRAONNE,
408876787,00016,40887678700016,O,1980-01-01,NN,,,2019-11-14T14:00:14,true,4,,,,,,02160,LA VILLE-AUX-BOIS-LES-PONTAVERT,,,02803,,,,,,,,,,,,,,,,,,,2012-03-31,F,,,,,01.24Z,NAFRev2,N,,,0,,,,,,
409736733,00018,40973673300018,O,1996-03-12,NN,,,2019-11-14T14:00:14,true,3,MAIRIE,,,,,02160,LA VILLE-AUX-BOIS-LES-PONTAVERT,,,02803,,,,,,,,,,,,,,,,,,,2008-01-01,A,,,,,94.99Z,NAFRev2,N,,,0,,,,,,
412526907,00016,41252690700016,O,1997-06-01,NN,,,2019-11-14T14:00:14,true,4,,23,,RTE,DE CRAONNE,02160,LA VILLE-AUX-BOIS-LES-PONTAVERT,,,02803,,,,,,,,,,,,,,,,,,,2002-12-25,F,,,,,45.4M,NAF1993,N,3.848778,49.427797,0.84,housenumber,23 Route de Craonne 02160 La Ville-aux-Bois-lès-Pontavert,02803_0015_00023,G,23 ROUTE DE CRAONNE,
412609489,00015,41260948900015,O,1974-01-01,02,2018,,2020-08-25T10:40:34,true,5,,8,,RUE,ST JEAN,02160,LA VILLE-AUX-BOIS-LES-PONTAVERT,,,02803,,,,,,,,,,,,,,,,,,,2008-12-31,A,,,,,01.50Z,NAFRev2,O,3.850455,49.428899,0.8,housenumber,8 Rue Saint Jean 02160 La Ville-aux-Bois-lès-Pontavert,02803_0050_00008,G,8 RUE SAINT JEAN,
413071028,00018,41307102800018,O,1997-06-01,NN,,,2019-11-14T14:00:14,true,1,,23,,RTE,DE CRAONNE,02160,LA VILLE-AUX-BOIS-LES-PONTAVERT,,,02803,,,,,,,,,,,,,,,,,,,2002-10-23,F,,,,,74.1J,NAF1993,N,3.848778,49.427797,0.84,housenumber,23 Route de Craonne 02160 La Ville-aux-Bois-lès-Pontavert,02803_0015_00023,G,23 ROUTE DE CRAONNE,
414387282,00034,41438728200034,O,2015-08-01,02,2018,,2020-08-25T10:41:56,false,2,,8,,RTE,NATIONALE 44,02160,LA VILLE-AUX-BOIS-LES-PONTAVERT,,,02803,,,,,,,,,,,,,,,,,,,2019-08-23,F,,,,,01.61Z,NAFRev2,O,3.868508,49.42709,0.42,housenumber,8 Route Departementale 1044 02160 La Ville-aux-Bois-lès-Pontavert,02803_ox2qot_00008,G,8 ROUTE DEPARTEMENTALE 1044,
417809688,00035,41780968800035,O,2010-09-30,NN,,,2019-11-14T14:00:14,true,2,,6,,,DEPARTEMENTALE 44,02160,LA VILLE-AUX-BOIS-LES-PONTAVERT,,,02803,,,,,,,,,,,,,,,,,,,2014-02-25,F,,,,,46.23Z,NAFRev2,O,3.86724,49.42811,0.8,housenumber,6 Route Departementale 1044 02160 La Ville-aux-Bois-lès-Pontavert,02803_ox2qot_00006,G,6 ROUTE DEPARTEMENTALE 1044,
422450064,00023,42245006400023,O,2003-04-01,NN,,,2019-11-14T14:00:14,true,3,,,,RTE,NATIONALE 44,02160,LA VILLE-AUX-BOIS-LES-PONTAVERT,,,02803,,,,,,,,,,,,,,,,,,,2007-08-11,F,,,,,50.1Z,NAFRev1,O,3.862015,49.432024,0.36,street,Route Departementale 1044 02160 La Ville-aux-Bois-lès-Pontavert,02803_ox2qot,G,ROUTE DEPARTEMENTALE 1044,
423010636,00011,42301063600011,O,1999-05-01,NN,,,2019-11-14T14:00:14,false,3,,39,,RTE,,02160,LA VILLE-AUX-BOIS-LES-PONTAVERT,,,02803,,,,,,,,,,,,,,,,,,,2005-06-01,F,,,,,70.2C,NAFRev1,N,3.845533,49.427893,0.65,housenumber,39 Route de Craonne 02160 La Ville-aux-Bois-lès-Pontavert,02803_0015_00039,G,39 ROUTE DE CRAONNE,
423998004,00018,42399800400018,O,1978-08-01,NN,,,2019-11-14T14:00:14,true,3,,,,RTE,N 44,02160,LA VILLE-AUX-BOIS-LES-PONTAVERT,,,02803,,,,,,,,,,,,,,,,,,,2008-01-01,A,,,,,68.20B,NAFRev2,N,3.867122,49.42808,0.55,street,N 44 02160 La Ville-aux-Bois-lès-Pontavert,02803_0040,G,N 44,
424103000,00024,42410300000024,O,1992-01-01,NN,,,2019-11-14T14:00:14,true,3,,20,,RUE,DU BOIS DES BUTTES,02160,LA VILLE-AUX-BOIS-LES-PONTAVERT,,,02803,,,,,,,,,,,,,,,,,,,2006-06-27,F,,,,,70.2C,NAFRev1,N,3.847024,49.427265,0.67,housenumber,20 Le Bois des Buttes 02160 La Ville-aux-Bois-lès-Pontavert,02803_a010_00020,G,20 LE BOIS DES BUTTES,
433962032,00010,43396203200010,O,2000-12-21,NN,,,2019-11-14T14:00:14,true,4,,4,,RTE,NATIONALE,02160,LA VILLE-AUX-BOIS-LES-PONTAVERT,,,02803,,,,,,,,,,,,,,,,,,,2004-06-30,F,,,,,55.3A,NAFRev1,N,3.862163,49.43209,0.43,housenumber,4 Route Departementale 1044 02160 La Ville-aux-Bois-lès-Pontavert,02803_ox2qot_00004,G,4 ROUTE DEPARTEMENTALE 1044,
453225732,00032,45322573200032,O,2010-09-30,NN,,,2019-11-14T14:00:14,true,3,,4,,RTE,NATIONALE,02160,LA VILLE-AUX-BOIS-LES-PONTAVERT,,,02803,,,,,,,,,,,,,,,,,,,2012-02-14,F,,,,,56.10A,NAFRev2,O,3.862163,49.43209,0.43,housenumber,4 Route Departementale 1044 02160 La Ville-aux-Bois-lès-Pontavert,02803_ox2qot_00004,G,4 ROUTE DEPARTEMENTALE 1044,
480754092,00017,48075409200017,O,2005-02-14,NN,,,2019-11-14T14:00:14,false,1,,21,,GR,RUE,02160,LA VILLE-AUX-BOIS-LES-PONTAVERT,,,02803,,,,,,,,,,,,,,,,,,,2005-02-14,F,M.G RENOVATION,,,,45.2V,NAFRev1,N,3.849956,49.427071,0.37,street,Rue Saint Jean 02160 La Ville-aux-Bois-lès-Pontavert,02803_0050,G,RUE SAINT JEAN,
481083343,00022,48108334300022,O,2005-04-20,NN,,,2019-11-14T14:00:14,true,5,,4,,RTE,NATIONALE,02160,LA VILLE-AUX-BOIS-LES-PONTAVERT,,,02803,,,,,,,,,,,,,,,,,,,2010-09-24,F,,,,,56.10A,NAFRev2,O,3.862163,49.43209,0.43,housenumber,4 Route Departementale 1044 02160 La Ville-aux-Bois-lès-Pontavert,02803_ox2qot_00004,G,4 ROUTE DEPARTEMENTALE 1044,
505159046,00018,50515904600018,O,2008-06-01,,,,2019-11-14T14:00:14,true,1,,12,,RTE,DEPARTEMENTALE 1044,02160,LA VILLE-AUX-BOIS-LES-PONTAVERT,,,02803,,,,,,,,,,,,,,,,,,,2008-06-01,A,,,,,64.20Z,NAFRev2,N,3.873001,49.423523,0.9,housenumber,12 Route Departementale 1044 02160 La Ville-aux-Bois-lès-Pontavert,02803_ox2qot_00012,G,12 ROUTE DEPARTEMENTALE 1044,
505274928,00025,50527492800025,O,2015-04-01,NN,,4329AZ,2019-11-14T14:00:14,true,3,,42,,RTE,DE CRAONNE,02160,LA VILLE-AUX-BOIS-LES-PONTAVERT,,,02803,,,,,,,,,,,,,,,,,,,2016-03-04,F,,,,,43.21A,NAFRev2,N,3.847057,49.428101,0.84,housenumber,42 Route de Craonne 02160 La Ville-aux-Bois-lès-Pontavert,02803_0015_00042,G,42 ROUTE DE CRAONNE,
508273554,00024,50827355400024,O,2015-08-01,,,,2019-11-14T14:00:14,true,1,,8,,RTE,NATIONALE 44,02160,LA VILLE-AUX-BOIS-LES-PONTAVERT,,,02803,,,,,,,,,,,,,,,,,,,2015-08-01,A,,,,,68.32B,NAFRev2,N,3.868508,49.42709,0.42,housenumber,8 Route Departementale 1044 02160 La Ville-aux-Bois-lès-Pontavert,02803_ox2qot_00008,G,8 ROUTE DEPARTEMENTALE 1044,
513860403,00015,51386040300015,O,2009-07-17,,,,2019-11-14T14:00:14,true,1,,8,,RUE,SAINT JEAN,02160,LA VILLE-AUX-BOIS-LES-PONTAVERT,,,02803,,,,,,,,,,,,,,,,,,,2009-07-17,A,,,,,77.31Z,NAFRev2,N,3.850455,49.428899,0.94,housenumber,8 Rue Saint Jean 02160 La Ville-aux-Bois-lès-Pontavert,02803_0050_00008,G,8 RUE SAINT JEAN,
514180462,00012,51418046200012,O,2009-08-07,02,2018,,2020-08-25T10:29:22,true,2,,,,,RN 44,02160,LA VILLE-AUX-BOIS-LES-PONTAVERT,,,02803,,,,,,,,,,,,,,,,,,,2009-09-30,A,LE RELAIS SAINTE MARIE,,,,56.10A,NAFRev2,O,3.867122,49.42808,0.62,street,N 44 02160 La Ville-aux-Bois-lès-Pontavert,02803_0040,G,N 44,
518731559,00028,51873155900028,O,2015-08-01,,,,2021-02-23T15:30:23,true,1,,8,,RTE,NATIONALE 44,02160,LA VILLE-AUX-BOIS-LES-PONTAVERT,,,02803,,,,,,,,,,,,,,,,,,,2015-08-01,A,,,,,70.10Z,NAFRev2,N,3.868508,49.42709,0.42,housenumber,8 Route Departementale 1044 02160 La Ville-aux-Bois-lès-Pontavert,02803_ox2qot_00008,G,8 ROUTE DEPARTEMENTALE 1044,
524616372,00016,52461637200016,O,2010-07-15,NN,,4722ZA,2019-11-14T14:00:14,true,4,,6,,,DEPARTEMENTALE 44,02160,LA VILLE-AUX-BOIS-LES-PONTAVERT,,,02803,,,,,,,,,,,,,,,,,,,2015-12-11,F,LA BONNE VIANDE,,,LA BONNE VIANDE,47.22Z,NAFRev2,N,3.86724,49.42811,0.8,housenumber,6 Route Departementale 1044 02160 La Ville-aux-Bois-lès-Pontavert,02803_ox2qot_00006,G,6 ROUTE DEPARTEMENTALE 1044,
527762009,00027,52776200900027,O,2012-02-26,,,,2019-11-14T14:00:14,true,2,,20,,RTE,DE CRAONNE,02160,LA VILLE-AUX-BOIS-LES-PONTAVERT,,,02803,,,,,,,,,,,,,,,,,,,2018-12-31,F,,,,,47.81Z,NAFRev2,N,3.848594,49.427851,0.84,housenumber,20 Route de Craonne 02160 La Ville-aux-Bois-lès-Pontavert,02803_0015_00020,G,20 ROUTE DE CRAONNE,
533899530,00018,53389953000018,O,2011-07-26,,,,2019-11-14T14:00:14,true,1,,12,,RTE,DEPARTEMENTALE 1044,02160,LA VILLE-AUX-BOIS-LES-PONTAVERT,,,02803,,,,,,,,,,,,,,,,,,,2011-07-26,A,,,,,68.20B,NAFRev2,N,3.873001,49.423523,0.9,housenumber,12 Route Departementale 1044 02160 La Ville-aux-Bois-lès-Pontavert,02803_ox2qot_00012,G,12 ROUTE DEPARTEMENTALE 1044,
538901562,00016,53890156200016,O,2012-01-01,,,,2019-11-14T14:00:14,true,1,,39,,RTE,DE CRAONNE,02160,LA VILLE-AUX-BOIS-LES-PONTAVERT,,,02803,,,,,,,,,,,,,,,,,,,2012-01-01,A,,,,,90.03A,NAFRev2,N,3.845533,49.427893,0.84,housenumber,39 Route de Craonne 02160 La Ville-aux-Bois-lès-Pontavert,02803_0015_00039,G,39 ROUTE DE CRAONNE,
539374009,00014,53937400900014,O,2012-01-17,NN,,,2019-11-14T14:00:14,true,4,,4,,RTE,NATIONALE,02160,LA VILLE-AUX-BOIS-LES-PONTAVERT,,,02803,,,,,,,,,,,,,,,,,,,2014-02-07,F,LA MUSETTE,,,,56.10A,NAFRev2,O,3.862163,49.43209,0.43,housenumber,4 Route Departementale 1044 02160 La Ville-aux-Bois-lès-Pontavert,02803_ox2qot_00004,G,4 ROUTE DEPARTEMENTALE 1044,
561670423,00012,56167042300012,O,1956-01-01,NN,,,2019-11-14T14:00:14,true,4,,,,,,02160,LA VILLE-AUX-BOIS-LES-PONTAVERT,,,02803,,,,,,,,,,,,,,,,,,,2009-09-30,F,,,,,68.20B,NAFRev2,N,,,0,,,,,,
721670321,00018,72167032100018,O,,,,,2019-11-14T14:00:14,true,1,,,,,,02160,LA VILLE-AUX-BOIS-LES-PONTAVERT,,,02803,,,,,,,,,,,,,,,,,,,1984-12-25,F,,,,,67.01,NAP,N,,,0,,,,,,
721670875,00013,72167087500013,O,,,,,2019-11-14T14:00:14,true,1,,,,,,02160,LA VILLE-AUX-BOIS-LES-PONTAVERT,,,02803,,,,,,,,,,,,,,,,,,,1984-12-25,F,,,,,55.73,NAP,N,,,0,,,,,,
731670139,00021,73167013900021,O,1999-10-01,NN,,,2019-11-14T14:00:14,true,3,,,,RUE,N 44,02160,LA VILLE-AUX-BOIS-LES-PONTAVERT,,,02803,,,,,,,,,,,,,,,,,,,2008-01-01,A,,,,,68.20B,NAFRev2,N,3.867122,49.42808,0.55,street,N 44 02160 La Ville-aux-Bois-lès-Pontavert,02803_0040,G,N 44,
750894974,00013,75089497400013,O,2012-04-01,NN,,,2019-11-14T14:00:14,false,2,,5,,RUE,SAINT JEAN,02160,LA VILLE-AUX-BOIS-LES-PONTAVERT,,,02803,,,,,,,,,,,,,,,,,,,2013-03-06,F,,,,,01.11Z,NAFRev2,N,3.850972,49.428385,0.94,housenumber,5 Rue Saint Jean 02160 La Ville-aux-Bois-lès-Pontavert,02803_0050_00005,G,5 RUE SAINT JEAN,
751935784,00015,75193578400015,O,2012-05-04,01,2018,,2020-08-25T10:54:37,true,1,,8,,RUE,SAINT JEAN,02160,LA VILLE-AUX-BOIS-LES-PONTAVERT,,,02803,,,,,,,,,,,,,,,,,,,2012-05-04,A,,,,,01.64Z,NAFRev2,N,3.850455,49.428899,0.94,housenumber,8 Rue Saint Jean 02160 La Ville-aux-Bois-lès-Pontavert,02803_0050_00008,G,8 RUE SAINT JEAN,
753584234,00011,75358423400011,O,2012-10-01,,,,2019-11-14T14:00:14,true,2,,29,,RUE,DE CRAONNE,02160,LA VILLE-AUX-BOIS-LES-PONTAVERT,,,02803,,,,,,,,,,,,,,,,,,,2014-01-13,F,,,,,32.13Z,NAFRev2,N,3.847702,49.427833,0.79,housenumber,29 Route de Craonne 02160 La Ville-aux-Bois-lès-Pontavert,02803_0015_00029,G,29 ROUTE DE CRAONNE,
791131360,00012,79113136000012,O,2013-01-01,01,2018,,2020-08-25T11:01:33,true,1,,8,,RUE,SAINT JEAN,02160,LA VILLE-AUX-BOIS-LES-PONTAVERT,,,02803,,,,,,,,,,,,,,,,,,,2013-01-01,A,,,,,85.51Z,NAFRev2,O,3.850455,49.428899,0.94,housenumber,8 Rue Saint Jean 02160 La Ville-aux-Bois-lès-Pontavert,02803_0050_00008,G,8 RUE SAINT JEAN,
800343410,00018,80034341000018,O,2014-02-01,,,,2019-11-14T14:00:14,true,2,,29,,RTE,DE CRAONNE,02160,LA VILLE-AUX-BOIS-LES-PONTAVERT,,,02803,,,,,,,,,,,,,,,,,,,2014-12-31,F,,,,,32.13Z,NAFRev2,N,3.847702,49.427833,0.84,housenumber,29 Route de Craonne 02160 La Ville-aux-Bois-lès-Pontavert,02803_0015_00029,G,29 ROUTE DE CRAONNE,
801424755,00016,80142475500016,O,2014-04-01,,,,2019-11-14T14:00:14,true,2,,2,,RUE,BOIS DES BUTTES,02160,LA VILLE-AUX-BOIS-LES-PONTAVERT,,,02803,,,,,,,,,,,,,,,,,,,2014-06-30,F,,,,MARTIN ELECTRIX,43.21A,NAFRev2,N,3.845275,49.427564,0.77,housenumber,2 Le Bois des Buttes 02160 La Ville-aux-Bois-lès-Pontavert,02803_a010_00002,G,2 LE BOIS DES BUTTES,
807778485,00035,80777848500035,O,2015-08-01,,,,2019-11-14T14:00:14,true,1,,8,,RTE,NATIONALE 44,02160,LA VILLE-AUX-BOIS-LES-PONTAVERT,,,02803,,,,,,,,,,,,,,,,,,,2015-08-01,A,,,,,47.25Z,NAFRev2,N,3.868508,49.42709,0.42,housenumber,8 Route Departementale 1044 02160 La Ville-aux-Bois-lès-Pontavert,02803_ox2qot_00008,G,8 ROUTE DEPARTEMENTALE 1044,
808055156,00018,80805515600018,O,2014-12-08,01,2018,,2020-08-25T11:16:13,true,3,,4,,RTE,NATIONALE 1044,02160,LA VILLE-AUX-BOIS-LES-PONTAVERT,,,02803,,,,,,,,,,,,,,,,,,,2015-05-06,A,,,,LA MUSETTE,56.30Z,NAFRev2,O,3.862163,49.43209,0.55,housenumber,4 Route Departementale 1044 02160 La Ville-aux-Bois-lès-Pontavert,02803_ox2qot_00004,G,4 ROUTE DEPARTEMENTALE 1044,
809287485,00019,80928748500019,O,1996-03-12,,,,2019-11-14T14:00:14,true,1,MAIRIE,,,,,02160,LA VILLE-AUX-BOIS-LES-PONTAVERT,,,02803,,,,,,,,,,,,,,,,,,,1996-03-12,A,,,,,94.99Z,NAFRev2,N,,,0,,,,,,
811818723,00017,81181872300017,O,2013-07-31,,,,2019-11-14T14:00:14,true,1,,10,,RTE,DEPARTEMENTALE 1044,02160,LA VILLE-AUX-BOIS-LES-PONTAVERT,,,02803,,,,,,,,,,,,,,,,,,,2013-07-31,A,,,,,94.99Z,NAFRev2,N,3.869948,49.425957,0.9,housenumber,10 Route Departementale 1044 02160 La Ville-aux-Bois-lès-Pontavert,02803_ox2qot_00010,G,10 ROUTE DEPARTEMENTALE 1044,
812332443,00017,81233244300017,O,2015-06-15,,,,2019-11-14T14:00:14,true,1,,8,,RUE,SAINT-JEAN,02160,LA VILLE-AUX-BOIS-LES-PONTAVERT,,,02803,,,,,,,,,,,,,,,,,,,2015-06-15,A,,,,,64.20Z,NAFRev2,N,3.850455,49.428899,0.94,housenumber,8 Rue Saint Jean 02160 La Ville-aux-Bois-lès-Pontavert,02803_0050_00008,G,8 RUE SAINT JEAN,
824045959,00015,82404595900015,O,2016-11-22,,,,2019-11-14T14:00:14,false,2,,14,,RUE,ST JEAN,02160,LA VILLE-AUX-BOIS-LES-PONTAVERT,,,02803,,,,,,,,,,,,,,,,,,,2018-09-20,F,,,,,68.20B,NAFRev2,N,3.849794,49.426656,0.81,housenumber,14 Rue Saint Jean 02160 La Ville-aux-Bois-lès-Pontavert,02803_0050_00014,G,14 RUE SAINT JEAN,
835280314,00013,83528031400013,O,2015-11-09,,,,2019-11-14T14:00:14,true,1,,8,,RUE,SAINT JEAN,02160,LA VILLE-AUX-BOIS-LES-PONTAVERT,,,02803,,,,,,,,,,,,,,,,,,,2015-11-09,A,,,,,93.19Z,NAFRev2,N,3.850455,49.428899,0.94,housenumber,8 Rue Saint Jean 02160 La Ville-aux-Bois-lès-Pontavert,02803_0050_00008,G,8 RUE SAINT JEAN,
848991550,00015,84899155000015,O,2019-03-11,,,,2019-11-14T14:00:14,true,1,MAIRIE,10,,RUE,SAINT JEAN,02160,LA VILLE-AUX-BOIS-LES-PONTAVERT,,,02803,,,,,,,,,,,,,,,,,,,2019-03-11,A,,,,,94.99Z,NAFRev2,N,3.849956,49.427071,0.94,housenumber,10 Rue Saint Jean 02160 La Ville-aux-Bois-lès-Pontavert,02803_0050_00010,G,10 RUE SAINT JEAN,
852170919,00017,85217091900017,O,2019-07-07,,,,2020-07-18T04:02:50,true,2,,31,,RTE,DE CRAONNE,02160,LA VILLE-AUX-BOIS-LES-PONTAVERT,,,02803,,,,,,,,,,,,,,,,,,,2020-06-30,F,,,,,47.81Z,NAFRev2,N,3.847395,49.427842,0.84,housenumber,31 Route de Craonne 02160 La Ville-aux-Bois-lès-Pontavert,02803_0015_00031,G,31 ROUTE DE CRAONNE,
