siren,nic,siret,statutDiffusionEtablissement,dateCreationEtablissement,trancheEffectifsEtablissement,anneeEffectifsEtablissement,activitePrincipaleRegistreMetiersEtablissement,dateDernierTraitementEtablissement,etablissementSiege,nombrePeriodesEtablissement,complementAdresseEtablissement,numeroVoieEtablissement,indiceRepetitionEtablissement,typeVoieEtablissement,libelleVoieEtablissement,codePostalEtablissement,libelleCommuneEtablissement,libelleCommuneEtrangerEtablissement,distributionSpecialeEtablissement,codeCommuneEtablissement,codeCedexEtablissement,libelleCedexEtablissement,codePaysEtrangerEtablissement,libellePaysEtrangerEtablissement,complementAdresse2Etablissement,numeroVoie2Etablissement,indiceRepetition2Etablissement,typeVoie2Etablissement,libelleVoie2Etablissement,codePostal2Etablissement,libelleCommune2Etablissement,libelleCommuneEtranger2Etablissement,distributionSpeciale2Etablissement,codeCommune2Etablissement,codeCedex2Etablissement,libelleCedex2Etablissement,codePaysEtranger2Etablissement,libellePaysEtranger2Etablissement,dateDebut,etatAdministratifEtablissement,enseigne1Etablissement,enseigne2Etablissement,enseigne3Etablissement,denominationUsuelleEtablissement,activitePrincipaleEtablissement,nomenclatureActivitePrincipaleEtablissement,caractereEmployeurEtablissement,longitude,latitude,geo_score,geo_type,geo_adresse,geo_id,geo_ligne,geo_l4,geo_l5
211201868,00018,21120186800018,O,1983-03-01,01,2018,,2020-08-25T10:15:49,true,3,,,,,,12380,POUSTHOMY,,,12186,,,,,,,,,,,,,,,,,,,2008-01-01,A,MAIRIE,,,,84.11Z,NAFRev2,N,,,0,,,,,,
211201868,00026,21120186800026,O,1997-01-10,NN,,,2008-01-04T18:26:03,false,3,MAIRIE,,,,,12380,POUSTHOMY,,,12186,,,,,,,,,,,,,,,,,,,2008-01-01,A,SCE EAU ET ASSAINISSEMENT,,,,36.00Z,NAFRev2,N,2.612487,43.858291,0.91,street,Rue de la Mairie 12380 Pousthomy,12186_mfidtr,D,RUE DE LA MAIRIE,
261202899,00017,26120289900017,O,1984-10-15,NN,,,2010-06-26T03:04:41,true,3,,,,,MAIRIE,12380,POUSTHOMY,,,12186,,,,,,,,,,,,,,,,,,,2008-01-01,A,CCAS,,,,88.99B,NAFRev2,N,2.612487,43.858291,0.91,street,Rue de la Mairie 12380 Pousthomy,12186_mfidtr,G,RUE DE LA MAIRIE,
305366866,00013,30536686600013,O,,,,,,true,1,,,,,,12380,POUSTHOMY,,,12186,,,,,,,,,,,,,,,,,,,1984-12-25,F,,,,,55.60,NAP,N,,,0,,,,,,
306893207,00010,30689320700010,O,1976-01-01,NN,,,2013-01-16T16:26:18,true,4,,,,LD,MONTEGUT,12380,POUSTHOMY,,,12186,,,,,,,,,,,,,,,,,,,2012-12-31,F,,,,,68.20B,NAFRev2,N,0.4959607,43.0498532,0.9,poi,(Pont) Montégut,https://osm.org/way/121187484,G,,
308482124,00010,30848212400010,O,,NN,,,,true,1,,,,PL,DE L EGLISE,12380,POUSTHOMY,,,12186,,,,,,,,,,,,,,,,,,,1992-06-30,F,,,,,55.4A,NAF1993,N,2.612864,43.858237,0.81,street,Place de l’Église 12380 Pousthomy,12186_6jyimi,G,PLACE DE L EGLISE,
309579001,00020,30957900100020,O,1981-07-01,NN,,,2013-01-07T22:23:58,true,4,,,,,,12380,POUSTHOMY,,,12186,,,,,,,,,,,,,,,,,,,2012-12-31,F,,,,,43.31Z,NAFRev2,N,,,0,,,,,,
313601056,00028,31360105600028,O,2017-11-14,,,,2021-02-23T10:40:13,true,1,,,,,LES JARDINS DU BALAT,12380,POUSTHOMY,,,12186,,,,,,,,,,,,,,,,,,,2017-11-14,A,,,,,35.11Z,NAFRev2,N,,,0,,,,,,
316640853,00016,31664085300016,O,,NN,,,,true,1,,,,,,12380,POUSTHOMY,,,12186,,,,,,,,,,,,,,,,,,,1991-06-30,F,,,,,55.72,NAP,N,,,0,,,,,,
319144499,00013,31914449900013,O,,NN,,,,true,1,,,,LD,LA ROQUE,12380,POUSTHOMY,,,12186,,,,,,,,,,,,,,,,,,,1995-12-25,F,,,,,92.3A,NAF1993,N,2.6115,43.858108,0.4,street,Rue de la Fontaine 12380 Pousthomy,12186_c22ax7,G,RUE DE LA FONTAINE,
320566961,00019,32056696100019,O,,,,,,true,1,,,,PL,DU VILLAGE,12380,POUSTHOMY,,,12186,,,,,,,,,,,,,,,,,,,1984-12-25,F,,,,,57.06,NAP,N,2.2389236,48.6678573,0.77,poi.park,Place du Village (Parc) Nozay,https://osm.org/way/26978864,G,,
320777683,00014,32077768300014,O,1900-01-01,NN,,,2014-11-21T10:12:51,true,3,,,,,LA RIVIERE,12380,POUSTHOMY,,,12186,,,,,,,,,,,,,,,,,,,1988-06-30,A,,,,,55.20Z,NAFRev2,N,-1.3426023,47.5887548,0.89,poi.river,(Rivière) Moisdon-la-Rivière,https://osm.org/way/222281002,G,,
325626307,00012,32562630700012,O,,,,,,true,1,,,,,,12380,POUSTHOMY,,,12186,,,,,,,,,,,,,,,,,,,1985-12-25,F,,,,,62.11,NAP,N,,,0,,,,,,
328490321,00010,32849032100010,O,1983-10-13,NN,,,2009-08-04T04:24:34,true,3,,,,,MONTEGUT LE BAS,12380,POUSTHOMY,,,12186,,,,,,,,,,,,,,,,,,,2008-01-01,A,,,,,68.20B,NAFRev2,N,2.609767,43.853282,0.31,street,"Lieu Dit ""le Moulin à Vent"" 12380 Pousthomy",12186_B082,G,LIEU DIT LE MOULIN A VENT ,
329454086,00011,32945408600011,O,1983-06-01,NN,,,,false,4,,,,,,12380,POUSTHOMY,,,12186,,,,,,,,,,,,,,,,,,,1997-12-31,F,,,,,67.2Z,NAF1993,O,,,0,,,,,,
333943249,00016,33394324900016,O,,NN,,,,true,1,,,,,,12380,POUSTHOMY,,,12186,,,,,,,,,,,,,,,,,,,1990-12-31,F,,,,,62.11,NAP,N,,,0,,,,,,
334426293,00018,33442629300018,O,1985-12-19,NN,,,2008-04-26T10:14:10,true,5,,,,,,12380,POUSTHOMY,,,12186,,,,,,,,,,,,,,,,,,,2008-01-01,A,,,,,68.20B,NAFRev2,N,,,0,,,,,,
347442766,00015,34744276600015,O,,NN,,,,true,1,,,,,,12380,POUSTHOMY,,,12186,,,,,,,,,,,,,,,,,,,1988-12-31,F,,,,,02.0B,NAF1993,N,,,0,,,,,,
351156922,00038,35115692200038,O,2017-11-04,,,,2020-07-22T04:00:05,true,4,,,,,ANCIEN PRESBYTERE,12380,POUSTHOMY,,,12186,,,,,,,,,,,,,,,,,,,2020-06-30,F,AUBERGE DES ARCADES,,,AUBERGE DES ARCADES,56.30Z,NAFRev2,N,4.243259,45.3409585,0.9,poi.townhall,(Hôtel de ville) Pont-Salomon,https://osm.org/way/160345844,G,,
351156963,00032,35115696300032,O,2018-04-01,,,,2020-07-16T03:55:47,true,2,AUBERGE DES ARCADES,,,,ANCIEN PRESBYTERE,12380,POUSTHOMY,,,12186,,,,,,,,,,,,,,,,,,,2019-07-07,F,AUBERGE DES ARCADES,,,AUBERGE DES ARCADES,56.30Z,NAFRev2,N,4.243259,45.3409585,0.9,poi.townhall,(Hôtel de ville) Pont-Salomon,https://osm.org/way/160345844,G,,
352408538,00010,35240853800010,O,1989-10-01,02,2018,4399CZ,2020-08-25T10:12:37,true,4,,,,LD,MONTEGUT,12380,POUSTHOMY,,,12186,,,,,,,,,,,,,,,,,,,2008-01-01,A,,,,,43.99C,NAFRev2,O,0.4959607,43.0498532,0.9,poi,(Pont) Montégut,https://osm.org/way/121187484,G,,
381942275,00037,38194227500037,O,2010-02-01,,,,2013-10-15T04:08:46,true,2,,,,,LE BOURG,12380,POUSTHOMY,,,12186,,,,,,,,,,,,,,,,,,,2012-11-05,F,AUBERGE DES ARCADES,,,,56.10A,NAFRev2,N,2.609767,43.853282,0.31,street,"Lieu Dit ""le Moulin à Vent"" 12380 Pousthomy",12186_B082,G,LIEU DIT LE MOULIN A VENT ,
387542475,00026,38754247500026,O,1995-01-01,NN,,,,true,1,,,,,,12380,POUSTHOMY,,,12186,,,,,,,,,,,,,,,,,,,1998-12-31,F,,,,,55.3A,NAF1993,N,,,0,,,,,,
388704520,00021,38870452000021,O,1996-07-01,NN,,,2013-01-15T06:02:34,false,3,,,,,,12380,POUSTHOMY,,,12186,,,,,,,,,,,,,,,,,,,2005-12-31,F,,,,,45.1A,NAFRev1,N,,,0,,,,,,
388979247,00011,38897924700011,O,1992-01-01,NN,,,2008-01-04T23:17:27,true,3,,,,,LA JASSE DE BORDEAUX,12380,POUSTHOMY,,,12186,,,,,,,,,,,,,,,,,,,2008-01-01,A,,,,,01.45Z,NAFRev2,N,-0.564271,44.9127368,0.77,poi.stream,La Jalle de Blanquefort (Ruisseau) Bordeaux,https://osm.org/way/76483231,G,,
391646809,00049,39164680900049,O,2012-12-01,,,,2021-02-23T11:17:29,true,1,,,,LD,LE BOUYSSOU,12380,POUSTHOMY,,,12186,,,,,,,,,,,,,,,,,,,2012-12-01,A,,,,,01.49Z,NAFRev2,N,2.26384,43.8402279,0.89,poi.information,Le Bouyssou (Informations) Fauch,https://osm.org/node/1352776954,G,,
391787454,00019,39178745400019,O,1993-06-03,NN,,,2008-01-04T23:56:54,true,3,,,,,,12380,POUSTHOMY,,,12186,,,,,,,,,,,,,,,,,,,2008-01-01,A,,,,,68.20A,NAFRev2,N,,,0,,,,,,
394804892,00062,39480489200062,O,1995-04-01,,,,2006-10-28T02:14:13,false,3,CHEZ MR JACQUES KOURAGINE,,,,LA RIVIERE,12380,POUSTHOMY,,,12186,,,,,,,,,,,,,,,,,,,2004-12-31,F,,,,,50.4Z,NAFRev1,N,-1.3426023,47.5887548,0.89,poi.river,(Rivière) Moisdon-la-Rivière,https://osm.org/way/222281002,G,,
398463273,00019,39846327300019,O,1994-07-25,NN,,,2018-04-10T09:13:15,true,4,,,,LD,GRATASSOUC,12380,POUSTHOMY,,,12186,,,,,,,,,,,,,,,,,,,2017-08-31,F,,,,,01.45Z,NAFRev2,N,,,0,,,,,,
399139872,00010,39913987200010,O,1994-01-01,NN,,,2008-01-04T19:03:25,true,3,,,,,LE MAZET,12380,POUSTHOMY,,,12186,,,,,,,,,,,,,,,,,,,2008-01-01,A,,,,,01.43Z,NAFRev2,N,2.609767,43.853282,0.41,street,"Lieu Dit ""le Moulin à Vent"" 12380 Pousthomy",12186_B082,G,LIEU DIT LE MOULIN A VENT ,
400022711,00024,40002271100024,O,1969-05-28,NN,,,2016-10-11T04:54:42,true,3,MAIRIE,,,,,12380,POUSTHOMY,,,12186,,,,,,,,,,,,,,,,,,,2008-01-01,A,,,,,77.31Z,NAFRev2,N,2.612487,43.858291,0.91,street,Rue de la Mairie 12380 Pousthomy,12186_mfidtr,D,RUE DE LA MAIRIE,
402502132,00010,40250213200010,O,1995-10-04,NN,,,2008-11-08T01:13:41,false,4,,,,,,12380,POUSTHOMY,,,12186,,,,,,,,,,,,,,,,,,,2002-07-01,F,,,,,45.3A,NAF1993,N,,,0,,,,,,
403844772,00018,40384477200018,O,1972-01-01,NN,,,2021-01-07T15:11:48,true,5,,,,,ORIENT,12380,POUSTHOMY,,,12186,,,,,,,,,,,,,,,,,,,2008-01-01,F,,,,,68.20B,NAFRev2,N,2.615477,43.857202,0.37,street,Lotissement Peyralès 12380 Pousthomy,12186_z65p1c,G,LOTISSEMENT PEYRALES,
403977390,00018,40397739000018,O,1970-01-01,NN,,,,true,4,,,,,LE MAZET HAUT,12380,POUSTHOMY,,,12186,,,,,,,,,,,,,,,,,,,2001-12-31,F,,,,,01.3Z,NAF1993,N,,,0,,,,,,
403977408,00018,40397740800018,O,1980-02-01,NN,,,2012-07-28T14:47:04,true,5,,,,,CARMASSOL,12380,POUSTHOMY,,,12186,,,,,,,,,,,,,,,,,,,2011-12-25,F,,,,,68.20B,NAFRev2,N,,,0,,,,,,
403977416,00011,40397741600011,O,1980-01-01,NN,,,2016-01-12T00:16:47,true,4,,,,,COMBES POUSTHOMY,12380,POUSTHOMY,,,12186,,,,,,,,,,,,,,,,,,,2015-09-30,F,,,,,01.43Z,NAFRev2,N,2.609486,43.856284,0.91,street,Route de Las Combes 12380 Pousthomy,12186_i1b6bz,G,ROUTE DE LAS COMBES,
403977424,00015,40397742400015,O,1981-04-01,NN,,,2011-05-31T06:55:37,true,3,,,,,LAVERGNE,12380,POUSTHOMY,,,12186,,,,,,,,,,,,,,,,,,,2008-01-01,A,,,,,01.11Z,NAFRev2,N,2.610358,43.856843,0.31,street,Route de Lacaune 12380 Pousthomy,12186_sz5bxx,G,ROUTE DE LACAUNE,
403977432,00018,40397743200018,O,1986-09-15,NN,,,2009-06-27T08:01:32,true,3,,,,,LE BOUSQUET,12380,POUSTHOMY,,,12186,,,,,,,,,,,,,,,,,,,2008-01-01,A,,,,,01.45Z,NAFRev2,N,2.609767,43.853282,0.32,street,"Lieu Dit ""le Moulin à Vent"" 12380 Pousthomy",12186_B082,G,LIEU DIT LE MOULIN A VENT ,
403977440,00011,40397744000011,O,1984-02-25,NN,,,2008-01-04T20:32:24,true,3,,,,,LE GOUTY,12380,POUSTHOMY,,,12186,,,,,,,,,,,,,,,,,,,2008-01-01,A,,,,,01.42Z,NAFRev2,N,2.609767,43.853282,0.31,street,"Lieu Dit ""le Moulin à Vent"" 12380 Pousthomy",12186_B082,G,LIEU DIT LE MOULIN A VENT ,
403977457,00015,40397745700015,O,1986-01-01,01,2018,,2021-02-23T11:28:16,true,7,,,,,ESTOURS,12380,POUSTHOMY,,,12186,,,,,,,,,,,,,,,,,,,2020-04-01,A,,,,,68.20B,NAFRev2,N,2.612829,43.858007,0.34,street,Rue de la Tour 12380 Pousthomy,12186_hkzop0,G,RUE DE LA TOUR,
403977457,00031,40397745700031,O,2020-04-01,,,,2021-02-23T11:28:16,false,1,,,,,ESTOURS,12380,POUSTHOMY,,,12186,,,,,,,,,,,,,,,,,,,2020-04-01,A,,,,,35.11Z,NAFRev2,N,2.612829,43.858007,0.34,street,Rue de la Tour 12380 Pousthomy,12186_hkzop0,G,RUE DE LA TOUR,
403977465,00018,40397746500018,O,1990-04-01,NN,,,2008-01-04T20:32:24,true,3,,,,,A ANDEAUX,12380,POUSTHOMY,,,12186,,,,,,,,,,,,,,,,,,,2008-01-01,A,,,,,01.45Z,NAFRev2,N,,,0,,,,,,
407877695,00012,40787769500012,O,1996-05-22,NN,,,2021-06-22T03:36:43,true,3,,,,,,12380,POUSTHOMY,,,12186,,,,,,,,,,,,,,,,,,,2008-01-01,A,,,,,68.20A,NAFRev2,N,,,0,,,,,,
407972488,00016,40797248800016,O,1987-07-29,NN,,,2019-12-04T11:11:27,true,4,,,,,MANQUE DE POUSTHOMY,12380,POUSTHOMY,,,12186,,,,,,,,,,,,,,,,,,,2019-12-31,F,,,,,01.45Z,NAFRev2,N,2.612487,43.858291,0.73,street,Rue de la Mairie 12380 Pousthomy,12186_mfidtr,G,RUE DE LA MAIRIE,
407972496,00019,40797249600019,O,1982-08-20,NN,,,2021-02-23T11:30:09,true,4,,,,,MONTEGUT LE MILIEU,12380,POUSTHOMY,,,12186,,,,,,,,,,,,,,,,,,,2010-02-01,A,,,,,68.20B,NAFRev2,N,,,0,,,,,,
407972504,00010,40797250400010,O,,NN,,,,true,1,,,,,GUINE DE POUSTHOMY,12380,POUSTHOMY,,,12186,,,,,,,,,,,,,,,,,,,1995-12-27,F,,,,,01.3Z,NAF1993,N,2.6115,43.858108,0.77,street,Rue de la Fontaine 12380 Pousthomy,12186_c22ax7,G,RUE DE LA FONTAINE,
407972512,00013,40797251200013,O,,NN,,,,true,1,,,,,MONTAIGUT LE HAUT,12380,POUSTHOMY,,,12186,,,,,,,,,,,,,,,,,,,1997-05-23,F,,,,,01.3Z,NAF1993,N,,,0,,,,,,
407972520,00016,40797252000016,O,1976-01-01,NN,,,,true,1,,,,,,12380,POUSTHOMY,,,12186,,,,,,,,,,,,,,,,,,,2002-04-30,F,,,,,01.3Z,NAF1993,N,,,0,,,,,,
408403475,00010,40840347500010,O,1996-03-01,NN,,,2015-05-14T07:39:18,true,4,,,,,ESTOURS,12380,POUSTHOMY,,,12186,,,,,,,,,,,,,,,,,,,2014-12-15,F,,,,,01.45Z,NAFRev2,N,2.612829,43.858007,0.34,street,Rue de la Tour 12380 Pousthomy,12186_hkzop0,G,RUE DE LA TOUR,
409125762,00016,40912576200016,O,1900-01-01,NN,,,2011-05-03T00:27:36,false,3,,,,,PEYRALES,12380,POUSTHOMY,,,12186,,,,,,,,,,,,,,,,,,,1997-03-29,F,,,,,93.0N,NAF1993,N,2.618169,43.857821,0.92,street,Chemin de Peyralès 12380 Pousthomy,12186_7x2uz1,G,CHEMIN DE PEYRALES,
411602592,00023,41160259200023,O,1999-02-16,,,,2011-05-03T00:29:53,false,3,,,,,,12380,POUSTHOMY,,,12186,,,,,,,,,,,,,,,,,,,1999-12-25,F,,,,,55.3A,NAF1993,N,,,0,,,,,,
413855412,00016,41385541200016,O,1997-05-24,NN,,,2011-05-31T06:55:48,true,3,,,,,MONTEGUT LE HAUT,12380,POUSTHOMY,,,12186,,,,,,,,,,,,,,,,,,,2008-01-01,A,,,,,01.42Z,NAFRev2,N,2.609767,43.853282,0.31,street,"Lieu Dit ""le Moulin à Vent"" 12380 Pousthomy",12186_B082,G,LIEU DIT LE MOULIN A VENT ,
420362659,00013,42036265900013,O,1998-08-10,NN,,,2008-01-04T23:50:47,true,3,,,,,LA FREGERE,12380,POUSTHOMY,,,12186,,,,,,,,,,,,,,,,,,,2008-01-01,A,,,,,68.20B,NAFRev2,N,2.6115,43.858108,0.34,street,Rue de la Fontaine 12380 Pousthomy,12186_c22ax7,G,RUE DE LA FONTAINE,
422873638,00015,42287363800015,O,1993-01-01,NN,,,2011-06-30T09:18:43,true,4,,,,,,12380,POUSTHOMY,,,12186,,,,,,,,,,,,,,,,,,,2011-03-31,F,,,,,02.40Z,NAFRev2,N,,,0,,,,,,
425221397,00010,42522139700010,O,1992-01-01,NN,,,2008-01-05T01:14:07,true,3,,,,,,12380,POUSTHOMY,,,12186,,,,,,,,,,,,,,,,,,,2008-01-01,A,,,,,68.20B,NAFRev2,N,,,0,,,,,,
428921928,00035,42892192800035,O,2019-10-01,,,,2021-02-23T11:48:31,true,1,,,,,RODEZIE,12380,POUSTHOMY,,,12186,,,,,,,,,,,,,,,,,,,2019-10-01,A,,,,,43.99C,NAFRev2,O,,,0,,,,,,
430058115,00014,43005811500014,O,1999-12-10,NN,,,2008-01-05T01:47:40,true,5,,,,,MAIRIE,12380,POUSTHOMY,,,12186,,,,,,,,,,,,,,,,,,,2008-01-01,A,,,,,68.20B,NAFRev2,N,2.612487,43.858291,0.91,street,Rue de la Mairie 12380 Pousthomy,12186_mfidtr,G,RUE DE LA MAIRIE,
431884642,00031,43188464200031,O,2005-03-01,,,,2010-01-29T05:18:02,true,3,,,,,LE BOURG,12380,POUSTHOMY,,,12186,,,,,,,,,,,,,,,,,,,2010-01-30,F,,,,,56.10A,NAFRev2,N,2.609767,43.853282,0.31,street,"Lieu Dit ""le Moulin à Vent"" 12380 Pousthomy",12186_B082,G,LIEU DIT LE MOULIN A VENT ,
432087526,00013,43208752600013,O,2000-05-01,01,2018,,2020-08-25T10:20:04,true,3,NOTRE DAME D'ORIENT,,,,NOTRE DAME D'ORIENT,12380,POUSTHOMY,,,12186,,,,,,,,,,,,,,,,,,,2008-01-01,A,,,,,01.45Z,NAFRev2,N,2.612362,43.859142,0.55,street,Chemin de Notre Dame 12380 Pousthomy,12186_rwhkyl,G,CHEMIN DE NOTRE DAME,
434867701,00014,43486770100014,O,2001-02-01,NN,,,2012-06-13T04:00:36,true,4,,,,,LE MOULIN A VENT,12380,POUSTHOMY,,,12186,,,,,,,,,,,,,,,,,,,2010-12-31,F,,,,,68.20B,NAFRev2,N,2.609767,43.853282,0.92,street,"Lieu Dit ""le Moulin à Vent"" 12380 Pousthomy",12186_B082,G,LIEU DIT LE MOULIN A VENT ,
434966586,00019,43496658600019,O,2001-02-02,NN,,,2010-05-23T05:21:12,true,3,CARMASSOL,,,,CARMASSOL,12380,POUSTHOMY,,,12186,,,,,,,,,,,,,,,,,,,2008-01-01,A,,,,,01.45Z,NAFRev2,N,,,0,,,,,,
435345442,00030,43534544200030,O,2020-07-07,,,,2020-08-04T14:18:29,false,2,,,,,LAVERNHE,12380,POUSTHOMY,,,12186,,,,,,,,,,,,,,,,,,,2020-08-01,F,,,,LE MAC,56.10C,NAFRev2,N,2.9965563,44.2960157,0.89,poi.stream,Ruisseau de Lavernhe Sévérac-d'Aveyron,https://osm.org/way/136025066,G,,
435345442,00048,43534544200048,O,2020-08-01,,,,2020-08-04T14:18:29,true,1,AUBERGE DES ARCADES,,,,,12380,POUSTHOMY,,,12186,,,,,,,,,,,,,,,,,,,2020-08-01,A,,,,,56.10C,NAFRev2,N,,,0,,,,,,
438078909,00019,43807890900019,O,2001-05-18,NN,,,2019-04-26T13:35:15,true,3,,,,RTE,DE LASCOMBES,12380,POUSTHOMY,,,12186,,,,,,,,,,,,,,,,,,,2008-01-01,A,,,,,68.20A,NAFRev2,N,2.609486,43.856284,0.72,street,Route de Las Combes 12380 Pousthomy,12186_i1b6bz,G,ROUTE DE LAS COMBES,
438106197,00017,43810619700017,O,2001-05-07,NN,,,2011-08-09T12:05:14,true,5,,,,,FOURES,12380,POUSTHOMY,,,12186,,,,,,,,,,,,,,,,,,,2011-06-30,F,,,,,01.61Z,NAFRev2,O,7.0210694,43.5525925,0.88,poi.optician,Fourès (Opticien) Cannes,https://osm.org/node/3040166079,G,,
438106197,00025,43810619700025,O,2005-04-30,,,,2011-08-09T12:05:14,false,4,FOURES,,,,,12380,POUSTHOMY,,,12186,,,,,,,,,,,,,,,,,,,2011-06-30,F,,,,,01.61Z,NAFRev2,N,,,0,,,,,,
439795717,00016,43979571700016,O,2001-11-21,NN,,,,true,1,,,,,,12380,POUSTHOMY,,,12186,,,,,,,,,,,,,,,,,,,2002-06-15,F,,,,,55.3A,NAF1993,O,,,0,,,,,,
441344124,00025,44134412400025,O,2020-04-15,,,,2020-06-16T03:41:26,true,1,,50,,AV,LE BOUISSOU,12380,POUSTHOMY,,,12186,,,,,,,,,,,,,,,,,,,2020-04-15,A,,,,SCI DENTALIS,68.20A,NAFRev2,N,2.9948546,43.6829496,0.7,poi.river,Le Bouissou (Rivière) Saint-Geniès-de-Varensal,https://osm.org/way/174462518,G,,
442710075,00015,44271007500015,O,2002-07-02,NN,,,,true,1,,,,,,12380,POUSTHOMY,,,12186,,,,,,,,,,,,,,,,,,,2002-10-31,F,,,,,55.3A,NAF1993,N,,,0,,,,,,
442901781,00017,44290178100017,O,1966-02-18,NN,,,2017-08-30T03:57:02,true,3,,,,RUE,PRINCIPALE,12380,POUSTHOMY,,,12186,,,,,,,,,,,,,,,,,,,2008-01-01,A,,,,,02.10Z,NAFRev2,N,2.612962,43.858366,0.33,street,Rue du Pourtalet 12380 Pousthomy,12186_dhylqe,G,RUE DU POURTALET,
443599964,00014,44359996400014,O,1972-11-26,NN,,,2012-06-06T05:22:11,false,4,LE BOUISSOU,,,,,12380,POUSTHOMY,,,12186,,,,,,,,,,,,,,,,,,,2012-05-09,F,,,,,02.10Z,NAFRev2,N,,,0,,,,,,
443888425,00016,44388842500016,O,1968-01-15,NN,,,2010-01-07T04:37:16,false,3,,,,,MAIRIE,12380,POUSTHOMY,,,12186,,,,,,,,,,,,,,,,,,,2008-01-01,A,,,,,02.10Z,NAFRev2,N,2.612487,43.858291,0.91,street,Rue de la Mairie 12380 Pousthomy,12186_mfidtr,G,RUE DE LA MAIRIE,
443888698,00018,44388869800018,O,1969-07-24,NN,,,2010-01-07T04:37:15,false,3,,,,,MAIRIE,12380,POUSTHOMY,,,12186,,,,,,,,,,,,,,,,,,,2008-01-01,A,,,,,02.10Z,NAFRev2,N,2.612487,43.858291,0.91,street,Rue de la Mairie 12380 Pousthomy,12186_mfidtr,G,RUE DE LA MAIRIE,
444079446,00019,44407944600019,O,2002-11-22,NN,,,2008-04-25T00:33:05,false,3,,,,,,12380,POUSTHOMY,,,12186,,,,,,,,,,,,,,,,,,,2003-12-31,F,,,,,55.3A,NAFRev1,N,,,0,,,,,,
447483157,00015,44748315700015,O,2003-02-24,NN,,,2006-11-25T18:21:19,false,3,,,,,ROQUETHYN,12380,POUSTHOMY,,,12186,,,,,,,,,,,,,,,,,,,2004-11-01,F,,,,,92.3A,NAFRev1,N,,,0,,,,,,
449167212,00017,44916721200017,O,2003-07-01,NN,,,2006-11-25T18:34:33,true,3,,,,PL,DU FOIRAIL,12380,POUSTHOMY,,,12186,,,,,,,,,,,,,,,,,,,2005-06-01,F,,,,,92.6C,NAFRev1,N,2.61421,43.858187,0.8,street,Place du Foirail 12380 Pousthomy,12186_pfxyd9,G,PLACE DU FOIRAIL,
449801752,00014,44980175200014,O,2003-08-28,NN,,,2016-08-09T04:17:47,true,4,,,,,LE BOURG,12380,POUSTHOMY,,,12186,,,,,,,,,,,,,,,,,,,2016-07-05,F,,,,,49.39A,NAFRev2,N,2.609767,43.853282,0.31,street,"Lieu Dit ""le Moulin à Vent"" 12380 Pousthomy",12186_B082,G,LIEU DIT LE MOULIN A VENT ,
451422398,00011,45142239800011,O,2004-01-05,NN,,,2006-11-01T00:16:32,false,2,,,,,LA JASSE DE BORDEAUX,12380,POUSTHOMY,,,12186,,,,,,,,,,,,,,,,,,,2004-12-25,F,,,,,01.4A,NAFRev1,N,-0.564271,44.9127368,0.77,poi.stream,La Jalle de Blanquefort (Ruisseau) Bordeaux,https://osm.org/way/76483231,G,,
451422398,00029,45142239800029,O,2004-01-01,NN,,,2021-02-23T13:34:46,true,5,,,,,LA JASSE DE BORDEAUX,12380,POUSTHOMY,,,12186,,,,,,,,,,,,,,,,,,,2008-01-01,A,,,,,68.20B,NAFRev2,N,-0.564271,44.9127368,0.77,poi.stream,La Jalle de Blanquefort (Ruisseau) Bordeaux,https://osm.org/way/76483231,G,,
451571129,00019,45157112900019,O,2004-01-05,NN,,,2018-09-29T12:09:13,true,3,,,,,LA JASSE DE BORDEAUX,12380,POUSTHOMY,,,12186,,,,,,,,,,,,,,,,,,,2008-01-01,A,,,,,01.61Z,NAFRev2,N,-0.564271,44.9127368,0.77,poi.stream,La Jalle de Blanquefort (Ruisseau) Bordeaux,https://osm.org/way/76483231,G,,
452942410,00013,45294241000013,O,2004-05-01,NN,,,2006-11-25T19:08:07,true,3,,,,,,12380,POUSTHOMY,,,12186,,,,,,,,,,,,,,,,,,,2004-12-25,F,,,,,55.3A,NAFRev1,N,,,0,,,,,,
484818026,00011,48481802600011,O,2005-09-01,,,,2015-05-10T05:11:58,true,2,,,,,LA JASSE DE BORDEAUX,12380,POUSTHOMY,,,12186,,,,,,,,,,,,,,,,,,,2008-01-01,A,,,,,01.45Z,NAFRev2,N,-0.564271,44.9127368,0.77,poi.stream,La Jalle de Blanquefort (Ruisseau) Bordeaux,https://osm.org/way/76483231,G,,
490886488,00041,49088648800041,O,2015-05-01,NN,,,2018-09-29T12:37:32,true,4,,,,,,12380,POUSTHOMY,,,12186,,,,,,,,,,,,,,,,,,,2017-09-30,F,AUBERGE DES ARCADES,,,AUBERGE DES ARCADES,56.10A,NAFRev2,N,,,0,,,,,,
491028106,00038,49102810600038,O,2016-06-01,,,,2019-02-05T04:26:43,true,4,,,,,ROQUE DE GORP,12380,POUSTHOMY,,,12186,,,,,,,,,,,,,,,,,,,2019-01-22,F,,,,,85.51Z,NAFRev2,N,,,0,,,,,,
491649349,00017,49164934900017,O,2006-08-31,,,,2019-02-19T04:29:23,true,4,ORIENT,,,,NOTRE DAME D'ORIENT,12380,POUSTHOMY,,,12186,,,,,,,,,,,,,,,,,,,2019-02-01,A,,,,,85.52Z,NAFRev2,N,2.612362,43.859142,0.55,street,Chemin de Notre Dame 12380 Pousthomy,12186_rwhkyl,G,CHEMIN DE NOTRE DAME,
497588442,00010,49758844200010,O,2007-04-27,,,,2011-02-23T09:28:57,false,3,,,,,LE BOURG,12380,POUSTHOMY,,,12186,,,,,,,,,,,,,,,,,,,2008-01-01,F,SEPT VALLONS,,,,47.81Z,NAFRev2,N,2.609767,43.853282,0.31,street,"Lieu Dit ""le Moulin à Vent"" 12380 Pousthomy",12186_B082,G,LIEU DIT LE MOULIN A VENT ,
499529766,00010,49952976600010,O,2007-06-15,,,,2008-01-05T01:21:22,true,2,,,,,CHEZ M ET MME ALBERT CANTALOUBRE,12380,POUSTHOMY,,,12186,,,,,,,,,,,,,,,,,,,2008-01-01,A,,,,,68.20B,NAFRev2,N,,,0,,,,,,
503275141,00011,50327514100011,O,2008-04-01,,,,2014-07-10T01:14:59,true,2,,,,PL,DU FOIRAIL,12380,POUSTHOMY,,,12186,,,,,,,,,,,,,,,,,,,2008-09-30,F,,,,,45.40Z,NAFRev2,N,2.61421,43.858187,0.8,street,Place du Foirail 12380 Pousthomy,12186_pfxyd9,G,PLACE DU FOIRAIL,
504392184,00017,50439218400017,O,2008-06-02,,,4331ZB,2015-03-18T00:17:00,true,1,,,,,LE GOUTY,12380,POUSTHOMY,,,12186,,,,,,,,,,,,,,,,,,,2008-06-02,A,,,,,43.31Z,NAFRev2,N,2.609767,43.853282,0.31,street,"Lieu Dit ""le Moulin à Vent"" 12380 Pousthomy",12186_B082,G,LIEU DIT LE MOULIN A VENT ,
509791679,00012,50979167900012,O,2009-01-12,,,,2012-11-10T00:25:11,true,2,,,,,VENES,12380,POUSTHOMY,,,12186,,,,,,,,,,,,,,,,,,,2010-05-11,F,,,,,90.03A,NAFRev2,N,2.609767,43.853282,0.43,street,"Lieu Dit ""le Moulin à Vent"" 12380 Pousthomy",12186_B082,G,LIEU DIT LE MOULIN A VENT ,
510787872,00017,51078787200017,O,2009-02-24,,,,2012-06-12T04:54:10,true,2,ROCHQUETYN,,,,,12380,POUSTHOMY,,,12186,,,,,,,,,,,,,,,,,,,2009-02-25,F,,,,,01.45Z,NAFRev2,N,,,0,,,,,,
511950248,00027,51195024800027,O,2013-07-26,,,,2021-02-23T15:20:52,true,1,,,,,ROQUETAYN,12380,POUSTHOMY,,,12186,,,,,,,,,,,,,,,,,,,2013-07-26,A,,,,,47.89Z,NAFRev2,N,,,0,,,,,,
517550018,00017,51755001800017,O,2009-11-01,,,,2012-11-10T01:23:13,true,1,,,,,PEYRALES,12380,POUSTHOMY,,,12186,,,,,,,,,,,,,,,,,,,2009-11-01,A,,,,,96.09Z,NAFRev2,N,2.618169,43.857821,0.92,street,Chemin de Peyralès 12380 Pousthomy,12186_7x2uz1,G,CHEMIN DE PEYRALES,
522116060,00016,52211606000016,O,2010-02-01,,,,2019-06-07T04:17:38,true,1,,,,,MONTAIGUT,12380,POUSTHOMY,,,12186,,,,,,,,,,,,,,,,,,,2010-02-01,A,,,,,01.42Z,NAFRev2,N,2.6115,43.858108,0.38,street,Rue de la Fontaine 12380 Pousthomy,12186_c22ax7,G,RUE DE LA FONTAINE,
522621580,00011,52262158000011,O,2010-04-15,,,,2010-05-21T14:19:26,true,1,,,,,NOTRE DAME,12380,POUSTHOMY,,,12186,,,,,,,,,,,,,,,,,,,2010-04-15,A,,,,,68.20B,NAFRev2,N,2.612362,43.859142,0.92,street,Chemin de Notre Dame 12380 Pousthomy,12186_rwhkyl,G,CHEMIN DE NOTRE DAME,
527728265,00010,52772826500010,O,2010-10-08,,,,2010-10-20T08:11:35,true,1,,0,,,,12380,POUSTHOMY,,,12186,,,,,,,,,,,,,,,,,,,2010-10-08,A,,,,,68.20B,NAFRev2,N,,,0,,,,,,
528450679,00055,52845067900055,O,2015-11-01,,,,2017-01-05T09:21:59,false,2,,,,,LE BOURG,12380,POUSTHOMY,,,12186,,,,,,,,,,,,,,,,,,,2016-10-01,F,,,,,62.01Z,NAFRev2,N,2.609767,43.853282,0.31,street,"Lieu Dit ""le Moulin à Vent"" 12380 Pousthomy",12186_B082,G,LIEU DIT LE MOULIN A VENT ,
529562118,00016,52956211800016,O,2003-01-01,,,,2011-01-13T04:18:53,true,1,,,,,MATAVALES,12380,POUSTHOMY,,,12186,,,,,,,,,,,,,,,,,,,2003-01-01,A,,,,,01.49Z,NAFRev2,N,,,0,,,,,,