siren,nic,siret,statutDiffusionEtablissement,dateCreationEtablissement,trancheEffectifsEtablissement,anneeEffectifsEtablissement,activitePrincipaleRegistreMetiersEtablissement,dateDernierTraitementEtablissement,etablissementSiege,nombrePeriodesEtablissement,complementAdresseEtablissement,numeroVoieEtablissement,indiceRepetitionEtablissement,typeVoieEtablissement,libelleVoieEtablissement,codePostalEtablissement,libelleCommuneEtablissement,libelleCommuneEtrangerEtablissement,distributionSpecialeEtablissement,codeCommuneEtablissement,codeCedexEtablissement,libelleCedexEtablissement,codePaysEtrangerEtablissement,libellePaysEtrangerEtablissement,complementAdresse2Etablissement,numeroVoie2Etablissement,indiceRepetition2Etablissement,typeVoie2Etablissement,libelleVoie2Etablissement,codePostal2Etablissement,libelleCommune2Etablissement,libelleCommuneEtranger2Etablissement,distributionSpeciale2Etablissement,codeCommune2Etablissement,codeCedex2Etablissement,libelleCedex2Etablissement,codePaysEtranger2Etablissement,libellePaysEtranger2Etablissement,dateDebut,etatAdministratifEtablissement,enseigne1Etablissement,enseigne2Etablissement,enseigne3Etablissement,denominationUsuelleEtablissement,activitePrincipaleEtablissement,nomenclatureActivitePrincipaleEtablissement,caractereEmployeurEtablissement,longitude,latitude,geo_score,geo_type,geo_adresse,geo_id,geo_ligne,geo_l4,geo_l5
211600168,00010,21160016800010,O,1983-03-01,03,2018,,2020-08-25T10:15:57,true,4,,,,,LE BOURG,16500,ANSAC-SUR-VIENNE,,,16016,,,,,,,,,,,,,,,,,,,2008-01-01,A,MAIRIE,,,,84.11Z,NAFRev2,O,0.614465,45.974305,0.72,street,Le Bouradou 16500 Ansac-sur-Vienne,16016_s1xmxw,G,LE BOURADOU,
211600168,00028,21160016800028,O,1983-12-21,00,2018,,2020-08-25T10:15:57,false,4,,,,,LE BOURG,16500,ANSAC-SUR-VIENNE,,,16016,,,,,,,,,,,,,,,,,,,2008-01-01,A,ECOLE ELEMENTAIRE RATIER LACOUTURE,,,,85.20Z,NAFRev2,N,0.614465,45.974305,0.72,street,Le Bouradou 16500 Ansac-sur-Vienne,16016_s1xmxw,G,LE BOURADOU,
211600168,00036,21160016800036,O,1995-01-01,NN,,,2019-11-14T14:00:20,false,3,MAIRIE,,,,LE BOURG,16500,ANSAC-SUR-VIENNE,,,16016,,,,,,,,,,,,,,,,,,,2008-01-01,A,SERVICE ASSAINISSEMENT,,,,37.00Z,NAFRev2,N,0.614465,45.974305,0.72,street,Le Bouradou 16500 Ansac-sur-Vienne,16016_s1xmxw,G,LE BOURADOU,
211600168,00044,21160016800044,O,2002-09-01,01,2018,,2020-08-25T10:15:57,false,3,,,,,LE BOURG,16500,ANSAC-SUR-VIENNE,,,16016,,,,,,,,,,,,,,,,,,,2008-01-01,A,ECOLE MATERNELLE PUBLIQUE,,,,85.10Z,NAFRev2,N,0.614465,45.974305,0.72,street,Le Bouradou 16500 Ansac-sur-Vienne,16016_s1xmxw,G,LE BOURADOU,
211600168,00051,21160016800051,O,2003-01-01,NN,,,2019-11-14T14:00:20,false,4,MAIRIE,,,,LE BOURG,16500,ANSAC-SUR-VIENNE,,,16016,,,,,,,,,,,,,,,,,,,2012-12-25,F,LOTISSEMENT BELLEVUE,,,,42.99Z,NAFRev2,N,0.614465,45.974305,0.72,street,Le Bouradou 16500 Ansac-sur-Vienne,16016_s1xmxw,G,LE BOURADOU,
211600168,00077,21160016800077,O,2018-07-01,,,,2021-02-23T10:31:23,false,1,,,,,LE BOURG,16500,ANSAC-SUR-VIENNE,,,16016,,,,,,,,,,,,,,,,,,,2018-07-01,A,TRANSPORT SCOLAIRE,,,,49.39A,NAFRev2,N,0.614465,45.974305,0.72,street,Le Bouradou 16500 Ansac-sur-Vienne,16016_s1xmxw,G,LE BOURADOU,
261601967,00019,26160196700019,O,1995-01-01,NN,,,2019-11-14T14:00:20,true,3,MAIRIE,,,,,16500,ANSAC-SUR-VIENNE,,,16016,,,,,,,,,,,,,,,,,,,2001-12-25,F,CDE,,,,85.3K,NAF1993,N,0.646158,45.993582,0.91,street,Place de la Mairie 16500 Ansac-sur-Vienne,16016_0095,D,PLACE DE LA MAIRIE,
261602130,00013,26160213000013,O,1986-01-06,NN,,,2019-11-14T14:00:20,true,3,MAIRIE,,,,,16500,ANSAC-SUR-VIENNE,,,16016,,,,,,,,,,,,,,,,,,,2008-01-01,A,CCAS,,,,88.99B,NAFRev2,N,0.646158,45.993582,0.91,street,Place de la Mairie 16500 Ansac-sur-Vienne,16016_0095,D,PLACE DE LA MAIRIE,
300800968,00012,30080096800012,O,,,,,2019-11-14T14:00:20,true,1,,,,,,16500,ANSAC-SUR-VIENNE,,,16016,,,,,,,,,,,,,,,,,,,1988-04-30,F,,,,,65.03,NAP,N,,,0,,,,,,
303997548,00043,30399754800043,O,1985-07-01,NN,,,2019-11-14T14:00:20,true,5,,,,,LIEU DIT LA TULETTE,16500,ANSAC-SUR-VIENNE,,,16016,,,,,,,,,,,,,,,,,,,2011-01-20,F,,,,,47.59A,NAFRev2,O,0.647398,46.002855,0.36,street,Route de la Parlie 16500 Ansac-sur-Vienne,16016_0130,G,ROUTE DE LA PARLIE,
304505373,00015,30450537300015,O,,NN,,,2019-11-14T14:00:20,true,1,,,,LD,BOIS LACAUD,16500,ANSAC-SUR-VIENNE,,,16016,,,,,,,,,,,,,,,,,,,1989-02-15,F,,,,,01.00,NAP,N,0.59707,45.980511,0.85,street,Le Bois de Lacaud 16500 Ansac-sur-Vienne,16016_B021,G,LE BOIS DE LACAUD,
306099649,00015,30609964900015,O,,NN,,,2019-11-14T14:00:20,true,1,,,,,,16500,ANSAC-SUR-VIENNE,,,16016,,,,,,,,,,,,,,,,,,,1988-12-08,F,,,,,67.04,NAP,N,,,0,,,,,,
306195413,00043,30619541300043,O,1993-09-01,NN,,,2019-11-14T14:00:20,true,4,,,,RTE,DE MANOT,16500,ANSAC-SUR-VIENNE,,,16016,,,,,,,,,,,,,,,,,,,2010-12-25,F,,,,,02.20Z,NAFRev2,N,0.645875,45.987833,0.81,street,Route de Manot 16500 Ansac-sur-Vienne,16016_0097,G,ROUTE DE MANOT,
311464168,00039,31146416800039,O,,NN,,,2019-11-14T14:00:20,true,1,,,,,LES TROUILLAUDS,16500,ANSAC-SUR-VIENNE,,,16016,,,,,,,,,,,,,,,,,,,1995-09-30,F,,,,,45.3E,NAF1993,N,0.594777,45.992851,0.37,street,Les Grands Termes 16500 Ansac-sur-Vienne,16016_B136,G,LES GRANDS TERMES,
312873763,00030,31287376300030,O,1992-01-01,,,,2019-11-14T14:00:20,true,4,,,,RTE,ANGOULEME,16500,ANSAC-SUR-VIENNE,,,16016,,,,,,,,,,,,,,,,,,,2003-12-31,F,,,,,60.2M,NAFRev1,N,0.643104,45.993198,0.8,street,Route d’Angouleme 16500 Ansac-sur-Vienne,16016_0010,G,ROUTE D ANGOULEME,
312917255,00019,31291725500019,O,,,,,2019-11-14T14:00:20,true,1,,,,,,16500,ANSAC-SUR-VIENNE,,,16016,,,,,,,,,,,,,,,,,,,1984-12-25,F,,,,,00.10,NAP,N,,,0,,,,,,
314890971,00018,31489097100018,O,,,,,2019-11-14T14:00:20,true,1,,,,,,16500,ANSAC-SUR-VIENNE,,,16016,,,,,,,,,,,,,,,,,,,1988-11-01,F,,,,,02.0B,NAF1993,N,,,0,,,,,,
315725804,00043,31572580400043,O,1996-07-01,NN,,,2019-11-14T14:00:20,false,3,,,,,LE BOURG,16500,ANSAC-SUR-VIENNE,,,16016,,,,,,,,,,,,,,,,,,,2004-08-02,F,LA FERME DU LIMOUSIN,,,,52.2C,NAFRev1,O,0.614465,45.974305,0.72,street,Le Bouradou 16500 Ansac-sur-Vienne,16016_s1xmxw,G,LE BOURADOU,
316160670,00022,31616067000022,O,1982-07-01,NN,,,2019-11-14T14:00:20,true,1,,,,,LE BOURG,16500,ANSAC-SUR-VIENNE,,,16016,,,,,,,,,,,,,,,,,,,2001-10-03,F,,,,,80.4A,NAF1993,N,0.614465,45.974305,0.72,street,Le Bouradou 16500 Ansac-sur-Vienne,16016_s1xmxw,G,LE BOURADOU,
316396589,00012,31639658900012,O,1979-01-01,NN,,,2019-11-14T14:00:20,true,4,,,,,CHEZ GANET,16500,ANSAC-SUR-VIENNE,,,16016,,,,,,,,,,,,,,,,,,,1998-12-31,F,,,,,01.4A,NAF1993,N,0.634099,46.006933,0.94,street,Chez Ganet 16500 Ansac-sur-Vienne,16016_B076,G,CHEZ GANET,
316396597,00015,31639659700015,O,,,,,2019-11-14T14:00:20,true,1,,,,,CHEBERTIE,16500,ANSAC-SUR-VIENNE,,,16016,,,,,,,,,,,,,,,,,,,1984-12-25,F,,,,,02.20,NAP,N,0.627453,45.986296,0.93,street,La Chebertie 16500 Ansac-sur-Vienne,16016_fk8kn7,G,LA CHEBERTIE,
316648047,00033,31664804700033,O,2014-08-01,,,,2019-11-14T14:00:20,false,4,,35,,RTE,DE CONFOLENS,16500,ANSAC-SUR-VIENNE,,,16016,,,,,,,,,,,,,,,,,,,2019-08-04,F,,,,,47.82Z,NAFRev2,N,0.649151,45.996052,0.86,housenumber,35 Route de Confolens 16500 Ansac-sur-Vienne,16016_0060_00035,G,35 ROUTE DE CONFOLENS,
316648047,00041,31664804700041,O,2019-08-04,,,,2021-02-23T10:41:56,true,1,,18,,RTE,D'ANGOULEME,16500,ANSAC-SUR-VIENNE,,,16016,,,,,,,,,,,,,,,,,,,2019-08-04,A,,,,,47.82Z,NAFRev2,N,0.644656,45.993646,0.86,housenumber,18 Route d’Angouleme 16500 Ansac-sur-Vienne,16016_0010_00018,G,18 ROUTE D ANGOULEME,
318886546,00023,31888654600023,O,1983-02-11,NN,,,2019-11-14T14:00:20,true,1,,,,RTE,DE MANOT,16500,ANSAC-SUR-VIENNE,,,16016,,,,,,,,,,,,,,,,,,,1999-12-31,F,,,,,74.1J,NAF1993,N,0.645875,45.987833,0.81,street,Route de Manot 16500 Ansac-sur-Vienne,16016_0097,G,ROUTE DE MANOT,
319380895,00015,31938089500015,O,1980-05-01,11,2018,,2020-08-25T10:28:13,true,4,,,,,LE CERISIER DE LA BARRE,16500,ANSAC-SUR-VIENNE,,,16016,,,,,,,,,,,,,,,,,,,2008-01-01,A,,,,,45.11Z,NAFRev2,O,0.615575,45.989154,0.94,street,Le Cerisier de la Barre 16500 Ansac-sur-Vienne,16016_B057,G,LE CERISIER DE LA BARRE,
321937310,00084,32193731000084,O,2019-07-01,,,,2021-02-23T10:45:37,true,1,,21,,RTE,DE CONFOLENS,16500,ANSAC-SUR-VIENNE,,,16016,,,,,,,,,,,,,,,,,,,2019-07-01,A,,,,,90.03A,NAFRev2,N,0.648206,45.994909,0.86,housenumber,21 Route de Confolens 16500 Ansac-sur-Vienne,16016_0060_00021,G,21 ROUTE DE CONFOLENS,
322959362,00011,32295936200011,O,,NN,,,2019-11-14T14:00:20,true,1,,,,,BOIS DE LACAUD,16500,ANSAC-SUR-VIENNE,,,16016,,,,,,,,,,,,,,,,,,,1989-11-29,F,,,,,01.00,NAP,N,0.59707,45.980511,0.93,street,Le Bois de Lacaud 16500 Ansac-sur-Vienne,16016_B021,G,LE BOIS DE LACAUD,
326576774,00011,32657677400011,O,1982-04-12,NN,,,2019-11-14T14:00:20,true,3,,,,,MAIRIE,16500,ANSAC-SUR-VIENNE,,,16016,,,,,,,,,,,,,,,,,,,2008-01-01,A,,,,,02.10Z,NAFRev2,N,0.646158,45.993582,0.91,street,Place de la Mairie 16500 Ansac-sur-Vienne,16016_0095,G,PLACE DE LA MAIRIE,
326769536,00011,32676953600011,O,,NN,,,2019-11-14T14:00:20,true,1,,,,,LA GELANDRIE,16500,ANSAC-SUR-VIENNE,,,16016,,,,,,,,,,,,,,,,,,,1994-12-31,F,,,,,01.1A,NAF1993,N,0.625686,46.015612,0.94,street,La Gelandrie 16500 Ansac-sur-Vienne,16016_mx9st4,G,LA GELANDRIE,
326775814,00014,32677581400014,O,1983-01-01,NN,,,2019-11-14T14:00:20,true,5,,,,,,16500,ANSAC-SUR-VIENNE,,,16016,,,,,,,,,,,,,,,,,,,2008-01-01,A,,,,,96.09Z,NAFRev2,O,,,0,,,,,,
326775814,00022,32677581400022,O,1990-12-31,NN,,,2019-11-14T14:00:20,false,3,,,,,AU BOURG DE,16500,ANSAC-SUR-VIENNE,,,16016,,,,,,,,,,,,,,,,,,,2008-01-01,A,,,,,01.43Z,NAFRev2,N,0.614465,45.974305,0.33,street,Le Bouradou 16500 Ansac-sur-Vienne,16016_s1xmxw,G,LE BOURADOU,
329554885,00015,32955488500015,O,1984-01-01,NN,,,2019-11-14T14:00:20,true,4,,,,LD,LA PARLIE,16500,ANSAC-SUR-VIENNE,,,16016,,,,,,,,,,,,,,,,,,,2012-12-31,A,,,,,02.40Z,NAFRev2,O,0.647398,46.002855,0.93,street,Route de la Parlie 16500 Ansac-sur-Vienne,16016_0130,G,ROUTE DE LA PARLIE,
329738140,00014,32973814000014,O,,NN,,,2019-11-14T14:00:20,true,1,,,,PL,DE LA MAIRIE,16500,ANSAC-SUR-VIENNE,,,16016,,,,,,,,,,,,,,,,,,,1988-09-20,F,,,,,67.01,NAP,N,0.646158,45.993582,0.83,street,Place de la Mairie 16500 Ansac-sur-Vienne,16016_0095,G,PLACE DE LA MAIRIE,
330775107,00015,33077510700015,O,1984-10-02,01,2018,9602AA,2020-08-25T10:34:35,true,9,,,,,BOURG,16500,ANSAC-SUR-VIENNE,,,16016,,,,,,,,,,,,,,,,,,,2018-12-31,A,,,,,96.02A,NAFRev2,N,0.614465,45.974305,0.59,street,Le Bouradou 16500 Ansac-sur-Vienne,16016_s1xmxw,G,LE BOURADOU,
331709030,00018,33170903000018,O,,,,,2019-11-14T14:00:20,true,1,,,,,,16500,ANSAC-SUR-VIENNE,,,16016,,,,,,,,,,,,,,,,,,,1997-10-31,F,,,,,45.3A,NAF1993,N,,,0,,,,,,
332253723,00016,33225372300016,O,1985-04-01,NN,,,2019-11-14T14:00:20,false,3,,,,LD,MONTVALLIER,16500,ANSAC-SUR-VIENNE,,,16016,,,,,,,,,,,,,,,,,,,1994-07-05,F,,,,,01.1A,NAF1993,N,0.62245,45.972416,0.72,street,Monvallier 16500 Ansac-sur-Vienne,16016_10qnlt,G,MONVALLIER,
332358662,00010,33235866200010,O,,,,,2019-11-14T14:00:20,true,1,,,,,,16500,ANSAC-SUR-VIENNE,,,16016,,,,,,,,,,,,,,,,,,,,F,,,,,62.11,NAP,N,,,0,,,,,,
337775654,00011,33777565400011,O,1986-04-01,NN,,1071CB,2019-11-14T14:00:20,true,5,,,,,LE BOURG,16500,ANSAC-SUR-VIENNE,,,16016,,,,,,,,,,,,,,,,,,,2017-02-14,F,,,,,10.71C,NAFRev2,O,0.614465,45.974305,0.72,street,Le Bouradou 16500 Ansac-sur-Vienne,16016_s1xmxw,G,LE BOURADOU,
338160492,00017,33816049200017,O,1986-07-01,02,2018,,2020-11-24T14:54:37,true,5,,,,,BOURG,16500,ANSAC-SUR-VIENNE,,,16016,,,,,,,,,,,,,,,,,,,2020-07-01,F,,,,,47.73Z,NAFRev2,N,0.614465,45.974305,0.59,street,Le Bouradou 16500 Ansac-sur-Vienne,16016_s1xmxw,G,LE BOURADOU,
338660855,00010,33866085500010,O,,,,,2019-11-14T14:00:20,true,1,,,,LD,LES TROUILLAUDS,16500,ANSAC-SUR-VIENNE,,,16016,,,,,,,,,,,,,,,,,,,1990-12-31,F,,,,,55.71,NAP,N,0.594777,45.992851,0.37,street,Les Grands Termes 16500 Ansac-sur-Vienne,16016_B136,G,LES GRANDS TERMES,
339982803,00027,33998280300027,O,2005-01-15,NN,,,2019-11-14T14:00:20,false,2,,1,,RTE,D ANGOULEME,16500,ANSAC-SUR-VIENNE,,,16016,,,,,,,,,,,,,,,,,,,2006-10-01,F,,,,,51.8P,NAFRev1,O,0.645855,45.993768,0.85,housenumber,1 Route d’Angouleme 16500 Ansac-sur-Vienne,16016_0010_00001,G,1 ROUTE D ANGOULEME,
340104397,00013,34010439700013,O,1987-01-01,NN,,,2019-11-14T14:00:20,false,4,,,,LD,LE CHENE,16500,ANSAC-SUR-VIENNE,,,16016,,,,,,,,,,,,,,,,,,,2001-12-31,F,,,,,01.2A,NAF1993,N,0.613666,46.030186,0.94,street,Le Chene 16500 Ansac-sur-Vienne,16016_3vpzst,G,LE CHENE,
341375525,00019,34137552500019,O,1987-05-01,03,2018,,2020-08-25T10:39:55,true,4,,,,RTE,DE MANOT,16500,ANSAC-SUR-VIENNE,,,16016,,,,,,,,,,,,,,,,,,,2008-01-01,A,,,,,49.41A,NAFRev2,O,0.645875,45.987833,0.81,street,Route de Manot 16500 Ansac-sur-Vienne,16016_0097,G,ROUTE DE MANOT,
341790731,00010,34179073100010,O,1987-07-01,02,2018,,2021-02-23T10:57:27,true,3,,,,,FERME DU PAUPIQUET,16500,ANSAC-SUR-VIENNE,,,16016,,,,,,,,,,,,,,,,,,,2008-01-01,A,,,,,01.41Z,NAFRev2,N,0.593921,45.973624,0.94,street,Ferme du Paupiquet 16500 Ansac-sur-Vienne,16016_A090,G,FERME DU PAUPIQUET,
341956431,00025,34195643100025,O,1998-07-15,NN,,,2019-11-14T14:00:20,true,4,,,,,,16500,ANSAC-SUR-VIENNE,,,16016,,,,,,,,,,,,,,,,,,,2012-08-03,F,,,,,46.34Z,NAFRev2,N,,,0,,,,,,
342125671,00012,34212567100012,O,,NN,,,2019-11-14T14:00:20,true,1,,,,,,16500,ANSAC-SUR-VIENNE,,,16016,,,,,,,,,,,,,,,,,,,1994-12-28,F,,,,,55.4A,NAF1993,N,,,0,,,,,,
342433463,00011,34243346300011,O,1987-07-31,NN,,,2019-11-14T14:00:20,false,4,,,,LD,LA TULETTE,16500,ANSAC-SUR-VIENNE,,,16016,,,,,,,,,,,,,,,,,,,1994-12-25,F,,,,,51.1C,NAF1993,O,0.647398,46.002855,0.36,street,Route de la Parlie 16500 Ansac-sur-Vienne,16016_0130,G,ROUTE DE LA PARLIE,
343517744,00011,34351774400011,O,1988-01-01,NN,,,2019-11-14T14:00:20,true,5,,,,LD,LE COULOUROUSSEAU,16500,ANSAC-SUR-VIENNE,,,16016,,,,,,,,,,,,,,,,,,,2009-01-01,A,,,,,01.11Z,NAFRev2,N,0.654602,46.006694,0.78,street,Ferme du Coulourousseau 16500 Ansac-sur-Vienne,16016_A050,G,FERME DU COULOUROUSSEAU,
345020176,00011,34502017600011,O,1988-05-01,NN,,,2019-11-14T14:00:20,true,4,LE BOURG,,,RTE,D ANGOULEME,16500,ANSAC-SUR-VIENNE,,,16016,,,,,,,,,,,,,,,,,,,1997-02-27,F,,,,,50.1Z,NAF1993,O,0.643104,45.993198,0.84,street,Route d’Angouleme 16500 Ansac-sur-Vienne,16016_0010,G,ROUTE D ANGOULEME,
345393854,00012,34539385400012,O,1988-07-27,NN,,,2019-11-14T14:00:20,true,3,,,,LD,LA FAYE,16500,ANSAC-SUR-VIENNE,,,16016,,,,,,,,,,,,,,,,,,,2008-01-01,A,,,,,68.20B,NAFRev2,N,0.609255,46.007143,0.94,street,La Faye 16500 Ansac-sur-Vienne,16016_pm6kee,G,LA FAYE,
348232935,00018,34823293500018,O,1988-10-01,NN,,,2019-11-14T14:00:20,true,3,,,,,LE MASLINARD,16500,ANSAC-SUR-VIENNE,,,16016,,,,,,,,,,,,,,,,,,,2008-01-01,A,,,,,01.41Z,NAFRev2,N,0.63898,46.004334,0.94,street,Le Maslinard 16500 Ansac-sur-Vienne,16016_w7b4bx,G,LE MASLINARD,
348688839,00011,34868883900011,O,,NN,,,2019-11-14T14:00:20,true,1,,,,,LA FAYE,16500,ANSAC-SUR-VIENNE,,,16016,,,,,,,,,,,,,,,,,,,1990-06-30,F,,,,,01.1A,NAF1993,N,0.609255,46.007143,0.94,street,La Faye 16500 Ansac-sur-Vienne,16016_pm6kee,G,LA FAYE,
348920877,00019,34892087700019,O,1989-01-01,NN,,,2019-11-14T14:00:20,true,3,,,,,MONVALLIER,16500,ANSAC-SUR-VIENNE,,,16016,,,,,,,,,,,,,,,,,,,2008-01-01,A,,,,,01.42Z,NAFRev2,N,0.62245,45.972416,0.94,street,Monvallier 16500 Ansac-sur-Vienne,16016_10qnlt,G,MONVALLIER,
349823591,00038,34982359100038,O,1997-07-01,NN,,,2019-11-14T14:00:20,false,5,,,,LD,LE MANSLE,16500,ANSAC-SUR-VIENNE,,,16016,,,,,,,,,,,,,,,,,,,2008-02-11,F,,,,,69.20Z,NAFRev2,O,0.638836,45.99694,0.95,street,Le Mansle 16500 Ansac-sur-Vienne,16016_173hqe,G,LE MANSLE,
351649413,00017,35164941300017,O,,NN,,,2019-11-14T14:00:20,true,1,,,,PL,DE LA MAIRIE,16500,ANSAC-SUR-VIENNE,,,16016,,,,,,,,,,,,,,,,,,,1991-08-03,F,,,,,67.04,NAP,N,0.646158,45.993582,0.83,street,Place de la Mairie 16500 Ansac-sur-Vienne,16016_0095,G,PLACE DE LA MAIRIE,
353149826,00011,35314982600011,O,1990-01-01,NN,,,2019-11-14T14:00:20,true,4,,,,,LA ROSSIGNOLE,16500,ANSAC-SUR-VIENNE,,,16016,,,,,,,,,,,,,,,,,,,2008-01-01,A,,,,,01.11Z,NAFRev2,N,0.605877,46.003513,0.61,street,Les Rossignols 16500 Ansac-sur-Vienne,16016_z08dd4,G,LES ROSSIGNOLS,
356000547,00105,35600054700105,O,1991-01-01,NN,,,2019-11-14T14:00:20,false,3,,,,,BOURG,16500,ANSAC-SUR-VIENNE,,,16016,,,,,,,,,,,,,,,,,,,2006-10-19,F,BUREAU DE POSTE,,,,64.1A,NAFRev1,O,0.614465,45.974305,0.59,street,Le Bouradou 16500 Ansac-sur-Vienne,16016_s1xmxw,G,LE BOURADOU,
377807078,00052,37780707800052,O,2005-02-01,NN,,,2019-11-14T14:00:20,false,4,,,,,,16500,ANSAC-SUR-VIENNE,,,16016,,,,,,,,,,,,,,,,,,,2009-10-01,F,,,,,43.22B,NAFRev2,N,,,0,,,,,,
377913298,00057,37791329800057,O,1998-01-01,,,,2019-11-14T14:00:20,false,3,,,,,LES PRATS,16500,ANSAC-SUR-VIENNE,,,16016,,,,,,,,,,,,,,,,,,,2000-08-30,F,,,,,01.2C,NAF1993,N,0.627693,45.977589,0.94,street,Les Prats 16500 Ansac-sur-Vienne,16016_v82dsq,G,LES PRATS,
378796452,00019,37879645200019,O,,NN,,,2019-11-14T14:00:20,true,1,,,,,AMBOURIANE,16500,ANSAC-SUR-VIENNE,,,16016,,,,,,,,,,,,,,,,,,,1992-02-25,F,,,,,02.0B,NAF1993,N,0.59279,45.99762,0.92,street,Route d’Ambouriane 16500 Ansac-sur-Vienne,16016_0005,G,ROUTE D AMBOURIANE,
379638414,00019,37963841400019,O,1990-09-25,NN,,,2019-11-14T14:00:20,true,3,,,,LD,LA GELANDRIE,16500,ANSAC-SUR-VIENNE,,,16016,,,,,,,,,,,,,,,,,,,2008-01-01,A,,,,,68.20A,NAFRev2,N,0.625686,46.015612,0.94,street,La Gelandrie 16500 Ansac-sur-Vienne,16016_mx9st4,G,LA GELANDRIE,
380372631,00016,38037263100016,O,1990-08-01,NN,,,2019-11-14T14:00:20,true,1,,,,,,16500,ANSAC-SUR-VIENNE,,,16016,,,,,,,,,,,,,,,,,,,1998-12-31,F,,,,,60.2B,NAF1993,O,,,0,,,,,,
380775411,00016,38077541100016,O,1991-01-01,NN,,,2019-11-14T14:00:20,false,8,,,,,LE BOURG,16500,ANSAC-SUR-VIENNE,,,16016,,,,,,,,,,,,,,,,,,,2012-11-01,F,,,,,56.10A,NAFRev2,O,0.614465,45.974305,0.72,street,Le Bouradou 16500 Ansac-sur-Vienne,16016_s1xmxw,G,LE BOURADOU,
380775411,00024,38077541100024,O,2010-05-01,01,2018,,2020-08-25T10:17:47,true,3,,9,,RUE,DE LA GARE,16500,ANSAC-SUR-VIENNE,,,16016,,,,,,,,,,,,,,,,,,,2014-01-13,A,ENTR'COTE ET OCEAN,,,,56.10A,NAFRev2,O,0.644871,45.99165,0.95,housenumber,9 Rue de la Gare 16500 Ansac-sur-Vienne,16016_0083_00009,G,9 RUE DE LA GARE,
380779140,00017,38077914000017,O,1991-01-01,NN,,,2019-11-14T14:00:20,true,4,LE BOIS DU GOUT,,,,,16500,ANSAC-SUR-VIENNE,,,16016,,,,,,,,,,,,,,,,,,,2016-05-03,A,,,,,68.20B,NAFRev2,N,0.633549,45.973306,0.94,street,Le Bois du Gout 16500 Ansac-sur-Vienne,16016_B025,D,LE BOIS DU GOUT,
381109644,00017,38110964400017,O,1991-02-01,NN,,,2019-11-14T14:00:20,true,3,,,,RTE,D ANGOULEME,16500,ANSAC-SUR-VIENNE,,,16016,,,,,,,,,,,,,,,,,,,2008-01-01,A,,,,,68.20A,NAFRev2,N,0.643104,45.993198,0.84,street,Route d’Angouleme 16500 Ansac-sur-Vienne,16016_0010,G,ROUTE D ANGOULEME,
381600261,00014,38160026100014,O,,NN,,,2019-11-14T14:00:20,true,1,,,,RUE,DU MOULIN,16500,ANSAC-SUR-VIENNE,,,16016,,,,,,,,,,,,,,,,,,,1991-10-07,F,,,,,45.2V,NAF1993,N,0.647792,45.992219,0.95,street,Rue du Moulin 16500 Ansac-sur-Vienne,16016_0100,G,RUE DU MOULIN,
382532117,00019,38253211700019,O,,NN,,,2019-11-14T14:00:20,true,1,,,,RUE,DU MOULIN,16500,ANSAC-SUR-VIENNE,,,16016,,,,,,,,,,,,,,,,,,,1992-09-30,F,,,,,74.4B,NAF1993,N,0.647792,45.992219,0.95,street,Rue du Moulin 16500 Ansac-sur-Vienne,16016_0100,G,RUE DU MOULIN,
382734036,00017,38273403600017,O,1991-07-01,NN,,,2019-11-14T14:00:20,true,3,,,,,PASSAGE A NIVEAU 8,16500,ANSAC-SUR-VIENNE,,,16016,,,,,,,,,,,,,,,,,,,2008-01-01,A,,,,,68.20A,NAFRev2,N,4.5566656,49.5111556,0.81,poi.level_crossing,(Passage à niveau) Alland'Huy-et-Sausseuil,https://osm.org/node/1587337025,G,,
385053525,00023,38505352500023,O,1900-01-01,NN,,,2019-11-14T14:00:20,false,3,,,,LD,LA GELANDRIE,16500,ANSAC-SUR-VIENNE,,,16016,,,,,,,,,,,,,,,,,,,1993-12-25,F,,,,,52.3C,NAF1993,N,0.625686,46.015612,0.94,street,La Gelandrie 16500 Ansac-sur-Vienne,16016_mx9st4,G,LA GELANDRIE,
388468902,00019,38846890200019,O,1992-08-01,NN,,,2019-11-14T14:00:20,false,4,RATTACHEMENT MAIRIE,1,,PL,HOTEL DE VILLE,16500,ANSAC-SUR-VIENNE,,,16016,,,,,,,,,,,,,,,,,,,2001-12-31,F,,,,,52.6E,NAF1993,N,0.646577,45.993776,0.37,housenumber,1 Place de la Fontaine 16500 Ansac-sur-Vienne,16016_0080_00001,G,1 PLACE DE LA FONTAINE,
388996761,00010,38899676100010,O,1992-10-01,NN,,,2019-11-14T14:00:20,true,1,,,,,LES GRANDES BOUEGES,16500,ANSAC-SUR-VIENNE,,,16016,,,,,,,,,,,,,,,,,,,2000-12-31,F,,,,,01.2A,NAF1993,N,0.600837,45.996654,0.94,street,Les Grandes Boueges 16500 Ansac-sur-Vienne,16016_B132,G,LES GRANDES BOUEGES,
389288671,00024,38928867100024,O,2011-09-21,,,,2019-11-14T14:00:20,true,2,,5,,RTE,DU POIRIER,16500,ANSAC-SUR-VIENNE,,,16016,,,,,,,,,,,,,,,,,,,2017-09-05,A,,,,,68.31Z,NAFRev2,N,0.639923,45.987673,0.85,housenumber,5 Route du Poirier 16500 Ansac-sur-Vienne,16016_0135_00005,G,5 ROUTE DU POIRIER,
391112448,00017,39111244800017,O,1993-01-01,NN,,,2019-11-14T14:00:20,true,3,,,,,RIOUX MARTIN,16500,ANSAC-SUR-VIENNE,,,16016,,,,,,,,,,,,,,,,,,,2008-01-01,A,,,,,01.11Z,NAFRev2,N,0.642151,45.985661,0.73,street,Rieux Martin 16500 Ansac-sur-Vienne,16016_84412o,G,RIEUX MARTIN,
392394656,00012,39239465600012,O,1993-09-10,NN,,,2019-11-14T14:00:20,true,1,,,,LD,LE BOIS DE LACAUD,16500,ANSAC-SUR-VIENNE,,,16016,,,,,,,,,,,,,,,,,,,1999-03-17,F,,,,,74.5A,NAF1993,N,0.59707,45.980511,0.94,street,Le Bois de Lacaud 16500 Ansac-sur-Vienne,16016_B021,G,LE BOIS DE LACAUD,
393053061,00015,39305306100015,O,1993-10-12,NN,,,2019-11-14T14:00:20,false,4,,,,LD,LA GELANDRIE,16500,ANSAC-SUR-VIENNE,,,16016,,,,,,,,,,,,,,,,,,,1996-06-01,F,,,,,52.3C,NAF1993,N,0.625686,46.015612,0.94,street,La Gelandrie 16500 Ansac-sur-Vienne,16016_mx9st4,G,LA GELANDRIE,
393114384,00018,39311438400018,O,1993-10-26,NN,,,2020-10-15T03:49:25,true,4,,,,LD,PEROBE,16500,ANSAC-SUR-VIENNE,,,16016,,,,,,,,,,,,,,,,,,,2020-02-24,F,,,,,68.20A,NAFRev2,N,0.625894,45.99502,0.92,street,En Perobe 16500 Ansac-sur-Vienne,16016_B182,G,EN PEROBE,
393406103,00035,39340610300035,O,1994-07-01,,,,2019-11-14T14:00:20,false,3,,,,,LE ROCHELLOUX,16500,ANSAC-SUR-VIENNE,,,16016,,,,,,,,,,,,,,,,,,,1999-12-31,F,,,,,70.2C,NAF1993,N,0.613666,46.030186,0.3,street,Le Chene 16500 Ansac-sur-Vienne,16016_3vpzst,G,LE CHENE,
395210693,00010,39521069300010,O,1993-01-01,NN,,,2019-11-14T14:00:20,true,3,,,,,RIEUX MARTIN,16500,ANSAC-SUR-VIENNE,,,16016,,,,,,,,,,,,,,,,,,,1998-12-25,F,,,,,01.1A,NAF1993,N,0.642151,45.985661,0.94,street,Rieux Martin 16500 Ansac-sur-Vienne,16016_84412o,G,RIEUX MARTIN,
399884774,00015,39988477400015,O,1983-04-01,NN,,,2019-11-14T14:00:20,true,4,,,,,LA GELANDRIE,16500,ANSAC-SUR-VIENNE,,,16016,,,,,,,,,,,,,,,,,,,2015-12-31,F,,,,,01.45Z,NAFRev2,N,0.625686,46.015612,0.94,street,La Gelandrie 16500 Ansac-sur-Vienne,16016_mx9st4,G,LA GELANDRIE,
402230734,00012,40223073400012,O,1995-09-01,NN,,,2019-11-14T14:00:20,true,5,,,,,BOIS DE LACAUD,16500,ANSAC-SUR-VIENNE,,,16016,,,,,,,,,,,,,,,,,,,2018-08-31,F,,,,,01.41Z,NAFRev2,O,0.59707,45.980511,0.93,street,Le Bois de Lacaud 16500 Ansac-sur-Vienne,16016_B021,G,LE BOIS DE LACAUD,
402618987,00018,40261898700018,O,1995-09-01,NN,,,2019-11-14T14:00:20,true,4,,,,LD,BOIS DE LACAUD,16500,ANSAC-SUR-VIENNE,,,16016,,,,,,,,,,,,,,,,,,,2013-12-31,F,,,,,68.20B,NAFRev2,N,0.59707,45.980511,0.93,street,Le Bois de Lacaud 16500 Ansac-sur-Vienne,16016_B021,G,LE BOIS DE LACAUD,
402816276,00016,40281627600016,O,1995-11-01,NN,,,2019-11-14T14:00:20,true,3,,,,,MAISONNEUVE,16500,ANSAC-SUR-VIENNE,,,16016,,,,,,,,,,,,,,,,,,,2008-01-01,A,,,,,01.42Z,NAFRev2,N,0.600438,45.980168,0.94,street,Maisonneuve 16500 Ansac-sur-Vienne,16016_zjwmko,G,MAISONNEUVE,
403366149,00017,40336614900017,O,1995-12-02,NN,,,2021-08-09T09:46:37,true,3,,2,,,LE BOURADOU,16500,ANSAC-SUR-VIENNE,,,16016,,,,,,,,,,,,,,,,,,,2008-01-01,A,,,,,68.20A,NAFRev2,N,0.61595,45.974531,0.94,housenumber,2 Le Bouradou 16500 Ansac-sur-Vienne,16016_s1xmxw_00002,G,2 LE BOURADOU,
407707736,00010,40770773600010,O,1996-07-01,NN,,,2019-11-14T14:00:20,true,1,,,,,ZONE ARTISANALE,16500,ANSAC-SUR-VIENNE,,,16016,,,,,,,,,,,,,,,,,,,2002-06-30,F,,,,,51.6N,NAF1993,N,2.7640352,42.6301915,0.9,poi.retail,Zone Artisanale (Zone commerciale) Thuir,https://osm.org/way/191039530,G,,