siren,nic,siret,statutDiffusionEtablissement,dateCreationEtablissement,trancheEffectifsEtablissement,anneeEffectifsEtablissement,activitePrincipaleRegistreMetiersEtablissement,dateDernierTraitementEtablissement,etablissementSiege,nombrePeriodesEtablissement,complementAdresseEtablissement,numeroVoieEtablissement,indiceRepetitionEtablissement,typeVoieEtablissement,libelleVoieEtablissement,codePostalEtablissement,libelleCommuneEtablissement,libelleCommuneEtrangerEtablissement,distributionSpecialeEtablissement,codeCommuneEtablissement,codeCedexEtablissement,libelleCedexEtablissement,codePaysEtrangerEtablissement,libellePaysEtrangerEtablissement,complementAdresse2Etablissement,numeroVoie2Etablissement,indiceRepetition2Etablissement,typeVoie2Etablissement,libelleVoie2Etablissement,codePostal2Etablissement,libelleCommune2Etablissement,libelleCommuneEtranger2Etablissement,distributionSpeciale2Etablissement,codeCommune2Etablissement,codeCedex2Etablissement,libelleCedex2Etablissement,codePaysEtranger2Etablissement,libellePaysEtranger2Etablissement,dateDebut,etatAdministratifEtablissement,enseigne1Etablissement,enseigne2Etablissement,enseigne3Etablissement,denominationUsuelleEtablissement,activitePrincipaleEtablissement,nomenclatureActivitePrincipaleEtablissement,caractereEmployeurEtablissement,longitude,latitude,geo_score,geo_type,geo_adresse,geo_id,geo_ligne,geo_l4,geo_l5
200023935,00014,20002393500014,O,2009-12-18,,,,2017-11-22T10:16:26,true,2,,,,RUE,DE LA MAIRIE,27180,BERNIENVILLE,,,27057,,,,,,,,,,,,,,,,,,,2017-03-14,F,,,,,88.99B,NAFRev2,N,1.016278,49.082293,0.94,street,Rue de la Mairie 27180 Bernienville,27057_0027,G,RUE DE LA MAIRIE,
212700579,00015,21270057900015,O,1983-03-01,01,2018,,2020-08-25T10:16:27,true,3,,,,RUE,DE LA MAIRIE,27180,BERNIENVILLE,,,27057,,,,,,,,,,,,,,,,,,,2008-01-01,A,MAIRIE,,,,84.11Z,NAFRev2,N,1.016278,49.082293,0.94,street,Rue de la Mairie 27180 Bernienville,27057_0027,G,RUE DE LA MAIRIE,
212700579,00023,21270057900023,O,1983-12-21,01,2018,,2020-08-25T10:16:27,false,4,,9,,RUE,DE L ECOLE,27180,BERNIENVILLE,,,27057,,,,,,,,,,,,,,,,,,,2008-01-01,A,ECOLE ELEMENTAIRE PUBLIQUE,,,,85.20Z,NAFRev2,N,1.022364,49.083629,0.94,housenumber,9 Rue de l’Ecole 27180 Bernienville,27057_0008_00009,G,9 RUE DE L ECOLE,
252700422,00030,25270042200030,O,1995-11-15,NN,,,2010-04-18T03:16:28,true,4,MAIRIE,,,RUE,DE LA MAIRIE,27180,BERNIENVILLE,,,27057,,,,,,,,,,,,,,,,,,,2008-12-31,F,,,,,36.00Z,NAFRev2,N,1.016278,49.082293,0.94,street,Rue de la Mairie 27180 Bernienville,27057_0027,G,RUE DE LA MAIRIE,
307704130,00011,30770413000011,O,,NN,,,,true,1,,,,,LA MERE ODUE,27180,BERNIENVILLE,,,27057,,,,,,,,,,,,,,,,,,,1995-02-09,F,,,,,52.2G,NAF1993,O,1.034171,49.06273,0.94,street,La Mere Odue 27180 Bernienville,27057_B028,G,LA MERE ODUE,
318724184,00037,31872418400037,O,2016-10-20,,,,2021-02-23T10:43:14,true,1,,1,,RUE,CHEVALEAU,27180,BERNIENVILLE,,,27057,,,,,,,,,,,,,,,,,,,2016-10-20,A,,,,,01.61Z,NAFRev2,N,1.025707,49.082461,0.94,housenumber,1 Rue Chevaleau 27180 Bernienville,27057_0005_00001,G,1 RUE CHEVALEAU,
319299939,00011,31929993900011,O,1980-06-14,NN,,,2006-10-27T01:03:34,true,3,,,,RTE,NATIONALE 13,27180,BERNIENVILLE,,,27057,,,,,,,,,,,,,,,,,,,2004-09-17,F,,,,,55.3A,NAFRev1,N,1.035398,49.062093,0.83,street,Route Nationale 13 27180 Bernienville,27057_ufzisw,G,ROUTE NATIONALE 13,
319299947,00014,31929994700014,O,,NN,,,,true,1,,,,,,27180,BERNIENVILLE,,,27057,,,,,,,,,,,,,,,,,,,1993-06-18,F,,,,,55.3A,NAF1993,N,,,0,,,,,,
320970288,00066,32097028800066,O,2003-04-01,NN,,,2015-12-18T19:31:00,true,4,,5,,RUE,SOLLIER,27180,BERNIENVILLE,,,27057,,,,,,,,,,,,,,,,,,,2009-07-01,A,,,,,47.89Z,NAFRev2,N,1.016844,49.081179,0.94,housenumber,5 Rue Sollier 27180 Bernienville,27057_0045_00005,G,5 RUE SOLLIER,
321811291,00038,32181129100038,O,2007-11-07,,,,2008-09-04T20:05:22,true,3,,,,RTE,NATIONALE 13,27180,BERNIENVILLE,,,27057,,,,,,,,,,,,,,,,,,,2008-06-30,F,AUBERGE DE LA MERE ODUE,,,,56.10A,NAFRev2,O,1.035398,49.062093,0.83,street,Route Nationale 13 27180 Bernienville,27057_ufzisw,G,ROUTE NATIONALE 13,
326191988,00012,32619198800012,O,1969-01-01,,,,2007-01-18T09:17:02,true,3,,,,,,27180,BERNIENVILLE,,,27057,,,,,,,,,,,,,,,,,,,1993-12-31,F,,,,,01.2E,NAF1993,N,,,0,,,,,,
327800488,00014,32780048800014,O,,,,,,true,1,,1,,RUE,DE LA HAUTE PORTE,27180,BERNIENVILLE,,,27057,,,,,,,,,,,,,,,,,,,1997-06-30,F,,,,,28.4B,NAF1993,N,1.012958,49.078781,0.94,housenumber,1 Rue de la Haute Porte 27180 Bernienville,27057_0023_00001,G,1 RUE DE LA HAUTE PORTE,
328039912,00055,32803991200055,O,2009-01-12,,,,2009-11-23T19:52:17,true,2,,13,,,ROUTE NATIONALE 13,27180,BERNIENVILLE,,,27057,,,,,,,,,,,,,,,,,,,2009-06-30,F,,,,,56.10A,NAFRev2,N,1.035398,49.062093,0.94,street,Route Nationale 13 27180 Bernienville,27057_ufzisw,G,ROUTE NATIONALE 13,
329057905,00013,32905790500013,O,1984-01-11,NN,,,2011-09-13T05:29:42,true,4,,,,,,27180,BERNIENVILLE,,,27057,,,,,,,,,,,,,,,,,,,2011-08-31,F,,,,,01.61Z,NAFRev2,N,,,0,,,,,,
331284281,00028,33128428100028,O,1998-01-01,NN,,,2014-07-08T00:36:19,true,5,,2,B,RUE,DE LA MAIRIE,27180,BERNIENVILLE,,,27057,,,,,,,,,,,,,,,,,,,2011-03-31,F,,,,,43.99C,NAFRev2,O,1.019108,49.082884,0.94,housenumber,2b Rue de la Mairie 27180 Bernienville,27057_0027_00002_b,G,2B RUE DE LA MAIRIE,
340038470,00019,34003847000019,O,,NN,,,,true,1,,,,,PITHIENVILLE,27180,BERNIENVILLE,,,27057,,,,,,,,,,,,,,,,,,,1987-03-20,F,,,,,60.09,NAP,N,1.019912,49.08203,0.92,street,Route de Pithienville 27180 Bernienville,27057_0030,G,ROUTE DE PITHIENVILLE,
343093761,00017,34309376100017,O,1987-11-01,NN,,,,true,1,,,,,,27180,BERNIENVILLE,,,27057,,,,,,,,,,,,,,,,,,,1993-01-01,F,,,,,01.1A,NAF1993,N,,,0,,,,,,
348880790,00012,34888079000012,O,,NN,,,,true,1,,,,,,27180,BERNIENVILLE,,,27057,,,,,,,,,,,,,,,,,,,1996-06-29,F,,,,,70.2B,NAF1993,N,,,0,,,,,,
348880816,00015,34888081600015,O,1980-01-01,NN,,,2011-05-26T09:34:38,true,4,,,,,,27180,BERNIENVILLE,,,27057,,,,,,,,,,,,,,,,,,,2010-12-31,F,,,,,01.11Z,NAFRev2,N,,,0,,,,,,
348880824,00019,34888082400019,O,,NN,,,,true,1,,,,,,27180,BERNIENVILLE,,,27057,,,,,,,,,,,,,,,,,,,1989-01-01,F,,,,,01.00,NAP,N,,,0,,,,,,
348880840,00015,34888084000015,O,,,,,,true,1,,,,,,27180,BERNIENVILLE,,,27057,,,,,,,,,,,,,,,,,,,1997-05-01,F,,,,,01.3Z,NAF1993,N,,,0,,,,,,
348880857,00019,34888085700019,O,1981-07-01,NN,,,2018-10-05T04:23:51,true,4,,,,,,27180,BERNIENVILLE,,,27057,,,,,,,,,,,,,,,,,,,2018-06-30,F,,,,,01.11Z,NAFRev2,N,,,0,,,,,,
352791859,00015,35279185900015,O,1989-12-01,NN,,,2006-10-27T23:59:18,true,3,,,,,PITHIENVILLE,27180,BERNIENVILLE,,,27057,,,,,,,,,,,,,,,,,,,2005-11-25,F,,,,,01.2J,NAFRev1,N,1.019912,49.08203,0.92,street,Route de Pithienville 27180 Bernienville,27057_0030,G,ROUTE DE PITHIENVILLE,
353917214,00010,35391721400010,O,,NN,,,,true,1,,,,,,27180,BERNIENVILLE,,,27057,,,,,,,,,,,,,,,,,,,1995-03-31,F,,,,,01.1A,NAF1993,N,,,0,,,,,,
379187024,00037,37918702400037,O,1997-07-31,NN,,,,false,4,,,,RTE,N 13,27180,BERNIENVILLE,,,27057,,,,,,,,,,,,,,,,,,,2000-12-31,F,LA MERE ODUE,,,,55.3A,NAF1993,N,1.035398,49.062093,0.52,street,Route Nationale 13 27180 Bernienville,27057_ufzisw,G,ROUTE NATIONALE 13,
383770195,00030,38377019500030,O,1996-10-01,NN,,,,false,3,,4,,RUE,RENE VALLEE,27180,BERNIENVILLE,,,27057,,,,,,,,,,,,,,,,,,,1997-08-12,F,,,,,85.1C,NAF1993,N,1.040162,49.067224,0.86,street,Rue René Vallée 27180 Bernienville,27057_0060,G,RUE RENE VALLEE,
383890720,00014,38389072000014,O,1992-01-01,03,2018,,2020-08-25T10:20:55,true,4,,,,,FERME DES BUQUETS,27180,BERNIENVILLE,,,27057,,,,,,,,,,,,,,,,,,,2012-12-31,A,,,,,01.46Z,NAFRev2,O,1.015994,49.07501,0.69,street,Rue des Buquets 27180 Bernienville,27057_px00ys,G,RUE DES BUQUETS,
384277364,00012,38427736400012,O,1900-01-01,,,,2015-04-02T04:17:03,true,4,,,,,LES BUQUETS,27180,BERNIENVILLE,,,27057,,,,,,,,,,,,,,,,,,,2014-01-01,A,,,,,02.20Z,NAFRev2,N,1.015627,49.075556,0.93,street,Les Buquets 27180 Bernienville,27057_v8yua7,G,LES BUQUETS,
384277638,00019,38427763800019,O,1992-01-01,NN,,,,true,4,,,,,LES BUQUETS,27180,BERNIENVILLE,,,27057,,,,,,,,,,,,,,,,,,,2003-06-30,F,,,,,01.3Z,NAFRev1,N,1.015627,49.075556,0.93,street,Les Buquets 27180 Bernienville,27057_v8yua7,G,LES BUQUETS,
384765459,00019,38476545900019,O,1992-02-06,NN,,,2020-12-22T03:51:48,true,3,,,,,,27180,BERNIENVILLE,,,27057,,,,,,,,,,,,,,,,,,,2008-01-01,A,,,,,68.20B,NAFRev2,N,,,0,,,,,,
384913174,00049,38491317400049,O,2000-07-29,NN,,,2008-11-08T00:46:01,false,4,,2,,RUE,DE LA HAUTE PORTE,27180,BERNIENVILLE,,,27057,,,,,,,,,,,,,,,,,,,2005-08-01,F,,,,,74.7Z,NAFRev1,N,1.013243,49.07903,0.94,housenumber,2 Rue de la Haute Porte 27180 Bernienville,27057_0023_00002,G,2 RUE DE LA HAUTE PORTE,
388762411,00014,38876241100014,O,1992-10-01,NN,,,,false,4,,2,,RTE,DE LA MAIRIE,27180,BERNIENVILLE,,,27057,,,,,,,,,,,,,,,,,,,1994-12-25,F,,,,,74.1G,NAF1993,N,1.018421,49.082477,0.8,housenumber,2 Rue de la Mairie 27180 Bernienville,27057_0027_00002,G,2 RUE DE LA MAIRIE,
390051217,00011,39005121700011,O,1993-01-01,NN,,,,true,4,,,,,,27180,BERNIENVILLE,,,27057,,,,,,,,,,,,,,,,,,,2003-06-20,F,,,,,01.3Z,NAFRev1,N,,,0,,,,,,
391381803,00017,39138180300017,O,,NN,,,,true,1,,,,,RN 13,27180,BERNIENVILLE,,,27057,,,,,,,,,,,,,,,,,,,1996-03-14,F,,,,,55.3A,NAF1993,N,1.035398,49.062093,0.43,street,Route Nationale 13 27180 Bernienville,27057_ufzisw,G,ROUTE NATIONALE 13,
391489911,00019,39148991100019,O,1993-06-01,NN,,,2008-01-04T23:53:21,true,3,,,,RTE,N 13,27180,BERNIENVILLE,,,27057,,,,,,,,,,,,,,,,,,,2008-01-01,A,,,,,68.20A,NAFRev2,N,1.035398,49.062093,0.52,street,Route Nationale 13 27180 Bernienville,27057_ufzisw,G,ROUTE NATIONALE 13,
392514568,00014,39251456800014,O,1993-10-01,NN,,,2014-07-08T01:20:54,true,4,HAM DE PITHIENVILLE,7,,RUE,RENE VALLEE,27180,BERNIENVILLE,,,27057,,,,,,,,,,,,,,,,,,,2012-04-30,F,,,,,14.13Z,NAFRev2,N,1.04677,49.067922,0.95,housenumber,7 Rue René Vallée 27180 Bernienville,27057_0060_00007,G,7 RUE RENE VALLEE,
393333703,00014,39333370300014,O,,NN,,,2006-11-25T12:18:01,true,1,,,,,RN 13,27180,BERNIENVILLE,,,27057,,,,,,,,,,,,,,,,,,,1996-03-01,F,,,,,55.3A,NAF1993,N,1.035398,49.062093,0.43,street,Route Nationale 13 27180 Bernienville,27057_ufzisw,G,ROUTE NATIONALE 13,
399846294,00011,39984629400011,O,1995-01-01,NN,,,2006-10-28T02:45:50,true,3,,,,,,27180,BERNIENVILLE,,,27057,,,,,,,,,,,,,,,,,,,2004-01-31,F,,,,,01.3Z,NAFRev1,N,,,0,,,,,,
400244430,00015,40024443000015,O,1995-02-15,NN,,,2015-03-17T10:47:51,false,4,PITHIENVILLE,2,,RUE,RENE VALLEE,27180,BERNIENVILLE,,,27057,,,,,,,,,,,,,,,,,,,2015-03-16,F,,,,,68.20A,NAFRev2,N,1.040162,49.067224,0.86,street,Rue René Vallée 27180 Bernienville,27057_0060,G,RUE RENE VALLEE,
400244430,00023,40024443000023,O,2015-03-16,,,,2018-01-19T03:57:44,false,2,PITHIENVILLE,52,,RUE,RENE VALLEE,27180,BERNIENVILLE,,,27057,,,,,,,,,,,,,,,,,,,2017-09-15,F,,,,,68.20B,NAFRev2,N,1.036023,49.067383,0.95,housenumber,52 Rue René Vallée 27180 Bernienville,27057_0060_00052,G,52 RUE RENE VALLEE,
404688418,00015,40468841800015,O,1996-03-27,NN,,,,false,4,,,,,FERME DES BUQUETS,27180,BERNIENVILLE,,,27057,,,,,,,,,,,,,,,,,,,1999-05-12,F,,,,,01.1A,NAF1993,N,1.015994,49.07501,0.69,street,Rue des Buquets 27180 Bernienville,27057_px00ys,G,RUE DES BUQUETS,
404899197,00044,40489919700044,O,2014-02-01,,,,2021-02-23T11:29:12,true,1,,5,,RUE,SOLLIER,27180,BERNIENVILLE,,,27057,,,,,,,,,,,,,,,,,,,2014-02-01,A,,,,,47.89Z,NAFRev2,N,1.016844,49.081179,0.94,housenumber,5 Rue Sollier 27180 Bernienville,27057_0045_00005,G,5 RUE SOLLIER,
408074284,00014,40807428400014,O,1900-01-01,NN,,,2016-11-28T07:48:16,false,3,,,,,RN 13,27180,BERNIENVILLE,,,27057,,,,,,,,,,,,,,,,,,,1997-07-31,F,,,,,55.3A,NAF1993,O,1.035398,49.062093,0.43,street,Route Nationale 13 27180 Bernienville,27057_ufzisw,G,ROUTE NATIONALE 13,
413557257,00016,41355725700016,O,1997-05-01,,,,,true,1,,,,,,27180,BERNIENVILLE,,,27057,,,,,,,,,,,,,,,,,,,2000-09-05,F,,,,,01.1A,NAF1993,N,,,0,,,,,,
420403743,00016,42040374300016,O,1998-11-03,NN,,,2014-02-03T13:29:17,true,3,,1,,RUE,DE L ECOLE,27180,BERNIENVILLE,,,27057,,,,,,,,,,,,,,,,,,,2008-01-01,A,,,,,01.11Z,NAFRev2,N,1.020038,49.083476,0.94,housenumber,1 Rue de l’Ecole 27180 Bernienville,27057_0008_00001,G,1 RUE DE L ECOLE,
422613604,00012,42261360400012,O,1999-03-26,NN,,,2008-01-05T20:43:07,true,3,PITHIENVILLE,2,,RUE,RENE VALLEE,27180,BERNIENVILLE,,,27057,,,,,,,,,,,,,,,,,,,2008-01-01,A,,,,,68.20B,NAFRev2,N,1.040162,49.067224,0.86,street,Rue René Vallée 27180 Bernienville,27057_0060,G,RUE RENE VALLEE,
439652801,00010,43965280100010,O,2001-10-04,NN,,,2011-05-03T00:16:42,false,4,,,,RTE,NATIONALE 13,27180,BERNIENVILLE,,,27057,,,,,,,,,,,,,,,,,,,2002-06-30,F,,,,,55.3A,NAF1993,O,1.035398,49.062093,0.83,street,Route Nationale 13 27180 Bernienville,27057_ufzisw,G,ROUTE NATIONALE 13,
441342748,00015,44134274800015,O,2002-03-01,NN,,,2007-01-18T09:44:15,true,3,,6,,RUE,DE LA MAIRIE,27180,BERNIENVILLE,,,27057,,,,,,,,,,,,,,,,,,,2005-01-20,F,,,,,01.4B,NAFRev1,N,1.016529,49.082259,0.94,housenumber,6 Rue de la Mairie 27180 Bernienville,27057_0027_00006,G,6 RUE DE LA MAIRIE,
442902334,00014,44290233400014,O,2002-07-10,NN,,,2007-02-01T14:13:42,false,3,,23,B,RUE,SOLLIER,27180,BERNIENVILLE,,,27057,,,,,,,,,,,,,,,,,,,2007-01-25,F,,,,,01.4A,NAFRev1,N,1.018968,49.081717,0.83,housenumber,23bis Rue Sollier 27180 Bernienville,27057_0045_00023_bis,G,23BIS RUE SOLLIER,
442902334,00022,44290233400022,O,2007-01-25,02,2018,,2021-02-23T13:25:00,true,2,,1,,RUE,CHEVALEAU,27180,BERNIENVILLE,,,27057,,,,,,,,,,,,,,,,,,,2008-01-01,A,,,,,01.61Z,NAFRev2,N,1.025707,49.082461,0.94,housenumber,1 Rue Chevaleau 27180 Bernienville,27057_0005_00001,G,1 RUE CHEVALEAU,
447672676,00015,44767267600015,O,2003-03-15,NN,,,2009-06-27T10:47:37,false,3,LE CLOS MERCIER,23,B,RUE,SOLLIER,27180,BERNIENVILLE,,,27057,,,,,,,,,,,,,,,,,,,2007-01-25,F,,,,,01.3Z,NAFRev1,N,1.018968,49.081717,0.83,housenumber,23bis Rue Sollier 27180 Bernienville,27057_0045_00023_bis,G,23BIS RUE SOLLIER,
447672676,00023,44767267600023,O,2007-01-25,NN,,,2021-06-17T08:48:56,true,2,,1,,RUE,CHEVALEAU,27180,BERNIENVILLE,,,27057,,,,,,,,,,,,,,,,,,,2008-01-01,A,,,,,01.50Z,NAFRev2,N,1.025707,49.082461,0.94,housenumber,1 Rue Chevaleau 27180 Bernienville,27057_0005_00001,G,1 RUE CHEVALEAU,
450278809,00014,45027880900014,O,2003-05-24,NN,,,2008-01-05T02:03:20,true,3,MAIRIE,,,RUE,DE LA MAIRIE,27180,BERNIENVILLE,,,27057,,,,,,,,,,,,,,,,,,,2008-01-01,A,,,,,94.99Z,NAFRev2,N,1.016278,49.082293,0.94,street,Rue de la Mairie 27180 Bernienville,27057_0027,G,RUE DE LA MAIRIE,
451989156,00018,45198915600018,O,2004-02-06,NN,,,2007-06-27T10:06:58,false,3,,,,RTE,NATIONALE 13,27180,BERNIENVILLE,,,27057,,,,,,,,,,,,,,,,,,,2004-12-25,F,,,,,55.3A,NAFRev1,N,1.035398,49.062093,0.83,street,Route Nationale 13 27180 Bernienville,27057_ufzisw,G,ROUTE NATIONALE 13,
452156011,00010,45215601100010,O,2004-02-01,01,2018,,2020-08-25T10:17:42,true,3,,9,,RUE,SOLLIER,27180,BERNIENVILLE,,,27057,,,,,,,,,,,,,,,,,,,2008-01-01,A,,,,,01.11Z,NAFRev2,N,1.013303,49.080662,0.94,housenumber,9 Rue Sollier 27180 Bernienville,27057_0045_00009,G,9 RUE SOLLIER,
478943178,00010,47894317800010,O,2004-10-11,NN,,,2008-11-08T02:43:57,false,4,,7,,RUE,DE L ECOLE,27180,BERNIENVILLE,,,27057,,,,,,,,,,,,,,,,,,,2006-08-09,F,,,,,20.3Z,NAFRev1,O,1.021218,49.083563,0.94,housenumber,7 Rue de l’Ecole 27180 Bernienville,27057_0008_00007,G,7 RUE DE L ECOLE,
480342658,00014,48034265800014,O,2005-01-01,,,,2008-02-01T08:57:55,false,2,,,,RTE,NATIONALE 13,27180,BERNIENVILLE,,,27057,,,,,,,,,,,,,,,,,,,2006-05-31,F,,,,,55.3A,NAFRev1,N,1.035398,49.062093,0.83,street,Route Nationale 13 27180 Bernienville,27057_ufzisw,G,ROUTE NATIONALE 13,
488358227,00012,48835822700012,O,2006-02-01,,,,2007-07-11T05:26:44,false,2,CHEZ MME VARIN MARTINE,11,,RUE,DES ECOLES,27180,BERNIENVILLE,,,27057,,,,,,,,,,,,,,,,,,,2007-06-13,F,,,,,70.2C,NAFRev1,N,1.022253,49.083609,0.72,housenumber,11 Rue de l’Ecole 27180 Bernienville,27057_0008_00011,G,11 RUE DE L ECOLE,
490329455,00011,49032945500011,O,2006-03-31,,,,2014-12-19T08:38:39,true,4,,,,,RN 13,27180,BERNIENVILLE,,,27057,,,,,,,,,,,,,,,,,,,2008-01-01,F,LA MERE ODUE,,,,56.10A,NAFRev2,N,1.035398,49.062093,0.43,street,Route Nationale 13 27180 Bernienville,27057_ufzisw,G,ROUTE NATIONALE 13,
492965553,00034,49296555300034,O,2017-03-01,,,4339ZZ,2017-10-27T03:49:51,false,2,,15,,RUE,RENE VALLEE,27180,BERNIENVILLE,,,27057,,,,,,,,,,,,,,,,,,,2017-10-10,F,,,,COULEURS DES ILES,43.39Z,NAFRev2,N,1.042702,49.06768,0.95,housenumber,15 Rue René Vallée 27180 Bernienville,27057_0060_00015,G,15 RUE RENE VALLEE,
498555481,00015,49855548100015,O,2007-06-18,,,,2012-11-09T01:47:39,true,5,,3,,RUE,DE L'ECOLE,27180,BERNIENVILLE,,,27057,,,,,,,,,,,,,,,,,,,2011-12-25,F,,,,,96.09Z,NAFRev2,N,1.020342,49.083488,0.94,housenumber,3 Rue de l’Ecole 27180 Bernienville,27057_0008_00003,G,3 RUE DE L ECOLE,
502097249,00010,50209724900010,O,2008-01-01,01,2018,,2020-08-25T10:14:23,true,1,HAMEAU DE PITHIENVILLE,,,RTE,DE NEUVILLE,27180,BERNIENVILLE,,,27057,,,,,,,,,,,,,,,,,,,2008-01-01,A,,,,,47.21Z,NAFRev2,O,1.036921,49.066957,0.82,street,Route de Neuville 27180 Bernienville,27057_pfyc0m,G,ROUTE DE NEUVILLE,
508506813,00023,50850681300023,O,2009-01-17,,,,2009-06-04T15:38:27,false,1,,2,,RUE,DE LA HAUTE PORTE,27180,BERNIENVILLE,,,27057,,,,,,,,,,,,,,,,,,,2009-01-17,F,,,,,80.10Z,NAFRev2,N,1.013243,49.07903,0.94,housenumber,2 Rue de la Haute Porte 27180 Bernienville,27057_0023_00002,G,2 RUE DE LA HAUTE PORTE,
513470542,00038,51347054200038,O,2011-10-04,,,,2021-02-23T15:23:57,true,1,,14,,RUE,BARBET D AUREVILLY,27180,BERNIENVILLE,,,27057,,,,,,,,,,,,,,,,,,,2011-10-04,A,,,,,62.01Z,NAFRev2,N,,,0,,,,,,
514209758,00010,51420975800010,O,2009-08-01,,,8122ZZ,2014-08-20T09:34:16,true,5,,25,,RUE,DE LA MAIRIE,27180,BERNIENVILLE,,,27057,,,,,,,,,,,,,,,,,,,2014-08-25,A,SNP,,,SNP,81.22Z,NAFRev2,N,1.013447,49.081819,0.94,housenumber,25 Rue de la Mairie 27180 Bernienville,27057_0027_00025,G,25 RUE DE LA MAIRIE,
515272284,00016,51527228400016,O,2009-07-09,NN,,,2015-05-14T07:37:42,true,4,,,,RTE,ROUTE DEPARTEMENTALE 613,27180,BERNIENVILLE,,,27057,,,,,,,,,,,,,,,,,,,2013-03-21,A,LA MERE ODUE,,,,56.10A,NAFRev2,N,,,0,,,,,,
517456364,00010,51745636400010,O,2009-10-26,,,4339ZZ,2016-01-12T00:28:44,true,1,,11,,RUE,DE L'ECOLE,27180,BERNIENVILLE,,,27057,,,,,,,,,,,,,,,,,,,2009-10-26,A,NATURE TERRE ET PASSION,,,,81.30Z,NAFRev2,N,1.022253,49.083609,0.94,housenumber,11 Rue de l’Ecole 27180 Bernienville,27057_0008_00011,G,11 RUE DE L ECOLE,
522707207,00018,52270720700018,O,2010-04-03,NN,,,2020-06-04T07:44:40,false,3,,3,,RTE,DE PITHIENVILLE,27180,BERNIENVILLE,,,27057,,,,,,,,,,,,,,,,,,,2013-06-30,F,,,,,43.34Z,NAFRev2,O,1.01941,49.082156,0.86,housenumber,3 Route de Pithienville 27180 Bernienville,27057_0030_00003,G,3 ROUTE DE PITHIENVILLE,
524226875,00010,52422687500010,O,2010-08-09,,,9602AB,2015-03-18T00:31:02,true,1,,6,,RUE,DE L'ECOLE,27180,BERNIENVILLE,,,27057,,,,,,,,,,,,,,,,,,,2010-08-09,A,ABCD (ALLO BRUSHING COIFFURE DOMICI,,,,96.02A,NAFRev2,N,1.021103,49.083495,0.94,housenumber,6 Rue de l’Ecole 27180 Bernienville,27057_0008_00006,G,6 RUE DE L ECOLE,
528059165,00019,52805916500019,O,2010-11-02,,,,2013-01-11T08:43:24,true,2,,3,,CHE,CHEMIN DE LA RIVIERE,27180,BERNIENVILLE,,,27057,,,,,,,,,,,,,,,,,,,2012-11-30,F,,,,,62.03Z,NAFRev2,N,1.016249,49.079852,0.88,housenumber,3 Chemin de la Riviere 27180 Bernienville,27057_0040_00003,G,3 CHEMIN DE LA RIVIERE,
528737281,00014,52873728100014,O,2010-11-01,NN,,,2015-05-14T08:46:34,false,3,,46,,,LA MERE ODUE,27180,BERNIENVILLE,,,27057,,,,,,,,,,,,,,,,,,,2013-09-01,F,,,,,01.11Z,NAFRev2,O,1.036801,49.061769,0.94,housenumber,46 La Mere Odue 27180 Bernienville,27057_b028_00046,G,46 LA MERE ODUE,
528737299,00016,52873729900016,O,2010-11-01,NN,,,2015-05-14T08:46:34,false,3,,46,,,LA MERE ODUE,27180,BERNIENVILLE,,,27057,,,,,,,,,,,,,,,,,,,2013-09-01,F,,,,,01.11Z,NAFRev2,O,1.036801,49.061769,0.94,housenumber,46 La Mere Odue 27180 Bernienville,27057_b028_00046,G,46 LA MERE ODUE,
531645992,00011,53164599200011,O,2011-04-01,02,2018,4399CZ,2021-07-07T09:39:50,true,1,,2,B,RUE,DE LA MAIRIE,27180,BERNIENVILLE,,,27057,,,,,,,,,,,,,,,,,,,2011-04-01,A,,,,,43.99C,NAFRev2,O,1.019108,49.082884,0.94,housenumber,2b Rue de la Mairie 27180 Bernienville,27057_0027_00002_b,G,2B RUE DE LA MAIRIE,
533401410,00014,53340141000014,O,2011-07-01,,,,2011-07-06T04:55:29,true,1,,32,,RUE,RENE VALLEE,27180,BERNIENVILLE,,,27057,,,,,,,,,,,,,,,,,,,2011-07-01,A,,,,LA RUCHE NORMANDE,01.49Z,NAFRev2,N,1.041326,49.067252,0.95,housenumber,32 Rue René Vallée 27180 Bernienville,27057_0060_00032,G,32 RUE RENE VALLEE,
751973694,00019,75197369400019,O,2012-05-24,,,,2012-07-17T14:03:04,true,2,,19,,RUE,DE LA MAIRIE,27180,BERNIENVILLE,,,27057,,,,,,,,,,,,,,,,,,,2012-06-25,A,,,,,64.20Z,NAFRev2,N,1.015459,49.082238,0.94,housenumber,19 Rue de la Mairie 27180 Bernienville,27057_0027_00019,G,19 RUE DE LA MAIRIE,
780784377,00019,78078437700019,O,1900-01-01,,,,2007-01-18T09:46:55,true,3,,,,,,27180,BERNIENVILLE,,,27057,,,,,,,,,,,,,,,,,,,1993-12-31,F,,,,,01.4A,NAF1993,N,,,0,,,,,,
780784385,00012,78078438500012,O,,NN,,,,true,1,,,,HAM,DE PITHIENVILLE,27180,BERNIENVILLE,,,27057,,,,,,,,,,,,,,,,,,,1996-09-30,F,,,,,85.1C,NAF1993,N,1.019912,49.08203,0.92,street,Route de Pithienville 27180 Bernienville,27057_0030,G,ROUTE DE PITHIENVILLE,
780829420,00022,78082942000022,O,1900-01-01,NN,,,2008-11-08T03:19:30,true,4,,,,,,27180,BERNIENVILLE,,,27057,,,,,,,,,,,,,,,,,,,2005-12-31,F,,,,,45.3E,NAFRev1,N,,,0,,,,,,
792453193,00015,79245319300015,O,2013-03-21,NN,,,2016-04-26T06:02:43,true,2,,,,RTE,DEPARTEMENTAL 613,27180,BERNIENVILLE,,,27057,,,,,,,,,,,,,,,,,,,2013-07-30,A,,,,LA MERE ODUE,56.10A,NAFRev2,O,,,0,,,,,,
794931667,00016,79493166700016,O,2013-08-26,,,,2013-08-27T03:34:01,true,1,,6,,RUE,SOLLIER,27180,BERNIENVILLE,,,27057,,,,,,,,,,,,,,,,,,,2013-08-26,A,,,,,70.10Z,NAFRev2,N,1.016135,49.080987,0.94,housenumber,6 Rue Sollier 27180 Bernienville,27057_0045_00006,G,6 RUE SOLLIER,
799146451,00015,79914645100015,O,2013-07-15,,,,2018-04-10T15:06:06,true,1,,1,,RUE,CHEVALEAU,27180,BERNIENVILLE,,,27057,,,,,,,,,,,,,,,,,,,2013-07-15,A,,,,,64.20Z,NAFRev2,N,1.025707,49.082461,0.94,housenumber,1 Rue Chevaleau 27180 Bernienville,27057_0005_00001,G,1 RUE CHEVALEAU,
799178579,00022,79917857900022,O,2016-12-13,,,,2021-07-31T03:56:16,true,1,,1,,RUE,CHEVALEAU,27180,BERNIENVILLE,,,27057,,,,,,,,,,,,,,,,,,,2016-12-13,A,,,,,01.11Z,NAFRev2,N,1.025707,49.082461,0.94,housenumber,1 Rue Chevaleau 27180 Bernienville,27057_0005_00001,G,1 RUE CHEVALEAU,
811480078,00013,81148007800013,O,2012-07-06,,,,2015-05-20T10:45:20,true,1,,2,B,RUE,SOLLIER,27180,BERNIENVILLE,,,27057,,,,,,,,,,,,,,,,,,,2012-07-06,A,,,,,47.99A,NAFRev2,N,1.016925,49.081169,0.82,housenumber,2bis Rue Sollier 27180 Bernienville,27057_0045_00002_bis,G,2BIS RUE SOLLIER,
812095040,00018,81209504000018,O,2015-06-16,,,,2015-06-19T04:44:13,true,1,,5,,RUE,DE LA MAIRIE,27180,BERNIENVILLE,,,27057,,,,,,,,,,,,,,,,,,,2015-06-16,A,,,,,90.03B,NAFRev2,N,1.018356,49.082708,0.94,housenumber,5 Rue de la Mairie 27180 Bernienville,27057_0027_00005,G,5 RUE DE LA MAIRIE,
814436598,00019,81443659800019,O,2015-10-11,,,,2015-11-03T05:12:00,true,1,,5,,RUE,DE LA MAIRIE,27180,BERNIENVILLE,,,27057,,,,,,,,,,,,,,,,,,,2015-10-11,A,,,,,90.03A,NAFRev2,N,1.018356,49.082708,0.94,housenumber,5 Rue de la Mairie 27180 Bernienville,27057_0027_00005,G,5 RUE DE LA MAIRIE,
814826988,00010,81482698800010,O,2015-11-15,,,,2018-04-06T18:00:41,true,1,,2,B,RUE,DE LA MAIRIE,27180,BERNIENVILLE,,,27057,,,,,,,,,,,,,,,,,,,2015-11-15,A,,,,,64.20Z,NAFRev2,N,1.019108,49.082884,0.94,housenumber,2b Rue de la Mairie 27180 Bernienville,27057_0027_00002_b,G,2B RUE DE LA MAIRIE,
815153564,00019,81515356400019,O,2015-12-02,,,,2018-04-06T18:04:40,true,1,,2,B,RUE,DE LA MAIRIE,27180,BERNIENVILLE,,,27057,,,,,,,,,,,,,,,,,,,2015-12-02,A,,,,,68.20B,NAFRev2,N,1.019108,49.082884,0.94,housenumber,2b Rue de la Mairie 27180 Bernienville,27057_0027_00002_b,G,2B RUE DE LA MAIRIE,