siren,nic,siret,statutDiffusionEtablissement,dateCreationEtablissement,trancheEffectifsEtablissement,anneeEffectifsEtablissement,activitePrincipaleRegistreMetiersEtablissement,dateDernierTraitementEtablissement,etablissementSiege,nombrePeriodesEtablissement,complementAdresseEtablissement,numeroVoieEtablissement,indiceRepetitionEtablissement,typeVoieEtablissement,libelleVoieEtablissement,codePostalEtablissement,libelleCommuneEtablissement,libelleCommuneEtrangerEtablissement,distributionSpecialeEtablissement,codeCommuneEtablissement,codeCedexEtablissement,libelleCedexEtablissement,codePaysEtrangerEtablissement,libellePaysEtrangerEtablissement,complementAdresse2Etablissement,numeroVoie2Etablissement,indiceRepetition2Etablissement,typeVoie2Etablissement,libelleVoie2Etablissement,codePostal2Etablissement,libelleCommune2Etablissement,libelleCommuneEtranger2Etablissement,distributionSpeciale2Etablissement,codeCommune2Etablissement,codeCedex2Etablissement,libelleCedex2Etablissement,codePaysEtranger2Etablissement,libellePaysEtranger2Etablissement,dateDebut,etatAdministratifEtablissement,enseigne1Etablissement,enseigne2Etablissement,enseigne3Etablissement,denominationUsuelleEtablissement,activitePrincipaleEtablissement,nomenclatureActivitePrincipaleEtablissement,caractereEmployeurEtablissement,longitude,latitude,geo_score,geo_type,geo_adresse,geo_id,geo_ligne,geo_l4,geo_l5
045443660,00035,04544366000035,O,2001-05-11,NN,,,2021-02-16T15:30:45,true,3,RESIDENCE DU LAC,,,CHE,DE LA HUGUETTE,27700,LES TROIS LACS,,,27058,,,,,,,,,,,,,,,,,,,2008-01-01,A,,,,,68.20B,NAFRev2,N,1.339697,49.233405,0.64,street,Place de l’Eglise (Bernières-sur-Seine) 27700 Les Trois Lacs,27058_0023,G,PLACE DE L EGLISE,BERNIERES SUR SEINE
200063782,00011,20006378200011,O,2017-01-01,12,2018,,2021-05-12T15:00:11,false,2,,,,PL,DE LA LIBERATION,27940,LES TROIS LACS,,,27058,,,,,,,,,,,,,,,,,,,2021-01-01,F,MAIRIE,,,,84.11Z,NAFRev2,O,1.339697,49.233405,0.62,street,Place de l’Eglise (Bernières-sur-Seine) 27700 Les Trois Lacs,27058_0023,G,PLACE DE L EGLISE,BERNIERES SUR SEINE
200063782,00029,20006378200029,O,2017-01-01,,,,2021-04-02T08:54:25,true,2,,15,,RUE,DE LA ROSERAIE,27700,LES TROIS LACS,,,27058,,,,,,,,,,,,,,,,,,,2021-01-01,A,MAIRIE,,,,84.11Z,NAFRev2,O,1.33952,49.232856,0.58,housenumber,15 Rue de la Roseraie 27700 Les Trois Lacs,27058_0044_00015,G,15 RUE DE LA ROSERAIE,
200063782,00037,20006378200037,O,2017-01-01,,,,2021-05-12T15:00:11,false,2,,12,,RUE,GRAND MONT,27700,LES TROIS LACS,,,27058,,,,,,,,,,,,,,,,,,,2021-01-01,F,COMMUNE DELEGUEE DE TOSNY,,,,84.11Z,NAFRev2,N,1.339697,49.233405,0.52,street,Place de l’Eglise (Bernières-sur-Seine) 27700 Les Trois Lacs,27058_0023,G,PLACE DE L EGLISE,BERNIERES SUR SEINE
200063782,00045,20006378200045,O,2017-01-01,,,,2021-05-12T15:00:11,false,2,,,,PL,DE LA LIBERATION,27940,LES TROIS LACS,,,27058,,,,,,,,,,,,,,,,,,,2021-01-01,F,COMMUNE DELEGUEE DE VENABLES,,,,84.11Z,NAFRev2,N,1.339697,49.233405,0.62,street,Place de l’Eglise (Bernières-sur-Seine) 27700 Les Trois Lacs,27058_0023,G,PLACE DE L EGLISE,BERNIERES SUR SEINE
200063782,00052,20006378200052,O,2017-01-01,,,,2021-05-12T15:00:10,false,1,,,,PL,DE LA LIBERATION,27940,LES TROIS LACS,,,27058,,,,,,,,,,,,,,,,,,,2017-01-01,A,ECOLE PRIMAIRE PUBLIQUE,,,,85.20Z,NAFRev2,N,1.339697,49.233405,0.62,street,Place de l’Eglise (Bernières-sur-Seine) 27700 Les Trois Lacs,27058_0023,G,PLACE DE L EGLISE,BERNIERES SUR SEINE
200063782,00086,20006378200086,O,2017-01-01,,,,2021-05-12T15:00:11,false,1,MAIRIE,15,,PL,DE LA ROSERAIE,27700,LES TROIS LACS,,,27058,,,,,,,,,,,,,,,,,,,2017-01-01,A,REGIE DE TRANSPORT,,,,49.31Z,NAFRev2,N,1.33952,49.232856,0.47,housenumber,15 Rue de la Roseraie 27700 Les Trois Lacs,27058_0044_00015,G,15 RUE DE LA ROSERAIE,
200063782,00094,20006378200094,O,2021-01-01,,,,2021-02-16T15:30:45,false,1,BERNIERES SUR SEINE,15,,RUE,DE LA ROSERAIE,27700,LES TROIS LACS,,,27058,,,,,,,,,,,,,,,,,,,2021-01-01,F,MAIRIE,,,,84.11Z,NAFRev2,N,1.33952,49.232856,0.58,housenumber,15 Rue de la Roseraie 27700 Les Trois Lacs,27058_0044_00015,G,15 RUE DE LA ROSERAIE,
200063782,00102,20006378200102,O,2000-09-01,,,,2021-03-29T10:12:23,false,1,,1,,IMP,DE L'ECOLE,27700,LES TROIS LACS,,,27058,,,,,,,,,,,,,,,,,,,2000-09-01,A,ECOLE ELEMENTAIRE,,,,85.20Z,NAFRev2,N,1.340384,49.233822,0.7,housenumber,1 Place de l’Eglise (Bernières-sur-Seine) 27700 Les Trois Lacs,27058_0023_00001,G,1 PLACE DE L EGLISE,BERNIERES SUR SEINE
200063782,00110,20006378200110,O,1996-09-01,,,,2021-03-29T10:14:29,false,1,,12,,CHE,DE L'EPINE BLANCHE,27700,LES TROIS LACS,,,27058,,,,,,,,,,,,,,,,,,,1996-09-01,A,ECOLE MATERNELLE INTERCOMMUNALE,,,,85.10Z,NAFRev2,N,1.341962,49.22967,0.58,housenumber,12 Chemin de l’Epine Blanche 27700 Les Trois Lacs,27058_0025_00012,G,12 CHEMIN DE L EPINE BLANCHE,
200063857,00011,20006385700011,O,2017-01-01,,,,2021-05-12T15:00:10,true,1,MAIRIE,,,PL,DE LA LIBERATION,27940,LES TROIS LACS,,,27058,,,,,,,,,,,,,,,,,,,2017-01-01,A,,,,,88.99B,NAFRev2,N,1.339697,49.233405,0.62,street,Place de l’Eglise (Bernières-sur-Seine) 27700 Les Trois Lacs,27058_0023,G,PLACE DE L EGLISE,BERNIERES SUR SEINE
212700587,00018,21270058700018,O,1983-03-01,NN,,,2021-02-16T15:30:45,true,5,,15,,RUE,DE LA ROSERAIE,27700,LES TROIS LACS,,,27058,,,,,,,,,,,,,,,,,,,2017-01-01,F,MAIRIE,,,,84.11Z,NAFRev2,O,1.33952,49.232856,0.58,housenumber,15 Rue de la Roseraie 27700 Les Trois Lacs,27058_0044_00015,G,15 RUE DE LA ROSERAIE,
212700587,00034,21270058700034,O,1996-12-25,NN,,,2021-02-16T15:30:45,false,2,,15,,RUE,DE LA ROSERAIE,27700,LES TROIS LACS,,,27058,,,,,,,,,,,,,,,,,,,2006-02-21,F,SERVICE D'ASSAINISSEMENT,,,,90.0A,NAFRev1,N,1.33952,49.232856,0.58,housenumber,15 Rue de la Roseraie 27700 Les Trois Lacs,27058_0044_00015,G,15 RUE DE LA ROSERAIE,
212700587,00042,21270058700042,O,1996-09-01,NN,,,2021-02-16T15:30:45,false,3,,,,,,27700,LES TROIS LACS,,,27058,,,,,,,,,,,,,,,,,,,2008-01-01,F,ECOLE MATERNELLE PUBLIQUE INTERCOMMUNALE,,,,85.10Z,NAFRev2,N,,,0,,,,,,
212700587,00059,21270058700059,O,1999-12-25,NN,,,2021-02-16T15:30:45,false,3,MAIRIE,15,,RUE,DE LA ROSERAIE,27700,LES TROIS LACS,,,27058,,,,,,,,,,,,,,,,,,,2008-01-01,F,LOTISSEMENT COMMUNAL,,,,42.99Z,NAFRev2,N,1.33952,49.232856,0.58,housenumber,15 Rue de la Roseraie 27700 Les Trois Lacs,27058_0044_00015,G,15 RUE DE LA ROSERAIE,
212706477,00016,21270647700016,O,1983-03-01,NN,,,2021-02-16T15:30:45,true,5,,12,,RUE,GRAND MONT,27700,LES TROIS LACS,,,27058,,,,,,,,,,,,,,,,,,,2017-01-01,F,MAIRIE,,,,84.11Z,NAFRev2,O,1.339697,49.233405,0.52,street,Place de l’Eglise (Bernières-sur-Seine) 27700 Les Trois Lacs,27058_0023,G,PLACE DE L EGLISE,BERNIERES SUR SEINE
212706477,00024,21270647700024,O,1983-12-21,NN,,,2021-02-16T15:30:45,false,5,,1,,IMP,DE L ECOLE,27700,LES TROIS LACS,,,27058,,,,,,,,,,,,,,,,,,,2008-01-01,F,ECOLE ELEMENTAIRE PUBLIQUE,,,,85.20Z,NAFRev2,N,1.340384,49.233822,0.7,housenumber,1 Place de l’Eglise (Bernières-sur-Seine) 27700 Les Trois Lacs,27058_0023_00001,G,1 PLACE DE L EGLISE,BERNIERES SUR SEINE
212706766,00012,21270676600012,O,1983-03-01,NN,,,2021-05-12T15:00:11,true,5,,,,PL,DE LA LIBERATION,27940,LES TROIS LACS,,,27058,,,,,,,,,,,,,,,,,,,2017-01-01,F,MAIRIE,,,,84.11Z,NAFRev2,O,1.339697,49.233405,0.62,street,Place de l’Eglise (Bernières-sur-Seine) 27700 Les Trois Lacs,27058_0023,G,PLACE DE L EGLISE,BERNIERES SUR SEINE
212706766,00038,21270676600038,O,1983-12-21,NN,,,2021-05-12T15:00:11,false,4,,,,,,27940,LES TROIS LACS,,,27058,,,,,,,,,,,,,,,,,,,2017-01-01,F,ECOLE PRIMAIRE PUBLIQUE,,,,85.20Z,NAFRev2,N,,,0,,,,,,
212706766,00046,21270676600046,O,1996-12-25,NN,,,2021-05-12T15:00:11,false,3,,,,PL,DE LA LIBERATION,27940,LES TROIS LACS,,,27058,,,,,,,,,,,,,,,,,,,2017-01-01,F,REGIE DE TRANSPORT,,,,49.31Z,NAFRev2,N,1.339697,49.233405,0.62,street,Place de l’Eglise (Bernières-sur-Seine) 27700 Les Trois Lacs,27058_0023,G,PLACE DE L EGLISE,BERNIERES SUR SEINE
212706766,00053,21270676600053,O,2002-12-01,NN,,,2021-02-16T15:30:45,false,3,MAIRIE,,,PL,DE LA LIBERATION,27700,LES TROIS LACS,,,27058,,,,,,,,,,,,,,,,,,,2006-06-02,F,SERVICE D'ASSAINISSEMENT,,,,90.0A,NAFRev1,N,1.339697,49.233405,0.62,street,Place de l’Eglise (Bernières-sur-Seine) 27700 Les Trois Lacs,27058_0023,G,PLACE DE L EGLISE,BERNIERES SUR SEINE
252704077,00012,25270407700012,O,1996-03-18,NN,,,2021-02-16T15:30:45,false,6,MAIRIE,15,,RUE,DE LA ROSERAIE,27700,LES TROIS LACS,,,27058,,,,,,,,,,,,,,,,,,,2012-12-04,F,,,,,85.20Z,NAFRev2,O,1.33952,49.232856,0.58,housenumber,15 Rue de la Roseraie 27700 Les Trois Lacs,27058_0044_00015,G,15 RUE DE LA ROSERAIE,
252704077,00038,25270407700038,O,1996-09-01,NN,,,2021-02-16T15:30:45,false,2,,12,,CHE,DE L'EPINE BLANCHE,27700,LES TROIS LACS,,,27058,,,,,,,,,,,,,,,,,,,2017-07-04,F,ECOLE MATERNELLE INTERCOMMUNALE,,,,85.10Z,NAFRev2,N,1.341962,49.22967,0.58,housenumber,12 Chemin de l’Epine Blanche 27700 Les Trois Lacs,27058_0025_00012,G,12 CHEMIN DE L EPINE BLANCHE,
252704077,00046,25270407700046,O,2000-09-01,NN,,,2021-02-16T15:30:45,false,2,,1,,IMP,DE L'ECOLE,27700,LES TROIS LACS,,,27058,,,,,,,,,,,,,,,,,,,2017-07-04,F,ECOLE PRIMAIRE,,,,85.20Z,NAFRev2,N,1.340384,49.233822,0.7,housenumber,1 Place de l’Eglise (Bernières-sur-Seine) 27700 Les Trois Lacs,27058_0023_00001,G,1 PLACE DE L EGLISE,BERNIERES SUR SEINE
262702491,00016,26270249100016,O,1983-03-01,NN,,,2021-05-12T15:00:11,true,4,,,,PL,DE LA LIBERATION,27940,LES TROIS LACS,,,27058,,,,,,,,,,,,,,,,,,,2017-01-01,F,CDE,,,,88.99B,NAFRev2,N,1.339697,49.233405,0.62,street,Place de l’Eglise (Bernières-sur-Seine) 27700 Les Trois Lacs,27058_0023,G,PLACE DE L EGLISE,BERNIERES SUR SEINE
262705007,00017,26270500700017,O,1995-12-25,NN,,,2021-02-16T15:30:45,true,3,,15,,RUE,DE LA ROSERAIE,27700,LES TROIS LACS,,,27058,,,,,,,,,,,,,,,,,,,2016-01-01,F,CCAS,,,,88.99B,NAFRev2,N,1.33952,49.232856,0.58,housenumber,15 Rue de la Roseraie 27700 Les Trois Lacs,27058_0044_00015,G,15 RUE DE LA ROSERAIE,
262708621,00012,26270862100012,O,1995-12-25,,,,2021-05-12T15:00:11,true,3,MAIRIE,,,PL,DE LA LIBERATION,27940,LES TROIS LACS,,,27058,,,,,,,,,,,,,,,,,,,2017-01-01,F,CCAS,,,,88.99B,NAFRev2,N,1.339697,49.233405,0.62,street,Place de l’Eglise (Bernières-sur-Seine) 27700 Les Trois Lacs,27058_0023,G,PLACE DE L EGLISE,BERNIERES SUR SEINE
262708639,00014,26270863900014,O,1995-12-25,,,,2021-02-16T15:30:45,true,3,MAIRIE,12,,RUE,GRAND MONT,27700,LES TROIS LACS,,,27058,,,,,,,,,,,,,,,,,,,2016-01-01,F,CCAS,,,,88.99B,NAFRev2,N,1.339697,49.233405,0.52,street,Place de l’Eglise (Bernières-sur-Seine) 27700 Les Trois Lacs,27058_0023,G,PLACE DE L EGLISE,BERNIERES SUR SEINE
292700655,00015,29270065500015,O,1995-12-25,NN,,,2021-05-12T15:00:10,true,2,MAIRIE,,,PL,LIBERATION,27940,LES TROIS LACS,,,27058,,,,,,,,,,,,,,,,,,,2008-01-01,A,,,,,42.99Z,NAFRev2,N,1.339697,49.233405,0.62,street,Place de l’Eglise (Bernières-sur-Seine) 27700 Les Trois Lacs,27058_0023,G,PLACE DE L EGLISE,BERNIERES SUR SEINE
300023595,00014,30002359500014,O,1974-01-01,NN,,,2021-02-16T15:30:45,true,3,,,,LD,LES ANDELYS,27700,LES TROIS LACS,,,27058,,,,,,,,,,,,,,,,,,,2008-01-01,A,,,,,68.20B,NAFRev2,N,1.339697,49.233405,0.68,street,Place de l’Eglise (Bernières-sur-Seine) 27700 Les Trois Lacs,27058_0023,G,PLACE DE L EGLISE,BERNIERES SUR SEINE
302410329,00056,30241032900056,O,1992-12-31,NN,,,2021-02-16T15:30:45,false,4,,,,,,27700,LES TROIS LACS,,,27058,,,,,,,,,,,,,,,,,,,2019-12-19,F,,,,,01.11Z,NAFRev2,N,,,0,,,,,,
302576863,00013,30257686300013,O,1900-01-01,NN,,,2021-02-16T15:30:45,true,3,,,,,LOTDDU GRAND PARC,27700,LES TROIS LACS,,,27058,,,,,,,,,,,,,,,,,,,2005-10-05,F,,,,,80.4D,NAFRev1,N,,,0,,,,,,
306478561,00021,30647856100021,O,,,,,2021-02-16T15:30:45,true,1,,11,,RUE,DE LA ROSERAIE,27700,LES TROIS LACS,,,27058,,,,,,,,,,,,,,,,,,,1990-03-30,F,,,,,64.14,NAP,N,1.340514,49.233875,0.58,housenumber,11 Rue de la Roseraie 27700 Les Trois Lacs,27058_0044_00011,G,11 RUE DE LA ROSERAIE,
307714600,00029,30771460000029,O,2015-03-16,,,,2021-02-19T03:42:11,true,1,MAIRIE,12,,RUE,GRAND MONT,27700,LES TROIS LACS,,,27058,,,,,,,,,,,,,,,,,,,2015-03-16,A,,,,,93.12Z,NAFRev2,N,1.339697,49.233405,0.52,street,Place de l’Eglise (Bernières-sur-Seine) 27700 Les Trois Lacs,27058_0023,G,PLACE DE L EGLISE,BERNIERES SUR SEINE
310160270,00172,31016027000172,O,2009-03-31,11,2018,,2021-03-02T11:18:06,false,3,,,,,LE VILLAGE,27700,LES TROIS LACS,,,27058,,,,,,,,,,,,,,,,,,,2021-01-01,F,ALKERN LES ANDELYS,,,,23.61Z,NAFRev2,O,1.336934,49.198481,0.7,street,Chemin du Roule (Bernières-sur-Seine) 27700 Les Trois Lacs,27676_0108,G,CHEMIN DU ROULE,BERNIERES SUR SEINE
310841705,00034,31084170500034,O,2004-04-02,,,,2021-02-16T15:30:45,false,3,,92,,RUE,DES VIGNES,27700,LES TROIS LACS,,,27058,,,,,,,,,,,,,,,,,,,2004-12-31,F,,,,,51.1T,NAFRev1,N,1.339697,49.233405,0.59,street,Place de l’Eglise (Bernières-sur-Seine) 27700 Les Trois Lacs,27058_0023,G,PLACE DE L EGLISE,BERNIERES SUR SEINE
312696099,00026,31269609900026,O,1981-03-05,NN,,,2021-02-16T15:30:45,true,3,,,,RES,DU PARC,27700,LES TROIS LACS,,,27058,,,,,,,,,,,,,,,,,,,1996-12-25,F,,,,,35.1E,NAF1993,N,1.342693,49.23159,0.34,street,Rue du Parc 27700 Les Trois Lacs,27058_0039,G,RUE DU PARC,
314070251,00017,31407025100017,O,1978-01-01,NN,,,2021-05-12T15:00:10,true,4,,7,,RUE,DU FOND DU VAL,27940,LES TROIS LACS,,,27058,,,,,,,,,,,,,,,,,,,2008-01-01,A,,,,,01.42Z,NAFRev2,N,1.336934,49.198481,0.55,street,Chemin du Roule (Bernières-sur-Seine) 27700 Les Trois Lacs,27676_0108,G,CHEMIN DU ROULE,BERNIERES SUR SEINE
314660465,00019,31466046500019,O,1978-01-01,NN,,,2021-02-16T15:30:45,true,4,,28,,RUE,DE LA ROSERAIE,27700,LES TROIS LACS,,,27058,,,,,,,,,,,,,,,,,,,2006-06-30,F,,,,,45.4M,NAFRev1,O,1.339228,49.232432,0.58,housenumber,28 Rue de la Roseraie 27700 Les Trois Lacs,27058_0044_00028,G,28 RUE DE LA ROSERAIE,
316600766,00042,31660076600042,O,1997-03-01,NN,,,2021-05-12T15:00:10,true,4,FONTAINE LA VERTE,,,,,27940,LES TROIS LACS,,,27058,,,,,,,,,,,,,,,,,,,2008-01-01,A,,,,,71.11Z,NAFRev2,O,1.295687,49.183243,0.95,street,Fontaine la Verte 27940 Les Trois Lacs,27676_B018,D,FONTAINE LA VERTE,
316661743,00039,31666174300039,O,1991-06-01,NN,,,2021-02-16T15:30:45,false,4,FONTAINE LA VERTE,5,,RUE,DE LA CABOCHE,27700,LES TROIS LACS,,,27058,,,,,,,,,,,,,,,,,,,2014-10-01,F,,,,,81.30Z,NAFRev2,N,1.339646,49.23357,0.65,interpolation,5 Place de l’Eglise (Bernières-sur-Seine) 27700 Les Trois Lacs,,G,3 PLACE DE L EGLISE,BERNIERES SUR SEINE
317258077,00013,31725807700013,O,,,,,2021-02-16T15:30:45,true,1,,,,PL,DE L EGLISE,27700,LES TROIS LACS,,,27058,,,,,,,,,,,,,,,,,,,1984-12-25,F,,,,,67.01,NAP,N,1.339697,49.233405,0.89,street,Place de l’Eglise (Bernières-sur-Seine) 27700 Les Trois Lacs,27058_0023,G,PLACE DE L EGLISE,BERNIERES SUR SEINE
318460169,00036,31846016900036,O,1988-10-01,,,,2021-02-16T15:30:45,false,4,LA MARE SS VENABLES,32,B,RUE,DE LA MARE RUELLE HERMITE,27700,LES TROIS LACS,,,27058,,,,,,,,,,,,,,,,,,,1993-12-25,F,MAISON BLANDIN,,,,52.4Z,NAF1993,N,1.33505,49.230311,0.33,street,Route de la Mare 27700 Les Trois Lacs,27058_0032,G,ROUTE DE LA MARE,
318596814,00026,31859681400026,O,1990-07-02,,,,2021-02-16T15:30:45,false,4,,,,LD,LE MOULIN A VENT,27700,LES TROIS LACS,,,27058,,,,,,,,,,,,,,,,,,,1999-07-02,F,ASSOCIE SNC PILASTRE,,,,74.1J,NAF1993,N,1.336934,49.198481,0.61,street,Chemin du Roule (Bernières-sur-Seine) 27700 Les Trois Lacs,27676_0108,G,CHEMIN DU ROULE,BERNIERES SUR SEINE
319893954,00010,31989395400010,O,1980-09-01,NN,,4120BB,2021-02-16T15:30:45,true,6,,13,,RUE,DES ROSES,27700,LES TROIS LACS,,,27058,,,,,,,,,,,,,,,,,,,2016-03-17,F,,,,,43.99C,NAFRev2,O,1.33947,49.233107,0.66,housenumber,13 Place de l’Eglise (Bernières-sur-Seine) 27700 Les Trois Lacs,27058_0023_00013,G,13 PLACE DE L EGLISE,BERNIERES SUR SEINE
320187461,00035,32018746100035,O,1996-04-01,NN,,,2021-02-16T15:30:45,false,4,,83,,RTE,DE LOUVIERS,27700,LES TROIS LACS,,,27058,,,,,,,,,,,,,,,,,,,2005-04-24,F,,,,,92.3F,NAFRev1,N,1.339697,49.233405,0.61,street,Place de l’Eglise (Bernières-sur-Seine) 27700 Les Trois Lacs,27058_0023,G,PLACE DE L EGLISE,BERNIERES SUR SEINE
321181802,00018,32118180200018,O,1981-01-01,NN,,,2021-02-16T15:30:45,true,3,,5,,RUE,DES VIGNES,27700,LES TROIS LACS,,,27058,,,,,,,,,,,,,,,,,,,2007-12-31,F,,,,,01.4B,NAFRev1,N,1.339646,49.23357,0.64,interpolation,5 Place de l’Eglise (Bernières-sur-Seine) 27700 Les Trois Lacs,,G,3 PLACE DE L EGLISE,BERNIERES SUR SEINE
321524969,00037,32152496900037,O,1992-10-09,NN,,,2021-02-19T03:42:11,true,3,,,,,CHATEAU DE TOSNY,27700,LES TROIS LACS,,,27058,,,,,,,,,,,,,,,,,,,2008-01-01,A,,,,,68.32A,NAFRev2,N,1.363492,49.246053,0.35,street,Les Pres de Tosny 27700 Les Trois Lacs,27058_B010,G,LES PRES DE TOSNY,
321932840,00010,32193284000010,O,1981-04-25,NN,,,2021-02-16T15:30:45,true,3,,,,RUE,DES 9 ET 10 JUIN 1940,27700,LES TROIS LACS,,,27058,,,,,,,,,,,,,,,,,,,1992-12-25,F,,,,,81.21,NAP,N,1.297699,49.200449,0.54,street,Rue du 9 et 10 Juin 1940 27940 Les Trois Lacs,27676_0034,G,RUE DU 9 ET 10 JUIN 1940,
322577289,00018,32257728900018,O,1981-06-17,NN,,,2021-02-16T15:30:45,true,3,,,,,LA MARE SOUS VENABLES,27700,LES TROIS LACS,,,27058,,,,,,,,,,,,,,,,,,,1992-12-25,F,,,,,81.21,NAP,N,1.297858,49.210386,0.31,street,La Mare 27700 Les Trois Lacs,27676_mz67bf,G,LA MARE,
324625623,00016,32462562300016,O,1982-05-01,NN,,,2021-02-16T15:30:45,true,3,,18,,RUE,DES BLEUETS,27700,LES TROIS LACS,,,27058,,,,,,,,,,,,,,,,,,,2004-03-31,F,,,,,45.4F,NAFRev1,N,1.339697,49.233405,0.58,street,Place de l’Eglise (Bernières-sur-Seine) 27700 Les Trois Lacs,27058_0023,G,PLACE DE L EGLISE,BERNIERES SUR SEINE
324897966,00010,32489796600010,O,,NN,,,2021-02-16T15:30:45,true,1,,,,,LE VILLAGE,27700,LES TROIS LACS,,,27058,,,,,,,,,,,,,,,,,,,,F,,,,,55.10,NAP,N,1.336934,49.198481,0.7,street,Chemin du Roule (Bernières-sur-Seine) 27700 Les Trois Lacs,27676_0108,G,CHEMIN DU ROULE,BERNIERES SUR SEINE
325270155,00022,32527015500022,O,1991-09-16,NN,,,2021-02-16T15:30:45,false,4,LA MARE SOUS VENABLES,26,,RUE,DE LA GARE,27700,LES TROIS LACS,,,27058,,,,,,,,,,,,,,,,,,,2002-09-30,F,L'AUBERGE DU ROI RICHARD,,,,55.3A,NAF1993,N,1.339697,49.233405,0.66,street,Place de l’Eglise (Bernières-sur-Seine) 27700 Les Trois Lacs,27058_0023,G,PLACE DE L EGLISE,BERNIERES SUR SEINE
325273795,00030,32527379500030,O,1983-01-01,NN,,,2021-02-16T15:30:45,false,4,,,,,,27700,LES TROIS LACS,,,27058,,,,,,,,,,,,,,,,,,,2007-05-01,F,,,,,26.6E,NAFRev1,O,,,0,,,,,,
326146909,00014,32614690900014,O,1982-11-22,NN,,0162ZP,2021-02-16T15:30:45,true,5,,519,,RTE,DES ANDELYS,27700,LES TROIS LACS,,,27058,,,,,,,,,,,,,,,,,,,2015-04-01,A,L'OREE DU BOIS MARECHALERIE,,,,01.62Z,NAFRev2,N,1.339697,49.233405,0.55,street,Place de l’Eglise (Bernières-sur-Seine) 27700 Les Trois Lacs,27058_0023,G,PLACE DE L EGLISE,BERNIERES SUR SEINE
329072854,00014,32907285400014,O,1984-01-20,NN,,,2021-02-16T15:30:45,true,3,,49,,RUE,SAINT SULPICE,27700,LES TROIS LACS,,,27058,,,,,,,,,,,,,,,,,,,2008-01-01,A,,,,,01.61Z,NAFRev2,N,1.372657,49.218013,0.58,housenumber,49 Rue Saint-Sulpice 27700 Les Trois Lacs,27647_0075_00049,G,49 RUE SAINT SULPICE,
329697247,00032,32969724700032,O,2003-05-01,NN,,,2021-02-16T15:30:45,true,9,CAMPING LE VALEMBERT,13,,RTE,DE LORMAIS,27700,LES TROIS LACS,,,27058,,,,,,,,,,,,,,,,,,,2006-09-03,F,,,,,55.4B,NAFRev1,N,1.33947,49.233107,0.69,housenumber,13 Place de l’Eglise (Bernières-sur-Seine) 27700 Les Trois Lacs,27058_0023_00013,G,13 PLACE DE L EGLISE,BERNIERES SUR SEINE
330293051,00034,33029305100034,O,2000-05-11,NN,,,2021-02-16T15:30:45,true,3,,,,,LA HAGUETTE,27700,LES TROIS LACS,,,27058,,,,,,,,,,,,,,,,,,,2008-01-01,A,,,,,68.20B,NAFRev2,N,1.339697,49.233405,0.66,street,Place de l’Eglise (Bernières-sur-Seine) 27700 Les Trois Lacs,27058_0023,G,PLACE DE L EGLISE,BERNIERES SUR SEINE
331919332,00014,33191933200014,O,1985-02-06,NN,,,2021-02-16T15:30:45,true,4,,14,,RUE,DE LA ROSERAIE,27700,LES TROIS LACS,,,27058,,,,,,,,,,,,,,,,,,,2011-08-01,F,,,,,46.73A,NAFRev2,N,1.340256,49.233487,0.58,housenumber,14 Rue de la Roseraie 27700 Les Trois Lacs,27058_0044_00014,G,14 RUE DE LA ROSERAIE,
332052109,00011,33205210900011,O,1985-04-01,NN,,,2021-02-16T15:30:45,true,3,,6,,RUE,DU CHATEAU GAILLARD,27700,LES TROIS LACS,,,27058,,,,,,,,,,,,,,,,,,,2004-03-30,F,,,,,45.4J,NAFRev1,N,1.341878,49.233358,0.61,housenumber,6 Rue du Chateau Gaillard 27700 Les Trois Lacs,27058_0010_00006,G,6 RUE DU CHATEAU GAILLARD,
332471317,00021,33247131700021,O,2010-09-06,,,,2021-02-16T15:30:45,true,2,,18,,RUE,DES BLEUETS,27700,LES TROIS LACS,,,27058,,,,,,,,,,,,,,,,,,,2011-03-20,F,,,,,46.19B,NAFRev2,N,1.339697,49.233405,0.58,street,Place de l’Eglise (Bernières-sur-Seine) 27700 Les Trois Lacs,27058_0023,G,PLACE DE L EGLISE,BERNIERES SUR SEINE
332529643,00030,33252964300030,O,,NN,,,2021-02-16T15:30:45,true,1,,5,,RUE,DES TILLEULS,27700,LES TROIS LACS,,,27058,,,,,,,,,,,,,,,,,,,1995-12-31,F,,,,,29.2K,NAF1993,N,1.341835,49.233749,0.55,housenumber,5 Rue des Tilleuls 27700 Les Trois Lacs,27058_0050_00005,G,5 RUE DES TILLEULS,
332774173,00030,33277417300030,O,2004-01-01,11,2018,,2021-03-18T08:43:32,true,3,,2,,RUE,DES ECOLIERS,27700,LES TROIS LACS,,,27058,,,,,,,,,,,,,,,,,,,2008-01-01,A,,,,,42.22Z,NAFRev2,O,1.347443,49.227793,0.48,housenumber,2 Route des Ecoliers 27700 Les Trois Lacs,27058_0019_00002,G,2 ROUTE DES ECOLIERS,
333347318,00011,33334731800011,O,1985-08-22,,,,2021-02-16T15:30:45,true,4,,,,,,27700,LES TROIS LACS,,,27058,,,,,,,,,,,,,,,,,,,2008-02-17,F,,,,,03.22Z,NAFRev2,N,,,0,,,,,,
334265873,00037,33426587300037,O,2004-10-05,NN,,1392ZC,2021-02-23T10:53:29,true,3,L'ERABLIERE,34,,RUE,DE LA CARRIERE,27700,LES TROIS LACS,,,27058,,,,,,,,,,,,,,,,,,,2008-01-01,A,,,,,13.92Z,NAFRev2,N,1.339697,49.233405,0.62,street,Place de l’Eglise (Bernières-sur-Seine) 27700 Les Trois Lacs,27058_0023,G,PLACE DE L EGLISE,BERNIERES SUR SEINE
334511912,00019,33451191200019,O,1985-07-01,NN,,,2021-02-16T15:30:45,true,1,,5,,RUE,DU PARC,27700,LES TROIS LACS,,,27058,,,,,,,,,,,,,,,,,,,2000-12-31,F,,,,,61.2Z,NAF1993,N,1.342676,49.231462,0.48,housenumber,5 Rue du Parc 27700 Les Trois Lacs,27058_0039_00005,G,5 RUE DU PARC,
335142568,00039,33514256800039,O,2000-01-01,NN,,,2021-02-16T15:30:45,false,4,RESIDENCE DU LAC,,,,LES HAGUETTES,27700,LES TROIS LACS,,,27058,,,,,,,,,,,,,,,,,,,2008-06-14,F,,,,,68.20B,NAFRev2,N,1.339697,49.233405,0.66,street,Place de l’Eglise (Bernières-sur-Seine) 27700 Les Trois Lacs,27058_0023,G,PLACE DE L EGLISE,BERNIERES SUR SEINE
339063679,00023,33906367900023,O,2010-01-04,,,,2021-02-16T15:30:45,true,2,LA MARE SOUS VENABLES,49,,RUE,DE LA MARE,27700,LES TROIS LACS,,,27058,,,,,,,,,,,,,,,,,,,2015-09-30,F,,,,,43.33Z,NAFRev2,N,1.33505,49.230311,0.38,street,Route de la Mare 27700 Les Trois Lacs,27058_0032,G,ROUTE DE LA MARE,
339220014,00031,33922001400031,O,1992-10-09,,,,2021-02-16T15:30:45,false,3,,,,,CHATEAU DE TOSNY,27700,LES TROIS LACS,,,27058,,,,,,,,,,,,,,,,,,,1996-02-28,F,,,,,70.1D,NAF1993,N,1.363492,49.246053,0.35,street,Les Pres de Tosny 27700 Les Trois Lacs,27058_B010,G,LES PRES DE TOSNY,
342309242,00044,34230924200044,O,2001-07-02,NN,,,2021-02-16T15:30:45,false,3,,82,,CHE,DU BOIS DES DAMES,27700,LES TROIS LACS,,,27058,,,,,,,,,,,,,,,,,,,2007-06-01,F,,,,,45.4C,NAFRev1,N,1.336934,49.198481,0.57,street,Chemin du Roule (Bernières-sur-Seine) 27700 Les Trois Lacs,27676_0108,G,CHEMIN DU ROULE,BERNIERES SUR SEINE
348079823,00020,34807982300020,O,2000-01-23,,,,2021-02-16T15:30:45,false,5,,83,,CHE,DU HALAGE,27700,LES TROIS LACS,,,27058,,,,,,,,,,,,,,,,,,,2017-10-15,F,LES SAVEURS DU RUCHER,,,,01.49Z,NAFRev2,N,1.336934,49.198481,0.64,street,Chemin du Roule (Bernières-sur-Seine) 27700 Les Trois Lacs,27676_0108,G,CHEMIN DU ROULE,BERNIERES SUR SEINE
348244658,00012,34824465800012,O,1988-07-05,NN,,,2021-02-16T15:30:45,true,3,,44,,RUE,ST SULPICE,27700,LES TROIS LACS,,,27058,,,,,,,,,,,,,,,,,,,2008-01-01,A,,,,,68.20A,NAFRev2,N,1.339697,49.233405,0.58,street,Place de l’Eglise (Bernières-sur-Seine) 27700 Les Trois Lacs,27058_0023,G,PLACE DE L EGLISE,BERNIERES SUR SEINE