siren,nic,siret,statutDiffusionEtablissement,dateCreationEtablissement,trancheEffectifsEtablissement,anneeEffectifsEtablissement,activitePrincipaleRegistreMetiersEtablissement,dateDernierTraitementEtablissement,etablissementSiege,nombrePeriodesEtablissement,complementAdresseEtablissement,numeroVoieEtablissement,indiceRepetitionEtablissement,typeVoieEtablissement,libelleVoieEtablissement,codePostalEtablissement,libelleCommuneEtablissement,libelleCommuneEtrangerEtablissement,distributionSpecialeEtablissement,codeCommuneEtablissement,codeCedexEtablissement,libelleCedexEtablissement,codePaysEtrangerEtablissement,libellePaysEtrangerEtablissement,complementAdresse2Etablissement,numeroVoie2Etablissement,indiceRepetition2Etablissement,typeVoie2Etablissement,libelleVoie2Etablissement,codePostal2Etablissement,libelleCommune2Etablissement,libelleCommuneEtranger2Etablissement,distributionSpeciale2Etablissement,codeCommune2Etablissement,codeCedex2Etablissement,libelleCedex2Etablissement,codePaysEtranger2Etablissement,libellePaysEtranger2Etablissement,dateDebut,etatAdministratifEtablissement,enseigne1Etablissement,enseigne2Etablissement,enseigne3Etablissement,denominationUsuelleEtablissement,activitePrincipaleEtablissement,nomenclatureActivitePrincipaleEtablissement,caractereEmployeurEtablissement,longitude,latitude,geo_score,geo_type,geo_adresse,geo_id,geo_ligne,geo_l4,geo_l5
212902506,00014,21290250600014,O,1983-03-01,03,2018,,2020-08-25T10:16:35,true,4,,11,,RUE,DU CENTRE BOURG,29270,SAINT-HERNIN,,,29250,,,,,,,,,,,,,,,,,,,2008-01-01,A,MAIRIE,,,,84.11Z,NAFRev2,O,-3.636032,48.217514,0.95,housenumber,11 Rue du Centre Bourg 29270 Saint-Hernin,29250_0015_00011,G,11 RUE DU CENTRE BOURG,
212902506,00030,21290250600030,O,1983-12-21,02,2018,,2020-08-25T10:16:35,false,3,LE BOURG,3,,RUE,DE L'ECOLE,29270,SAINT-HERNIN,,,29250,,,,,,,,,,,,,,,,,,,2008-01-01,A,ECOLE PRIMAIRE PUBLIQUE,,,,85.20Z,NAFRev2,N,-3.639088,48.216921,0.79,housenumber,3 Route de l’Ecole 29270 Saint-Hernin,29250_0028_00003,G,3 ROUTE DE L ECOLE,
212902506,00048,21290250600048,O,2004-01-01,NN,,,2019-11-14T14:00:29,false,3,MAIRIE,11,,RUE,DU CENTRE BOURG,29270,SAINT-HERNIN,,,29250,,,,,,,,,,,,,,,,,,,2008-01-01,A,SERVICE D'ASSAINISSEMENT,,,,37.00Z,NAFRev2,N,-3.636032,48.217514,0.95,housenumber,11 Rue du Centre Bourg 29270 Saint-Hernin,29250_0015_00011,G,11 RUE DU CENTRE BOURG,
212902506,00055,21290250600055,O,2005-01-01,,,,2019-11-14T14:00:29,false,3,,11,,RUE,DU CENTRE,29270,SAINT-HERNIN,,,29250,,,,,,,,,,,,,,,,,,,2010-04-16,F,LOTISSEMENT,,,,42.99Z,NAFRev2,N,-3.636032,48.217514,0.94,housenumber,11 Rue du Centre Bourg 29270 Saint-Hernin,29250_0015_00011,G,11 RUE DU CENTRE BOURG,
262903479,00018,26290347900018,O,1987-01-23,NN,,,2020-05-25T11:32:46,true,4,MAIRIE,,,,BOURG,29270,SAINT-HERNIN,,,29250,,,,,,,,,,,,,,,,,,,2020-01-01,F,CCAS,,,,88.99B,NAFRev2,N,-3.6348,48.21828,0.92,street,Rue du Centre Bourg 29270 Saint-Hernin,29250_0015,G,RUE DU CENTRE BOURG,
303735682,00013,30373568200013,O,,NN,,,2019-11-14T14:00:29,true,1,,,,,BOURG,29270,SAINT-HERNIN,,,29250,,,,,,,,,,,,,,,,,,,,F,,,,,67.04,NAP,N,-3.6348,48.21828,0.92,street,Rue du Centre Bourg 29270 Saint-Hernin,29250_0015,G,RUE DU CENTRE BOURG,
303977151,00016,30397715100016,O,1900-01-01,,,,2019-11-14T14:00:29,true,4,,,,,BOURG,29270,SAINT-HERNIN,,,29250,,,,,,,,,,,,,,,,,,,1993-12-25,F,,,,,01.4A,NAF1993,N,-3.6348,48.21828,0.92,street,Rue du Centre Bourg 29270 Saint-Hernin,29250_0015,G,RUE DU CENTRE BOURG,
307229054,00019,30722905400019,O,1977-01-01,NN,,,2019-11-14T14:00:29,true,5,,,,,BOURG,29270,SAINT-HERNIN,,,29250,,,,,,,,,,,,,,,,,,,2008-01-01,F,,,,,68.20B,NAFRev2,N,-3.6348,48.21828,0.92,street,Rue du Centre Bourg 29270 Saint-Hernin,29250_0015,G,RUE DU CENTRE BOURG,
307643544,00017,30764354400017,O,,NN,,,2019-11-14T14:00:29,true,1,,,,LD,KEREIN,29270,SAINT-HERNIN,,,29250,,,,,,,,,,,,,,,,,,,2000-12-31,F,,,,,01.2A,NAF1993,N,-3.594637,48.202303,0.65,street,Carrière Kermanac’H 29270 Saint-Hernin,29250_B144,G,CARRIERE KERMANAC H,
309772481,00011,30977248100011,O,,NN,,,2019-11-14T14:00:29,true,1,,,,,KERBOURG,29270,SAINT-HERNIN,,,29250,,,,,,,,,,,,,,,,,,,1987-08-31,F,,,,,57.02,NAP,N,-3.613214,48.196693,0.92,street,Lieu Dit Kerbourg 29270 Saint-Hernin,29250_xp98sr,G,LIEU DIT KERBOURG,
309994408,00016,30999440800016,O,1977-01-01,NN,,,2019-11-14T14:00:29,true,1,,,,RUE,DU CIMETIERE,29270,SAINT-HERNIN,,,29250,,,,,,,,,,,,,,,,,,,1998-03-31,F,,,,,45.4A,NAF1993,N,-3.6348,48.21828,0.52,street,Rue du Centre Bourg 29270 Saint-Hernin,29250_0015,G,RUE DU CENTRE BOURG,
310162367,00018,31016236700018,O,,NN,,,2019-11-14T14:00:29,true,1,,,,,KERBOURG,29270,SAINT-HERNIN,,,29250,,,,,,,,,,,,,,,,,,,1987-08-31,F,,,,,57.02,NAP,N,-3.613214,48.196693,0.92,street,Lieu Dit Kerbourg 29270 Saint-Hernin,29250_xp98sr,G,LIEU DIT KERBOURG,
310203914,00026,31020391400026,O,,NN,,,2019-11-14T14:00:29,true,1,,,,,PENGORBEL,29270,SAINT-HERNIN,,,29250,,,,,,,,,,,,,,,,,,,1996-06-30,F,,,,,01.2G,NAF1993,N,-3.614246,48.216535,0.91,street,Lieu Dit Pengorbel Vihan 29270 Saint-Hernin,29250_C239,G,LIEU DIT PENGORBEL VIHAN,
311044911,00023,31104491100023,O,,,,,2019-11-14T14:00:29,true,1,,,,LD,GOARANVEC,29270,SAINT-HERNIN,,,29250,,,,,,,,,,,,,,,,,,,1992-01-01,F,,,,,45.2V,NAF1993,N,-3.4989308,48.1872533,0.89,poi.stream,Ruisseau de Goaranvec Plévin,https://osm.org/relation/6428618,G,,
311139794,00011,31113979400011,O,1977-01-01,,,,2019-11-14T14:00:29,true,4,,,,,COAT QUEVERAN,29270,SAINT-HERNIN,,,29250,,,,,,,,,,,,,,,,,,,2006-10-31,F,,,,,60.2M,NAFRev1,N,-3.641881,48.208259,0.55,street,Koad Queverand 29270 Saint-Hernin,29250_B389,G,KOAD QUEVERAND,
311288294,00029,31128829400029,O,,NN,,,2019-11-14T14:00:29,true,1,,,,LD,KERMANACK,29270,SAINT-HERNIN,,,29250,,,,,,,,,,,,,,,,,,,1987-12-31,F,,,,,15.03,NAP,N,-3.598008,48.20493,0.74,street,Lieu Dit Kermanac H 29270 Saint-Hernin,29250_B359,G,LIEU DIT KERMANAC H,
311341283,00019,31134128300019,O,,,,,2019-11-14T14:00:29,true,1,,,,,GARE DE MOTREFF,29270,SAINT-HERNIN,,,29250,,,,,,,,,,,,,,,,,,,1984-12-25,F,,,,,55.60,NAP,N,-3.570318,48.191534,0.95,street,Gare de Motreff 29270 Saint-Hernin,29250_B174,G,GARE DE MOTREFF,
312267172,00012,31226717200012,O,,NN,,,2019-11-14T14:00:29,true,1,,,,,KERBELLEC,29270,SAINT-HERNIN,,,29250,,,,,,,,,,,,,,,,,,,,F,,,,,67.04,NAP,N,-3.600204,48.201269,0.92,street,Lieu Dit Kerbellec 29270 Saint-Hernin,29250_9gsmoy,G,LIEU DIT KERBELLEC,
312552797,00010,31255279700010,O,,,,,2019-11-14T14:00:29,true,1,,,,,BOURG,29270,SAINT-HERNIN,,,29250,,,,,,,,,,,,,,,,,,,1984-12-25,F,,,,,67.04,NAP,N,-3.6348,48.21828,0.92,street,Rue du Centre Bourg 29270 Saint-Hernin,29250_0015,G,RUE DU CENTRE BOURG,
313196008,00012,31319600800012,O,1978-01-01,01,2018,,2020-08-25T10:25:39,true,8,,,,,SAINT FRANCOIS,29270,SAINT-HERNIN,,,29250,,,,,,,,,,,,,,,,,,,2017-01-29,A,,,,,68.20B,NAFRev2,O,-3.652068,48.214237,0.93,street,Lieu Dit Saint Francois 29270 Saint-Hernin,29250_C547,G,LIEU DIT SAINT FRANCOIS,
313502171,00025,31350217100025,O,1999-08-01,NN,,,2019-11-14T14:00:29,true,4,,,,,LE HUN,29270,SAINT-HERNIN,,,29250,,,,,,,,,,,,,,,,,,,2008-09-15,F,,,,,01.41Z,NAFRev2,N,-0.3621733,43.2945395,0.75,poi.restaurant,Le Hunt (Restaurant) Pau,https://osm.org/node/5007877590,G,,
313612285,00012,31361228500012,O,,NN,,,2019-11-14T14:00:29,true,1,,,,,PENPRAT,29270,SAINT-HERNIN,,,29250,,,,,,,,,,,,,,,,,,,1997-05-14,F,,,,,70.2C,NAF1993,N,-3.601408,48.195716,0.57,street,Lieu Dit Penfrat 29270 Saint-Hernin,29250_oa1kyy,G,LIEU DIT PENFRAT,
313957961,00045,31395796100045,O,1982-02-01,NN,,,2019-11-14T14:00:29,false,7,,,,,COADIC,29270,SAINT-HERNIN,,,29250,,,,,,,,,,,,,,,,,,,2008-01-01,F,,,,,55.20Z,NAFRev2,N,-3.609345,48.184157,0.51,street,Lieu Dit Coadou 29270 Saint-Hernin,29250_l9u3hk,G,LIEU DIT COADOU,
314375684,00011,31437568400011,O,,NN,,,2019-11-14T14:00:29,true,1,,,,LD,SAINT FRANCOIS,29270,SAINT-HERNIN,,,29250,,,,,,,,,,,,,,,,,,,1981-06-04,F,,,,,84.14,NAP,N,-3.652068,48.214237,0.93,street,Lieu Dit Saint Francois 29270 Saint-Hernin,29250_C547,G,LIEU DIT SAINT FRANCOIS,
314589193,00023,31458919300023,O,2016-01-01,,,,2019-11-14T14:00:29,true,1,,,,,LE KENVEZ,29270,SAINT-HERNIN,,,29250,,,,,,,,,,,,,,,,,,,2016-01-01,A,,,,,01.11Z,NAFRev2,N,-3.614653,48.205282,0.68,street,Kenvez 29270 Saint-Hernin,29250_7v74qx,G,KENVEZ,
318164571,00016,31816457100016,O,1980-01-01,NN,,,2019-11-14T14:00:29,true,5,,,,RTE,DE GOURIN,29270,SAINT-HERNIN,,,29250,,,,,,,,,,,,,,,,,,,2013-12-11,F,,,,,68.20B,NAFRev2,N,-3.634271,48.215466,0.43,street,Route de la Montagne 29270 Saint-Hernin,29250_0041,G,ROUTE DE LA MONTAGNE,
323248807,00014,32324880700014,O,,NN,,,2019-11-14T14:00:29,true,1,,,,RTE,DE SPEZET,29270,SAINT-HERNIN,,,29250,,,,,,,,,,,,,,,,,,,,F,,,,,00.10,NAP,N,-3.639948,48.217035,0.42,street,Route de l’Ecole 29270 Saint-Hernin,29250_0028,G,ROUTE DE L ECOLE,
324748649,00013,32474864900013,O,,,,,2019-11-14T14:00:29,true,1,,,,,PORT DE CARHAIX,29270,SAINT-HERNIN,,,29250,,,,,,,,,,,,,,,,,,,1984-12-25,F,,,,,49.04,NAP,N,-3.603707,48.240395,0.95,street,Port de Carhaix 29270 Saint-Hernin,29250_C245,G,PORT DE CARHAIX,
324837541,00014,32483754100014,O,,,,,2019-11-14T14:00:29,true,1,,,,,COADAU,29270,SAINT-HERNIN,,,29250,,,,,,,,,,,,,,,,,,,1984-12-25,F,,,,,01.00,NAP,N,-3.609345,48.184157,0.51,street,Lieu Dit Coadou 29270 Saint-Hernin,29250_l9u3hk,G,LIEU DIT COADOU,
328125745,00013,32812574500013,O,,NN,,,2019-11-14T14:00:29,true,1,,,,LD,SAINT SAUVEUR,29270,SAINT-HERNIN,,,29250,,,,,,,,,,,,,,,,,,,1994-09-30,F,,,,,45.4J,NAF1993,N,-3.596792,48.221684,0.94,street,Saint Sauveur 29270 Saint-Hernin,29250_C601,G,SAINT SAUVEUR,
328547393,00046,32854739300046,O,,NN,,,2019-11-14T14:00:29,true,1,,,,,BONNE CHANCE,29270,SAINT-HERNIN,,,29250,,,,,,,,,,,,,,,,,,,1993-05-31,F,,,,,52.7D,NAF1993,N,-3.593091,48.220751,0.93,street,Lieu Dit Bonne Chance 29270 Saint-Hernin,29250_B118,G,LIEU DIT BONNE CHANCE,
329220206,00018,32922020600018,O,1984-02-01,NN,,,2019-11-14T14:00:29,true,5,MAIRIE,,,,BOURG,29270,SAINT-HERNIN,,,29250,,,,,,,,,,,,,,,,,,,2008-01-01,F,,,,,88.10A,NAFRev2,O,-3.6348,48.21828,0.92,street,Rue du Centre Bourg 29270 Saint-Hernin,29250_0015,G,RUE DU CENTRE BOURG,
329961783,00019,32996178300019,O,1984-05-02,NN,,3109BA,2019-11-14T14:00:29,true,4,,,,,TRAONBARS VIHAN,29270,SAINT-HERNIN,,,29250,,,,,,,,,,,,,,,,,,,2015-12-31,F,,,,,31.09B,NAFRev2,N,-3.647123,48.21942,0.65,street,Lieu Dit Trombars Vihan 29270 Saint-Hernin,29250_C571,G,LIEU DIT TROMBARS VIHAN,
331017814,00020,33101781400020,O,1984-09-01,NN,,,2019-11-14T14:00:29,true,4,,17,,RUE,D ES LANDES,29270,SAINT-HERNIN,,,29250,,,,,,,,,,,,,,,,,,,2009-12-31,F,,,,,01.47Z,NAFRev2,N,-3.631036,48.218277,0.81,housenumber,17 Rue des Landes 29270 Saint-Hernin,29250_0035_00017,G,17 RUE DES LANDES,
334250578,00039,33425057800039,O,2017-04-01,,,,2021-07-23T19:54:37,true,2,,,,,KEREAN,29270,SAINT-HERNIN,,,29250,,,,,,,,,,,,,,,,,,,2020-12-31,F,,,,,93.29Z,NAFRev2,N,-3.594629,48.230634,0.8,street,Kerrean 29270 Saint-Hernin,29250_zxb5ft,G,KERREAN,
338136823,00014,33813682300014,O,1986-05-25,NN,,,2019-11-14T14:00:29,true,4,,,,,PONT DE KERVRAN,29270,SAINT-HERNIN,,,29250,,,,,,,,,,,,,,,,,,,2000-08-04,F,,,,,70.2C,NAF1993,N,-3.577287,48.196128,0.64,street,Pont Kervranneg 29270 Saint-Hernin,29250_C241,G,PONT KERVRANNEG,
339838229,00013,33983822900013,O,1986-06-01,NN,,,2019-11-14T14:00:29,true,1,,,,,PONT KERVRAN,29270,SAINT-HERNIN,,,29250,,,,,,,,,,,,,,,,,,,2000-12-31,F,,,,,70.2C,NAF1993,N,-3.577287,48.196128,0.87,street,Pont Kervranneg 29270 Saint-Hernin,29250_C241,G,PONT KERVRANNEG,
340378850,00010,34037885000010,O,,NN,,,2019-11-14T14:00:29,true,1,,,,,LE RELAIS,29270,SAINT-HERNIN,,,29250,,,,,,,,,,,,,,,,,,,1988-06-30,F,,,,,67.01,NAP,N,1.9162548,46.1385006,0.9,poi.bar,Le Relais (Bar) Sainte-Feyre,https://osm.org/way/280551494,G,,
340491026,00019,34049102600019,O,,,,,2019-11-14T14:00:29,true,1,,,,,BELLEVUE,29270,SAINT-HERNIN,,,29250,,,,,,,,,,,,,,,,,,,1997-04-01,F,,,,,45.2V,NAF1993,N,-3.605024,48.190603,0.92,street,Lieu Dit Bellevue 29270 Saint-Hernin,29250_ebho90,G,LIEU DIT BELLEVUE,
340491117,00016,34049111700016,O,1987-03-02,NN,,4399CZ,2020-05-05T03:40:28,true,8,,,,,BELLEVUE,29270,SAINT-HERNIN,,,29250,,,,,,,,,,,,,,,,,,,2020-04-01,F,,,,,43.99C,NAFRev2,N,-3.605024,48.190603,0.92,street,Lieu Dit Bellevue 29270 Saint-Hernin,29250_ebho90,G,LIEU DIT BELLEVUE,
340491216,00016,34049121600016,O,,,,,2019-11-14T14:00:29,true,1,,,,,BELLEVUE,29270,SAINT-HERNIN,,,29250,,,,,,,,,,,,,,,,,,,1997-04-01,F,,,,,45.2V,NAF1993,N,-3.605024,48.190603,0.92,street,Lieu Dit Bellevue 29270 Saint-Hernin,29250_ebho90,G,LIEU DIT BELLEVUE,
340918010,00018,34091801000018,O,1987-04-11,NN,,,2019-11-14T14:00:29,true,4,,,,,COAT GOARANVEC,29270,SAINT-HERNIN,,,29250,,,,,,,,,,,,,,,,,,,2017-07-09,F,,,,,45.32Z,NAFRev2,N,-3.58333,48.216622,0.82,street,Coat Goaranveg 29270 Saint-Hernin,29250_B384,G,COAT GOARANVEG,
342112588,00021,34211258800021,O,2007-04-17,,,,2021-02-23T10:57:41,true,4,,19,,,ROZ LAON,29270,SAINT-HERNIN,,,29250,,,,,,,,,,,,,,,,,,,2012-05-02,A,,,,,93.19Z,NAFRev2,N,,,0,,,,,,
342490083,00017,34249008300017,O,,,,,2019-11-14T14:00:29,true,1,,,,,ECOLE PUBLIQUE,29270,SAINT-HERNIN,,,29250,,,,,,,,,,,,,,,,,,,1988-09-30,F,,,,,67.02,NAP,N,-3.639948,48.217035,0.39,street,Route de l’Ecole 29270 Saint-Hernin,29250_0028,G,ROUTE DE L ECOLE,
344322243,00017,34432224300017,O,,,,,2019-11-14T14:00:29,true,1,,,,,KERBELLEC,29270,SAINT-HERNIN,,,29250,,,,,,,,,,,,,,,,,,,1992-12-31,F,,,,,55.4B,NAF1993,N,-3.600204,48.201269,0.92,street,Lieu Dit Kerbellec 29270 Saint-Hernin,29250_9gsmoy,G,LIEU DIT KERBELLEC,
344873021,00010,34487302100010,O,1988-05-17,NN,,9602AB,2019-11-14T14:00:29,false,5,,,,RTE,DE SPEZET,29270,SAINT-HERNIN,,,29250,,,,,,,,,,,,,,,,,,,2016-03-01,F,,,,,96.02A,NAFRev2,O,-3.639948,48.217035,0.42,street,Route de l’Ecole 29270 Saint-Hernin,29250_0028,G,ROUTE DE L ECOLE,
344900709,00017,34490070900017,O,,NN,,,2019-11-14T14:00:29,true,1,,,,,MAGOARDY,29270,SAINT-HERNIN,,,29250,,,,,,,,,,,,,,,,,,,1988-06-30,F,,,,,69.12,NAP,N,-3.611897,48.211442,0.92,street,Lieu Dit Magoardy 29270 Saint-Hernin,29250_c49ej0,G,LIEU DIT MAGOARDY,
345117717,00016,34511771700016,O,1988-06-01,NN,,,2019-11-14T14:00:29,true,5,,,,,SAINT FRANCOIS,29270,SAINT-HERNIN,,,29250,,,,,,,,,,,,,,,,,,,2010-12-31,A,,,,,01.11Z,NAFRev2,O,-3.652068,48.214237,0.93,street,Lieu Dit Saint Francois 29270 Saint-Hernin,29250_C547,G,LIEU DIT SAINT FRANCOIS,
348094673,00012,34809467300012,O,1988-02-01,NN,,,2020-09-16T03:36:35,true,4,,,,,KULZUBIC,29270,SAINT-HERNIN,,,29250,,,,,,,,,,,,,,,,,,,2010-12-31,F,,,,,01.41Z,NAFRev2,N,,,0,,,,,,
349701425,00010,34970142500010,O,1989-01-01,NN,,,2019-11-14T14:00:29,true,5,,,,,COADIC,29270,SAINT-HERNIN,,,29250,,,,,,,,,,,,,,,,,,,2010-12-31,A,,,,,01.24Z,NAFRev2,O,-3.609345,48.184157,0.51,street,Lieu Dit Coadou 29270 Saint-Hernin,29250_l9u3hk,G,LIEU DIT COADOU,
350706982,00021,35070698200021,O,2006-12-02,,,,2019-11-14T14:00:29,true,3,,,,,KERBELLEC,29270,SAINT-HERNIN,,,29250,,,,,,,,,,,,,,,,,,,2008-01-01,F,,,,,01.47Z,NAFRev2,N,-3.600204,48.201269,0.92,street,Lieu Dit Kerbellec 29270 Saint-Hernin,29250_9gsmoy,G,LIEU DIT KERBELLEC,
350795969,00012,35079596900012,O,,NN,,,2019-11-14T14:00:29,true,1,,,,RTE,DE GOURIN,29270,SAINT-HERNIN,,,29250,,,,,,,,,,,,,,,,,,,1996-01-31,F,,,,,55.1A,NAF1993,O,-3.634271,48.215466,0.43,street,Route de la Montagne 29270 Saint-Hernin,29250_0041,G,ROUTE DE LA MONTAGNE,
350824660,00038,35082466000038,O,2007-02-26,,,4391BZ,2021-02-23T11:03:31,true,4,,,,LD,POULIGUERIN,29270,SAINT-HERNIN,,,29250,,,,,,,,,,,,,,,,,,,2011-07-01,A,,,,,43.91B,NAFRev2,N,-3.622437,48.216325,0.73,street,Pouligerin 29270 Saint-Hernin,29250_8rj98j,G,POULIGERIN,
351861752,00019,35186175200019,O,1989-04-30,NN,,,2021-02-23T11:04:24,true,4,,,,,LANNIC ROUZ,29270,SAINT-HERNIN,,,29250,,,,,,,,,,,,,,,,,,,2012-12-31,A,,,,,01.41Z,NAFRev2,O,-3.613676,48.226762,0.71,street,Lannig Rouz 29270 Saint-Hernin,29250_B429,G,LANNIG ROUZ,
352004501,00024,35200450100024,O,1998-02-03,,,,2019-11-14T14:00:29,false,3,,,,,MAGOARDY,29270,SAINT-HERNIN,,,29250,,,,,,,,,,,,,,,,,,,1998-12-25,F,,,,,93.0D,NAF1993,N,-3.611897,48.211442,0.92,street,Lieu Dit Magoardy 29270 Saint-Hernin,29250_c49ej0,G,LIEU DIT MAGOARDY,
352004501,00032,35200450100032,O,1998-02-16,,,,2019-11-14T14:00:29,false,3,,,,,COAT VRAN,29270,SAINT-HERNIN,,,29250,,,,,,,,,,,,,,,,,,,1999-03-31,F,,,,,93.0D,NAF1993,N,-3.651926,48.209613,0.47,street,Koad Vran 29270 Saint-Hernin,29250_B406,G,KOAD VRAN,
352812762,00016,35281276200016,O,,NN,,,2019-11-14T14:00:29,true,1,,,,,FERME DE LA BRUYERE,29270,SAINT-HERNIN,,,29250,,,,,,,,,,,,,,,,,,,1997-06-28,F,,,,,17.2A,NAF1993,O,5.872079,47.4144431,0.85,poi.heath,Pelouse de la Ferme des Combes (Bruyère) Bucey-lès-Gy,https://osm.org/way/115774897,G,,
353013469,00013,35301346900013,O,1989-04-01,NN,,,2019-11-14T14:00:29,true,3,BOURG,1,,RUE,DE L'ECOLE,29270,SAINT-HERNIN,,,29250,,,,,,,,,,,,,,,,,,,2008-01-01,A,,,,,01.41Z,NAFRev2,N,-3.6373,48.217068,0.79,housenumber,1 Route de l’Ecole 29270 Saint-Hernin,29250_0028_00001,G,1 ROUTE DE L ECOLE,
378134399,00013,37813439900013,O,,NN,,,2019-11-14T14:00:29,true,1,,,,,KEREAN,29270,SAINT-HERNIN,,,29250,,,,,,,,,,,,,,,,,,,1992-03-31,F,,,,,60.2M,NAF1993,N,-3.594629,48.230634,0.8,street,Kerrean 29270 Saint-Hernin,29250_zxb5ft,G,KERREAN,
378338487,00010,37833848700010,O,1990-05-15,NN,,,2019-11-14T14:00:29,true,4,,,,LD,COAT QUEVERAN,29270,SAINT-HERNIN,,,29250,,,,,,,,,,,,,,,,,,,1996-12-25,F,,,,,52.4C,NAF1993,N,-3.641881,48.208259,0.55,street,Koad Queverand 29270 Saint-Hernin,29250_B389,G,KOAD QUEVERAND,
383618022,00057,38361802200057,O,2017-04-01,01,2018,,2021-02-23T11:11:49,true,2,,,,,BONNE CHANCE,29270,SAINT-HERNIN,,,29250,,,,,,,,,,,,,,,,,,,2018-07-02,A,,,,TRANSPORT CORFDIR,49.41A,NAFRev2,O,-3.593091,48.220751,0.93,street,Lieu Dit Bonne Chance 29270 Saint-Hernin,29250_B118,G,LIEU DIT BONNE CHANCE,
388718652,00018,38871865200018,O,1992-09-01,NN,,,2019-11-14T14:00:29,true,3,,,,,KERYVON,29270,SAINT-HERNIN,,,29250,,,,,,,,,,,,,,,,,,,2007-04-30,F,,,,,01.1A,NAFRev1,N,-3.609442,48.215765,0.92,street,Lieu Dit Keryvon 29270 Saint-Hernin,29250_ujdco7,G,LIEU DIT KERYVON,
389164062,00017,38916406200017,O,1992-09-21,NN,,,2019-11-14T14:00:29,false,4,,,,,PONT DE KERVRAN,29270,SAINT-HERNIN,,,29250,,,,,,,,,,,,,,,,,,,1994-12-25,F,,,,,55.3A,NAF1993,O,-3.577287,48.196128,0.64,street,Pont Kervranneg 29270 Saint-Hernin,29250_C241,G,PONT KERVRANNEG,
389178104,00045,38917810400045,O,2007-03-03,,,,2019-11-14T14:00:29,false,2,,,,,KEREAN,29270,SAINT-HERNIN,,,29250,,,,,,,,,,,,,,,,,,,2008-01-01,F,,,,,86.90D,NAFRev2,N,-3.594629,48.230634,0.8,street,Kerrean 29270 Saint-Hernin,29250_zxb5ft,G,KERREAN,
389600925,00017,38960092500017,O,,NN,,,2019-11-14T14:00:29,true,1,,,,,LOCH AR BIG,29270,SAINT-HERNIN,,,29250,,,,,,,,,,,,,,,,,,,1994-06-30,F,,,,,93.0D,NAF1993,N,-3.643946,48.217043,0.93,street,Route de Loch-Ar-Big 29270 Saint-Hernin,29250_0038,G,ROUTE DE LOCH AR BIG,
391046158,00013,39104615800013,O,1993-05-01,01,2018,4399CZ,2020-08-25T10:26:01,true,4,KERGOAT,,,,PORT CARHAIX,29270,SAINT-HERNIN,,,29250,,,,,,,,,,,,,,,,,,,2008-01-01,A,,,,,43.99C,NAFRev2,O,-3.603707,48.240395,0.87,street,Port de Carhaix 29270 Saint-Hernin,29250_C245,G,PORT DE CARHAIX,
391569720,00025,39156972000025,O,1995-01-23,NN,,,2019-11-14T14:00:29,true,3,,,,,ROSMEL,29270,SAINT-HERNIN,,,29250,,,,,,,,,,,,,,,,,,,2005-12-25,F,,,,,70.2B,NAFRev1,N,-3.628342,48.2072,0.94,street,Rosmel 29270 Saint-Hernin,29250_khss2r,G,ROSMEL,
392521589,00011,39252158900011,O,1993-09-21,,,,2019-11-14T14:00:29,true,3,,,,,PENPRAT,29270,SAINT-HERNIN,,,29250,,,,,,,,,,,,,,,,,,,1995-01-11,F,,,,,15.8B,NAF1993,N,-3.601408,48.195716,0.57,street,Lieu Dit Penfrat 29270 Saint-Hernin,29250_oa1kyy,G,LIEU DIT PENFRAT,
397702804,00014,39770280400014,O,1994-06-15,NN,,,2019-11-14T14:00:29,true,3,,,,,MOGOARDY,29270,SAINT-HERNIN,,,29250,,,,,,,,,,,,,,,,,,,2008-01-01,A,,,,,68.20B,NAFRev2,N,-3.611897,48.211442,0.62,street,Lieu Dit Magoardy 29270 Saint-Hernin,29250_c49ej0,G,LIEU DIT MAGOARDY,
398788273,00017,39878827300017,O,1980-01-01,NN,,,2019-11-14T14:00:29,true,1,,,,,BOURG,29270,SAINT-HERNIN,,,29250,,,,,,,,,,,,,,,,,,,1998-01-01,F,,,,,66.0E,NAF1993,N,-3.6348,48.21828,0.92,street,Rue du Centre Bourg 29270 Saint-Hernin,29250_0015,G,RUE DU CENTRE BOURG,
399458595,00010,39945859500010,O,1994-12-23,NN,,,2019-11-14T14:00:29,true,3,,,,,LE BOURG,29270,SAINT-HERNIN,,,29250,,,,,,,,,,,,,,,,,,,2008-01-01,A,,,,,68.20B,NAFRev2,N,-3.6348,48.21828,0.72,street,Rue du Centre Bourg 29270 Saint-Hernin,29250_0015,G,RUE DU CENTRE BOURG,
399515808,00018,39951580800018,O,1992-07-01,NN,,,2019-11-14T14:00:29,true,3,,,,,LE BOURG,29270,SAINT-HERNIN,,,29250,,,,,,,,,,,,,,,,,,,2008-01-01,A,,,,,93.29Z,NAFRev2,N,-3.6348,48.21828,0.72,street,Rue du Centre Bourg 29270 Saint-Hernin,29250_0015,G,RUE DU CENTRE BOURG,
399832427,00013,39983242700013,O,1995-01-01,01,2018,,2020-10-27T13:31:16,false,5,,,,,BOURG,29270,SAINT-HERNIN,,,29250,,,,,,,,,,,,,,,,,,,2020-01-01,F,,,,,01.41Z,NAFRev2,O,-3.6348,48.21828,0.92,street,Rue du Centre Bourg 29270 Saint-Hernin,29250_0015,G,RUE DU CENTRE BOURG,
400286662,00012,40028666200012,O,1900-01-01,NN,,,2019-11-14T14:00:29,false,3,,,,,KERBOURG,29270,SAINT-HERNIN,,,29250,,,,,,,,,,,,,,,,,,,1995-12-25,F,,,,,60.2E,NAF1993,N,-3.613214,48.196693,0.92,street,Lieu Dit Kerbourg 29270 Saint-Hernin,29250_xp98sr,G,LIEU DIT KERBOURG,
400331971,00012,40033197100012,O,1995-02-21,NN,,,2019-11-14T14:00:29,true,3,,,,,PONT DE KERVRAN,29270,SAINT-HERNIN,,,29250,,,,,,,,,,,,,,,,,,,1995-12-25,F,,,,,55.3A,NAF1993,O,-3.577287,48.196128,0.64,street,Pont Kervranneg 29270 Saint-Hernin,29250_C241,G,PONT KERVRANNEG,
400517967,00024,40051796700024,O,2002-02-15,NN,,,2019-11-14T14:00:29,false,3,,,,,LA GARE DE MOTREFF,29270,SAINT-HERNIN,,,29250,,,,,,,,,,,,,,,,,,,2006-07-01,F,,,,,92.3A,NAFRev1,N,-3.570318,48.191534,0.82,street,Gare de Motreff 29270 Saint-Hernin,29250_B174,G,GARE DE MOTREFF,
400971412,00012,40097141200012,O,1995-04-27,NN,,,2019-11-14T14:00:29,true,3,,,,,LE BOURG,29270,SAINT-HERNIN,,,29250,,,,,,,,,,,,,,,,,,,2008-01-01,A,,,,,68.20B,NAFRev2,N,-3.6348,48.21828,0.72,street,Rue du Centre Bourg 29270 Saint-Hernin,29250_0015,G,RUE DU CENTRE BOURG,
402870950,00019,40287095000019,O,1995-10-15,NN,,,2019-11-14T14:00:29,false,3,,,,,KERVEZ,29270,SAINT-HERNIN,,,29250,,,,,,,,,,,,,,,,,,,2002-10-15,F,,,,,01.2G,NAF1993,N,-3.604393,48.235591,0.92,street,Lieu Dit Kervez 29270 Saint-Hernin,29250_4sik44,G,LIEU DIT KERVEZ,
402904874,00029,40290487400029,O,1997-02-03,NN,,,2019-11-14T14:00:29,true,1,,,,,BELLEVUE,29270,SAINT-HERNIN,,,29250,,,,,,,,,,,,,,,,,,,2002-04-30,F,,,,,51.1R,NAF1993,N,-3.605024,48.190603,0.92,street,Lieu Dit Bellevue 29270 Saint-Hernin,29250_ebho90,G,LIEU DIT BELLEVUE,
403475429,00011,40347542900011,O,1996-01-01,NN,,,2019-11-14T14:00:29,true,4,,,,,LEIGNTUDEC,29270,SAINT-HERNIN,,,29250,,,,,,,,,,,,,,,,,,,2000-01-12,F,,,,,01.2A,NAF1993,N,,,0,,,,,,
403653439,00014,40365343900014,O,1996-02-01,NN,,,2019-11-14T14:00:29,true,4,,2,,RTE,DE LA MONTAGNE,29270,SAINT-HERNIN,,,29250,,,,,,,,,,,,,,,,,,,1997-12-25,F,,,,,55.3A,NAF1993,O,-3.634271,48.215466,0.77,street,Route de la Montagne 29270 Saint-Hernin,29250_0041,G,ROUTE DE LA MONTAGNE,
404128431,00016,40412843100016,O,1900-01-01,NN,,,2019-11-14T14:00:29,false,3,,,,,LE YUN,29270,SAINT-HERNIN,,,29250,,,,,,,,,,,,,,,,,,,1996-12-25,F,,,,,85.1G,NAF1993,N,-3.611292,48.190878,0.52,street,Lieu Dit Ar Yun 29270 Saint-Hernin,29250_B105,G,LIEU DIT AR YUN,
404496408,00018,40449640800018,O,1996-01-01,NN,,,2019-11-14T14:00:29,false,4,,,,,COADIC,29270,SAINT-HERNIN,,,29250,,,,,,,,,,,,,,,,,,,1999-02-01,F,,,,,51.2C,NAF1993,O,-3.609345,48.184157,0.51,street,Lieu Dit Coadou 29270 Saint-Hernin,29250_l9u3hk,G,LIEU DIT COADOU,
404747727,00018,40474772700018,O,1994-01-01,NN,,,2019-11-14T14:00:29,true,3,,,,,RUMOAL,29270,SAINT-HERNIN,,,29250,,,,,,,,,,,,,,,,,,,2002-02-28,F,,,,,01.3Z,NAF1993,N,-3.589915,48.200391,0.91,street,Lieu Dit Rumoal 29270 Saint-Hernin,29250_4medjt,G,LIEU DIT RUMOAL,