siren,nic,siret,statutDiffusionEtablissement,dateCreationEtablissement,trancheEffectifsEtablissement,anneeEffectifsEtablissement,activitePrincipaleRegistreMetiersEtablissement,dateDernierTraitementEtablissement,etablissementSiege,nombrePeriodesEtablissement,complementAdresseEtablissement,numeroVoieEtablissement,indiceRepetitionEtablissement,typeVoieEtablissement,libelleVoieEtablissement,codePostalEtablissement,libelleCommuneEtablissement,libelleCommuneEtrangerEtablissement,distributionSpecialeEtablissement,codeCommuneEtablissement,codeCedexEtablissement,libelleCedexEtablissement,codePaysEtrangerEtablissement,libellePaysEtrangerEtablissement,complementAdresse2Etablissement,numeroVoie2Etablissement,indiceRepetition2Etablissement,typeVoie2Etablissement,libelleVoie2Etablissement,codePostal2Etablissement,libelleCommune2Etablissement,libelleCommuneEtranger2Etablissement,distributionSpeciale2Etablissement,codeCommune2Etablissement,codeCedex2Etablissement,libelleCedex2Etablissement,codePaysEtranger2Etablissement,libellePaysEtranger2Etablissement,dateDebut,etatAdministratifEtablissement,enseigne1Etablissement,enseigne2Etablissement,enseigne3Etablissement,denominationUsuelleEtablissement,activitePrincipaleEtablissement,nomenclatureActivitePrincipaleEtablissement,caractereEmployeurEtablissement,longitude,latitude,geo_score,geo_type,geo_adresse,geo_id,geo_ligne,geo_l4,geo_l5
213302573,00018,21330257300018,O,1983-03-01,01,2018,,2020-08-25T10:16:49,true,4,,,,,,33420,LUGAIGNAC,,,33257,,,,,,,,,,,,,,,,,,,2008-01-01,A,MAIRIE,,,,84.11Z,NAFRev2,O,,,0,,,,,,
263302549,00013,26330254900013,O,1983-03-01,NN,,,2010-06-26T03:08:35,true,3,,,,,,33420,LUGAIGNAC,,,33257,,,,,,,,,,,,,,,,,,,2008-01-01,A,CCAS,,,,88.99B,NAFRev2,N,,,0,,,,,,
300679370,00019,30067937000019,O,1900-01-01,,,,2012-07-28T11:43:45,true,4,,,,,,33420,LUGAIGNAC,,,33257,,,,,,,,,,,,,,,,,,,2010-12-25,F,,,,,01.21Z,NAFRev2,N,,,0,,,,,,
303864193,00048,30386419300048,O,1999-04-01,NN,,,2014-09-11T11:36:18,false,5,,7,,,LIRET,33420,LUGAIGNAC,,,33257,,,,,,,,,,,,,,,,,,,2014-09-10,F,,,,,47.81Z,NAFRev2,N,-0.195278,44.822784,0.8,housenumber,7 Moulin du Liret 33420 Lugaignac,33257_b070_00007,G,7 MOULIN DU LIRET,
310382379,00017,31038237900017,O,1900-01-01,NN,,,2019-10-16T04:00:01,true,7,,,,,LE BOURG,33420,LUGAIGNAC,,,33257,,,,,,,,,,,,,,,,,,,2019-10-15,F,,,,,43.12A,NAFRev2,N,-0.193355,44.815641,0.94,street,Le Bourg 33420 Lugaignac,33257_g4albc,G,LE BOURG,
311824809,00025,31182480900025,O,1981-01-15,01,2018,4332AA,2020-08-25T10:25:05,true,4,,,,,RABUT,33420,LUGAIGNAC,,,33257,,,,,,,,,,,,,,,,,,,2008-01-01,A,,,,,43.32A,NAFRev2,O,-0.192252,44.801567,0.91,street,Lieu Dit le Rabut 33420 Lugaignac,33257_natt7q,G,LIEU DIT LE RABUT,
312715741,00020,31271574100020,O,1991-01-02,NN,,9529ZF,2019-04-10T03:53:45,true,7,,,,LD,LE PEREY,33420,LUGAIGNAC,,,33257,,,,,,,,,,,,,,,,,,,2019-02-01,A,,,,HILARION SERVICES,95.29Z,NAFRev2,N,-0.18153,44.813359,0.62,street,Lieu Dit au Perey 33420 Lugaignac,33257_ypnbwv,G,LIEU DIT AU PEREY,
314049412,00013,31404941200013,O,1900-01-01,,,,2007-01-18T09:13:32,true,3,,,,LD,LAUBAREDE,33420,LUGAIGNAC,,,33257,,,,,,,,,,,,,,,,,,,1994-06-09,F,,,,,01.1G,NAF1993,N,-0.190166,44.809829,0.75,street,Lieu Dit l’Aubarede 33420 Lugaignac,33257_btdsa7,G,LIEU DIT L AUBAREDE,
314798182,00015,31479818200015,O,1979-01-01,NN,,,2013-05-27T03:03:59,true,3,,,,,BRUSSAC,33420,LUGAIGNAC,,,33257,,,,,,,,,,,,,,,,,,,2008-01-01,A,,,,,01.61Z,NAFRev2,N,-0.201168,44.816355,0.92,street,Lieu Dit Brussac 33420 Lugaignac,33257_x7vbrt,G,LIEU DIT BRUSSAC,
314798182,00023,31479818200023,O,1987-12-31,NN,,,2014-06-14T00:41:10,false,4,,,,,BRUSSAC,33420,LUGAIGNAC,,,33257,,,,,,,,,,,,,,,,,,,2012-12-31,F,,,,,01.21Z,NAFRev2,N,-0.201168,44.816355,0.92,street,Lieu Dit Brussac 33420 Lugaignac,33257_x7vbrt,G,LIEU DIT BRUSSAC,
321840175,00012,32184017500012,O,1981-05-01,NN,,,2008-04-05T00:21:46,true,3,,,,,,33420,LUGAIGNAC,,,33257,,,,,,,,,,,,,,,,,,,2008-01-01,A,,,,,68.20B,NAFRev2,N,,,0,,,,,,
323819078,00011,32381907800011,O,,NN,,,,true,1,,,,,COIFFARD,33420,LUGAIGNAC,,,33257,,,,,,,,,,,,,,,,,,,2001-02-16,F,,,,,79.06,NAP,N,-0.191673,44.817407,0.92,street,Lieu Dit Coiffard 33420 Lugaignac,33257_8jhsx9,G,LIEU DIT COIFFARD,
324054402,00023,32405440200023,O,,NN,,,,true,1,,,,,CLOS DE LA CLOTTE,33420,LUGAIGNAC,,,33257,,,,,,,,,,,,,,,,,,,2003-04-04,F,,,,,70.2C,NAFRev1,N,-0.196318,44.81247,0.64,street,Lieu Dit la Clotte 33420 Lugaignac,33257_ra5fi3,G,LIEU DIT LA CLOTTE,
324423722,00010,32442372200010,O,1900-01-01,,,,2011-04-28T00:21:12,false,3,,,,LD,JEAN GOT,33420,LUGAIGNAC,,,33257,,,,,,,,,,,,,,,,,,,1983-12-25,F,,,,,62.41,NAP,N,-0.194733,44.816859,0.94,street,Jean Got 33420 Lugaignac,33257_B050,G,JEAN GOT,
324573534,00033,32457353400033,O,1993-09-01,NN,,,2020-02-07T08:34:21,true,4,,,,,LA BELLIE,33420,LUGAIGNAC,,,33257,,,,,,,,,,,,,,,,,,,2019-12-30,F,,,,,90.03B,NAFRev2,N,-0.193439,44.813029,0.65,street,Lieu Dit Labellie 33420 Lugaignac,33257_9xzcry,G,LIEU DIT LABELLIE,
325459816,00030,32545981600030,O,2004-04-01,NN,,,2013-01-14T11:14:25,true,4,,5,,,JEAN LARC,33420,LUGAIGNAC,,,33257,,,,,,,,,,,,,,,,,,,2012-10-01,F,,,,,85.59A,NAFRev2,N,-0.197375,44.812662,0.86,housenumber,5 Lieu Dit Jean Larc 33420 Lugaignac,33257_gqg1vm_00005,G,5 LIEU DIT JEAN LARC,
326044021,00029,32604402100029,O,1993-02-14,NN,,,2008-01-04T19:13:04,true,3,,10,,,JEAN LARC,33420,LUGAIGNAC,,,33257,,,,,,,,,,,,,,,,,,,2008-01-01,A,,,,,71.11Z,NAFRev2,N,-0.196255,44.809932,0.93,housenumber,10 Jean Larc Sud 33420 Lugaignac,33257_b052_00010,G,10 JEAN LARC SUD,
329782668,00035,32978266800035,O,2006-10-26,,,,2010-02-18T05:13:35,true,3,,1,,LD,CANOYE,33420,LUGAIGNAC,,,33257,,,,,,,,,,,,,,,,,,,2009-12-31,F,C R CONSEILS,,,,71.12B,NAFRev2,N,-0.193381,44.811817,0.82,housenumber,1 Lieu Dit Canoye 33420 Lugaignac,33257_9sm7t7_00001,G,1 LIEU DIT CANOYE,
332172402,00015,33217240200015,O,1985-01-01,NN,,4331ZB,2016-04-26T03:11:20,true,5,,,,LD,CASTERA,33420,LUGAIGNAC,,,33257,,,,,,,,,,,,,,,,,,,2015-02-28,F,,,,,43.31Z,NAFRev2,O,-0.193362,44.811017,0.92,street,Lieu Dit Castera 33420 Lugaignac,33257_45ewq6,G,LIEU DIT CASTERA,
339171332,00010,33917133200010,O,,,,,,true,1,,,,,,33420,LUGAIGNAC,,,33257,,,,,,,,,,,,,,,,,,,1993-03-02,F,,,,,45.2V,NAF1993,N,,,0,,,,,,
341156065,00011,34115606500011,O,1987-05-01,NN,,,2020-12-05T03:49:02,true,4,,,,,,33420,LUGAIGNAC,,,33257,,,,,,,,,,,,,,,,,,,2020-10-30,F,,,,,01.21Z,NAFRev2,N,,,0,,,,,,
341406551,00018,34140655100018,O,1987-06-10,02,2018,,2020-08-25T10:39:57,true,4,,,,LD,LAUBAREDE,33420,LUGAIGNAC,,,33257,,,,,,,,,,,,,,,,,,,2013-12-31,A,,,,,01.21Z,NAFRev2,O,-0.190166,44.809829,0.75,street,Lieu Dit l’Aubarede 33420 Lugaignac,33257_btdsa7,G,LIEU DIT L AUBAREDE,
342498219,00019,34249821900019,O,1987-10-05,NN,,,2009-06-27T05:30:45,true,4,,,,LD,AU BOURG,33420,LUGAIGNAC,,,33257,,,,,,,,,,,,,,,,,,,2007-12-31,F,,,,,45.3E,NAFRev1,O,-0.193355,44.815641,0.62,street,Le Bourg 33420 Lugaignac,33257_g4albc,G,LE BOURG,
348182684,00012,34818268400012,O,1988-01-01,NN,,,2008-01-04T22:48:59,true,3,,,,LD,JEAN L ARC,33420,LUGAIGNAC,,,33257,,,,,,,,,,,,,,,,,,,2008-01-01,A,,,,,68.20B,NAFRev2,N,-0.197405,44.812456,0.68,street,Lieu Dit Jean Larc 33420 Lugaignac,33257_gqg1vm,G,LIEU DIT JEAN LARC,
348325168,00014,34832516800014,O,1988-10-15,NN,,,2008-04-26T10:57:44,false,4,,1,,,PEREY,33420,LUGAIGNAC,,,33257,,,,,,,,,,,,,,,,,,,1991-12-25,F,,,,,01.4A,NAF1993,N,-0.180536,44.813847,0.8,housenumber,1 Lieu Dit au Perey 33420 Lugaignac,33257_ypnbwv_00001,G,1 LIEU DIT AU PEREY,
348325168,00022,34832516800022,O,1991-09-04,NN,,,2006-10-27T03:41:27,true,3,,1,,,PEREY,33420,LUGAIGNAC,,,33257,,,,,,,,,,,,,,,,,,,2006-05-31,F,,,,,01.1A,NAFRev1,N,-0.180536,44.813847,0.8,housenumber,1 Lieu Dit au Perey 33420 Lugaignac,33257_ypnbwv_00001,G,1 LIEU DIT AU PEREY,
348325168,00030,34832516800030,O,2006-05-31,,,,2006-10-27T03:41:27,false,1,,,,,PEREY,33420,LUGAIGNAC,,,33257,,,,,,,,,,,,,,,,,,,2006-05-31,F,,,,,01.4A,NAFRev1,N,-0.18153,44.813359,0.91,street,Lieu Dit au Perey 33420 Lugaignac,33257_ypnbwv,G,LIEU DIT AU PEREY,
353811714,00024,35381171400024,O,1993-01-02,NN,,,2008-12-31T19:52:56,true,5,,1,,,LE LIRET,33420,LUGAIGNAC,,,33257,,,,,,,,,,,,,,,,,,,2008-12-31,F,,,,,46.38A,NAFRev2,N,-0.193541,44.824891,0.6,housenumber,1 Moulin du Liret 33420 Lugaignac,33257_b070_00001,G,1 MOULIN DU LIRET,
377776554,00018,37777655400018,O,1990-04-01,NN,,,2011-05-03T09:54:19,false,4,,,,,,33420,LUGAIGNAC,,,33257,,,,,,,,,,,,,,,,,,,2011-04-30,F,,,,,01.21Z,NAFRev2,N,,,0,,,,,,
377776554,00026,37777655400026,O,2009-07-20,,,,2013-06-14T19:28:10,true,2,,4,,,FONTADAS,33420,LUGAIGNAC,,,33257,,,,,,,,,,,,,,,,,,,2013-05-31,F,BAYLET T.P,,,,43.12A,NAFRev2,N,-0.193568,44.81018,0.84,housenumber,4 Lieu Dit Fontadas Nord 33420 Lugaignac,33257_b037_00004,G,4 LIEU DIT FONTADAS NORD,
378142319,00011,37814231900011,O,1990-01-01,NN,,,,true,1,,,,,,33420,LUGAIGNAC,,,33257,,,,,,,,,,,,,,,,,,,2002-03-27,F,,,,,01.1G,NAF1993,N,,,0,,,,,,
379216252,00021,37921625200021,O,2000-10-01,NN,,,2006-11-25T11:25:34,true,1,,13,,,JEAN LARE,33420,LUGAIGNAC,,,33257,,,,,,,,,,,,,,,,,,,2002-06-27,F,,,,,74.1J,NAF1993,N,-0.197314,44.81091,0.72,housenumber,13 Lieu Dit Jean Larc 33420 Lugaignac,33257_gqg1vm_00013,G,13 LIEU DIT JEAN LARC,
379932627,00019,37993262700019,O,1990-07-01,NN,,,2009-06-27T06:21:29,false,4,,,,LD,MAZEROLLES,33420,LUGAIGNAC,,,33257,,,,,,,,,,,,,,,,,,,2001-04-18,F,,,,,01.1G,NAF1993,N,0.281948,43.3522905,0.9,poi.townhall,(Hôtel de ville) Mazerolles,https://osm.org/way/286037639,G,,
380823633,00025,38082363300025,O,1991-12-31,NN,,,2008-01-04T21:48:03,false,3,,4,,,,33420,LUGAIGNAC,,,33257,,,,,,,,,,,,,,,,,,,2008-01-01,A,,,,,01.21Z,NAFRev2,N,,,0,,,,,,
381226794,00042,38122679400042,O,1998-01-01,NN,,,2018-04-27T03:59:11,true,6,,,,,AUX BARRAILS,33420,LUGAIGNAC,,,33257,,,,,,,,,,,,,,,,,,,2017-08-31,F,,,,,46.34Z,NAFRev2,N,-0.199661,44.819194,0.92,street,Lieu Dit aux Barrails 33420 Lugaignac,33257_hiogvd,G,LIEU DIT AUX BARRAILS,
383800687,00014,38380068700014,O,1991-11-01,01,2018,,2020-08-25T10:20:50,true,4,,,,,,33420,LUGAIGNAC,,,33257,,,,,,,,,,,,,,,,,,,2012-12-31,A,,,,,01.21Z,NAFRev2,O,,,0,,,,,,
387750599,00012,38775059900012,O,1992-01-01,NN,,,2008-01-04T22:58:47,true,3,,,,LD,BRUSSAC,33420,LUGAIGNAC,,,33257,,,,,,,,,,,,,,,,,,,2008-01-01,A,,,,,01.21Z,NAFRev2,N,-0.201168,44.816355,0.92,street,Lieu Dit Brussac 33420 Lugaignac,33257_x7vbrt,G,LIEU DIT BRUSSAC,
390221745,00024,39022174500024,O,1998-01-20,NN,,,,false,4,,2,,,JEAN L'ARC,33420,LUGAIGNAC,,,33257,,,,,,,,,,,,,,,,,,,2003-12-31,F,,,,,74.1G,NAFRev1,O,-0.196914,44.813755,0.72,housenumber,2 Jean Larc Nord 33420 Lugaignac,33257_b051_00002,G,2 JEAN LARC NORD,
392268843,00019,39226884300019,O,1993-07-30,NN,,,2021-06-22T08:14:41,true,5,,,,,,33420,LUGAIGNAC,,,33257,,,,,,,,,,,,,,,,,,,2019-12-31,F,,,,,01.21Z,NAFRev2,O,,,0,,,,,,
392572905,00017,39257290500017,O,1974-01-01,,,,2007-01-18T09:34:25,true,3,,,,,,33420,LUGAIGNAC,,,33257,,,,,,,,,,,,,,,,,,,2005-12-25,F,,,,,01.1G,NAFRev1,N,,,0,,,,,,
392575098,00018,39257509800018,O,1993-11-07,NN,,,,true,1,,,,,,33420,LUGAIGNAC,,,33257,,,,,,,,,,,,,,,,,,,2000-03-30,F,,,,,70.2B,NAF1993,N,,,0,,,,,,
393446307,00026,39344630700026,O,2010-03-05,,,,2021-02-23T11:19:11,true,3,,3,,,LA RIBEYRE,33420,LUGAIGNAC,,,33257,,,,,,,,,,,,,,,,,,,2020-03-02,A,,,,CLADERES,43.91B,NAFRev2,N,-0.199419,44.819208,0.92,housenumber,3 Lieu Dit la Ribeyre 33420 Lugaignac,33257_h6hole_00003,G,3 LIEU DIT LA RIBEYRE,
394065023,00019,39406502300019,O,,,,,,true,1,,,,,LDT FONTADRES,33420,LUGAIGNAC,,,33257,,,,,,,,,,,,,,,,,,,1995-12-31,F,,,,,01.4A,NAF1993,N,-0.19378,44.809919,0.48,street,Lieu Dit Fontadas Nord 33420 Lugaignac,33257_B037,G,LIEU DIT FONTADAS NORD,
394111082,00068,39411108200068,O,2020-09-02,,,,2021-02-23T11:19:53,true,1,,2,,,AU PEREY,33420,LUGAIGNAC,,,33257,,,,,,,,,,,,,,,,,,,2020-09-02,A,,,,,85.42Z,NAFRev2,N,-0.180519,44.813847,0.84,housenumber,2 Lieu Dit au Perey 33420 Lugaignac,33257_ypnbwv_00002,G,2 LIEU DIT AU PEREY,
395070642,00016,39507064200016,O,1994-03-30,NN,,,2007-01-18T09:35:58,true,3,,,,,,33420,LUGAIGNAC,,,33257,,,,,,,,,,,,,,,,,,,1998-12-25,F,,,,,01.1G,NAF1993,N,,,0,,,,,,
399935006,00011,39993500600011,O,1995-01-01,00,2018,,2020-08-25T10:32:28,true,4,,1,,LD,BRUSSAC,33420,LUGAIGNAC,,,33257,,,,,,,,,,,,,,,,,,,2013-01-01,A,,,,,01.21Z,NAFRev2,O,-0.200307,44.81621,0.84,housenumber,1 Lieu Dit Brussac 33420 Lugaignac,33257_x7vbrt_00001,G,1 LIEU DIT BRUSSAC,
399935006,00029,39993500600029,O,2018-09-30,,,,2018-12-22T04:07:38,false,1,,1,,,BRUSSAC,33420,LUGAIGNAC,,,33257,,,,,,,,,,,,,,,,,,,2018-09-30,A,,,,,68.20B,NAFRev2,N,-0.200307,44.81621,0.84,housenumber,1 Lieu Dit Brussac 33420 Lugaignac,33257_x7vbrt_00001,G,1 LIEU DIT BRUSSAC,
404839185,00018,40483918500018,O,1995-01-01,NN,,,2018-02-23T04:25:02,true,5,,,,,BRUSSAC,33420,LUGAIGNAC,,,33257,,,,,,,,,,,,,,,,,,,2012-12-31,F,,,,,01.21Z,NAFRev2,O,-0.201168,44.816355,0.92,street,Lieu Dit Brussac 33420 Lugaignac,33257_x7vbrt,G,LIEU DIT BRUSSAC,
409761467,00011,40976146700011,O,,NN,,,,true,1,,,,,LE CHATEAU,33420,LUGAIGNAC,,,33257,,,,,,,,,,,,,,,,,,,1983-01-02,F,,,,,01.1A,NAF1993,N,-0.181913,44.817436,0.68,street,Lieu Dit au Chateau 33420 Lugaignac,33257_8tgnne,G,LIEU DIT AU CHATEAU,
410051080,00027,41005108000027,O,2001-10-01,NN,,,,true,1,,25,,,JEAN LARC NORD,33420,LUGAIGNAC,,,33257,,,,,,,,,,,,,,,,,,,2002-04-30,F,,,,,67.2Z,NAF1993,N,-0.197856,44.813159,0.94,housenumber,25 Jean Larc Nord 33420 Lugaignac,33257_b051_00025,G,25 JEAN LARC NORD,
410834931,00017,41083493100017,O,1997-01-02,NN,,,,true,1,,1,,,GUILLEBOT,33420,LUGAIGNAC,,,33257,,,,,,,,,,,,,,,,,,,2001-06-30,F,,,,,51.1R,NAF1993,N,-0.18491,44.820276,0.85,housenumber,1 Lieu Dit Guillebot 33420 Lugaignac,33257_djwnqt_00001,G,1 LIEU DIT GUILLEBOT,
411849797,00021,41184979700021,O,1999-04-01,,,,,false,3,,2,,,JEAN L'ARC,33420,LUGAIGNAC,,,33257,,,,,,,,,,,,,,,,,,,2000-07-18,F,,,,,74.8K,NAF1993,N,-0.196914,44.813755,0.72,housenumber,2 Jean Larc Nord 33420 Lugaignac,33257_b051_00002,G,2 JEAN LARC NORD,
412755241,00012,41275524100012,O,,NN,,,,true,1,,,,,LAUBAREDE,33420,LUGAIGNAC,,,33257,,,,,,,,,,,,,,,,,,,1987-12-31,F,,,,,01.1G,NAF1993,N,-0.190166,44.809829,0.75,street,Lieu Dit l’Aubarede 33420 Lugaignac,33257_btdsa7,G,LIEU DIT L AUBAREDE,
413373523,00013,41337352300013,O,1997-08-04,,,,,false,4,,2,,,JEAN L'ARC,33420,LUGAIGNAC,,,33257,,,,,,,,,,,,,,,,,,,2002-12-02,F,,,,,22.1E,NAF1993,N,-0.196914,44.813755,0.72,housenumber,2 Jean Larc Nord 33420 Lugaignac,33257_b051_00002,G,2 JEAN LARC NORD,
413881426,00014,41388142600014,O,,NN,,,,true,1,,,,,L AUBAREDE,33420,LUGAIGNAC,,,33257,,,,,,,,,,,,,,,,,,,1987-12-31,F,,,,,01.1G,NAF1993,N,-0.190166,44.809829,0.92,street,Lieu Dit l’Aubarede 33420 Lugaignac,33257_btdsa7,G,LIEU DIT L AUBAREDE,
413888439,00010,41388843900010,O,1987-12-31,NN,,,,true,1,,,,,LE CHATEAU,33420,LUGAIGNAC,,,33257,,,,,,,,,,,,,,,,,,,1998-12-31,F,,,,,01.1G,NAF1993,N,-0.181913,44.817436,0.68,street,Lieu Dit au Chateau 33420 Lugaignac,33257_8tgnne,G,LIEU DIT AU CHATEAU,
414104604,00015,41410460400015,O,1997-10-15,NN,,,2008-01-04T22:43:25,true,3,,,,,AUX BARRAILS,33420,LUGAIGNAC,,,33257,,,,,,,,,,,,,,,,,,,2008-01-01,A,,,,,68.20A,NAFRev2,N,-0.199661,44.819194,0.92,street,Lieu Dit aux Barrails 33420 Lugaignac,33257_hiogvd,G,LIEU DIT AUX BARRAILS,
419566187,00029,41956618700029,O,2013-11-01,,,4322AZ,2020-10-01T03:39:48,true,2,,4,,,L'EVANGILE,33420,LUGAIGNAC,,,33257,,,,,,,,,,,,,,,,,,,2020-08-31,F,,,,,43.22A,NAFRev2,N,-0.189048,44.821337,0.92,housenumber,4 Lieu Dit l’Evangile 33420 Lugaignac,33257_jc9wwd_00004,G,4 LIEU DIT L EVANGILE,
420285256,00012,42028525600012,O,1998-10-02,NN,,,2006-11-25T16:07:53,true,3,,,,,LE CHATEAU,33420,LUGAIGNAC,,,33257,,,,,,,,,,,,,,,,,,,2004-12-08,F,,,,,51.3J,NAFRev1,N,-0.181913,44.817436,0.68,street,Lieu Dit au Chateau 33420 Lugaignac,33257_8tgnne,G,LIEU DIT AU CHATEAU,
420426611,00026,42042661100026,O,2014-02-04,,,,2014-08-08T08:29:28,true,2,,5,,LD,BRUSSAC,33420,LUGAIGNAC,,,33257,,,,,,,,,,,,,,,,,,,2014-04-30,F,,,,,43.34Z,NAFRev2,N,-0.201937,44.816699,0.84,housenumber,5 Lieu Dit Brussac 33420 Lugaignac,33257_x7vbrt_00005,G,5 LIEU DIT BRUSSAC,
421774530,00016,42177453000016,O,1997-03-22,NN,,,2021-04-28T03:45:21,true,4,,,,,,33420,LUGAIGNAC,,,33257,,,,,,,,,,,,,,,,,,,2020-01-01,F,,,,,01.21Z,NAFRev2,N,,,0,,,,,,
422106971,00019,42210697100019,O,1999-01-01,NN,,,2015-04-14T14:51:22,true,4,,,,,LE CHATEAU,33420,LUGAIGNAC,,,33257,,,,,,,,,,,,,,,,,,,2010-12-31,F,,,,,68.20B,NAFRev2,N,-0.181913,44.817436,0.68,street,Lieu Dit au Chateau 33420 Lugaignac,33257_8tgnne,G,LIEU DIT AU CHATEAU,
423593227,00022,42359322700022,O,2002-12-31,NN,,,2013-12-18T04:43:17,true,4,2 JEAN LARC,2,,,JEAN LARC,33420,LUGAIGNAC,,,33257,,,,,,,,,,,,,,,,,,,2013-12-15,F,,,,,68.20B,NAFRev2,N,-0.196914,44.813755,0.93,housenumber,2 Jean Larc Nord 33420 Lugaignac,33257_b051_00002,G,2 JEAN LARC NORD,
424952588,00020,42495258800020,O,1999-10-01,NN,,,2017-10-27T08:49:23,true,4,,6,,LD,PEYRELEBADE,33420,LUGAIGNAC,,,33257,,,,,,,,,,,,,,,,,,,2017-10-17,F,,,,,90.03B,NAFRev2,N,-0.190381,44.817695,0.86,housenumber,6 Lieu Dit Peyrelebade 33420 Lugaignac,33257_1edjmc_00006,G,6 LIEU DIT PEYRELEBADE,
425290772,00010,42529077200010,O,1994-01-01,NN,,,2016-01-12T00:21:28,true,3,,,,,,33420,LUGAIGNAC,,,33257,,,,,,,,,,,,,,,,,,,2008-01-01,A,,,,,01.21Z,NAFRev2,N,,,0,,,,,,
425304888,00018,42530488800018,O,1970-10-01,NN,,,2008-01-05T01:14:51,true,3,,,,,,33420,LUGAIGNAC,,,33257,,,,,,,,,,,,,,,,,,,2008-01-01,A,,,,,68.20B,NAFRev2,N,,,0,,,,,,
425305083,00015,42530508300015,O,1990-10-01,NN,,,2013-02-09T12:52:11,true,4,,,,,LAUBAREDE,33420,LUGAIGNAC,,,33257,,,,,,,,,,,,,,,,,,,2012-12-25,F,,,,,68.20B,NAFRev2,N,-0.190166,44.809829,0.75,street,Lieu Dit l’Aubarede 33420 Lugaignac,33257_btdsa7,G,LIEU DIT L AUBAREDE,
428073514,00013,42807351400013,O,1999-10-01,NN,,,,false,4,,2,,,JEAN L'ARC,33420,LUGAIGNAC,,,33257,,,,,,,,,,,,,,,,,,,2002-02-28,F,,,,,74.8K,NAF1993,O,-0.196914,44.813755,0.72,housenumber,2 Jean Larc Nord 33420 Lugaignac,33257_b051_00002,G,2 JEAN LARC NORD,
429412240,00013,42941224000013,O,2000-02-10,NN,,,2008-01-05T01:38:53,true,3,,,,,LE BOURG,33420,LUGAIGNAC,,,33257,,,,,,,,,,,,,,,,,,,2008-01-01,A,,,,,68.20B,NAFRev2,N,-0.193355,44.815641,0.94,street,Le Bourg 33420 Lugaignac,33257_g4albc,G,LE BOURG,
430307595,00040,43030759500040,O,2011-01-01,01,2018,4321AB,2021-02-23T11:50:11,true,4,,2,,,LD MAUREZE,33420,LUGAIGNAC,,,33257,,,,,,,,,,,,,,,,,,,2016-07-04,A,,,,,43.21A,NAFRev2,O,-0.201175,44.805255,0.83,housenumber,2 Lieu Dit Maureze 33420 Lugaignac,33257_9syne3_00002,G,2 LIEU DIT MAUREZE,
430569988,00016,43056998800016,O,1983-01-01,NN,,,2011-05-27T13:40:31,true,4,,,,,,33420,LUGAIGNAC,,,33257,,,,,,,,,,,,,,,,,,,2010-07-27,F,,,,,68.20B,NAFRev2,N,,,0,,,,,,
430570580,00018,43057058000018,O,1991-11-01,NN,,,2012-07-28T16:21:55,true,4,,,,,BRUSSAC,33420,LUGAIGNAC,,,33257,,,,,,,,,,,,,,,,,,,2008-12-25,F,,,,,68.20B,NAFRev2,N,-0.201168,44.816355,0.92,street,Lieu Dit Brussac 33420 Lugaignac,33257_x7vbrt,G,LIEU DIT BRUSSAC,
431737287,00018,43173728700018,O,2000-05-01,01,2018,,2020-08-25T10:19:42,true,3,,4,,,LE CHATEAU,33420,LUGAIGNAC,,,33257,,,,,,,,,,,,,,,,,,,2008-01-01,A,,,,,01.21Z,NAFRev2,N,-0.182174,44.816895,0.72,housenumber,4 Lieu Dit au Chateau 33420 Lugaignac,33257_8tgnne_00004,G,4 LIEU DIT AU CHATEAU,
432371813,00028,43237181300028,O,2019-08-26,,,,2019-10-01T03:44:50,true,1,2 COTES DE PEYRELEBADE,,,,,33420,LUGAIGNAC,,,33257,,,,,,,,,,,,,,,,,,,2019-08-26,A,,,,,68.20B,NAFRev2,N,-0.190836,44.818505,0.94,housenumber,2 Cotes de Peyrelebade 33420 Lugaignac,33257_b031_00002,D,2 COTES DE PEYRELEBADE,
432796050,00016,43279605000016,O,2000-09-18,NN,,,2014-09-17T14:24:24,false,4,,,,LD,L'AUBAREDE,33420,LUGAIGNAC,,,33257,,,,,,,,,,,,,,,,,,,2002-03-31,F,,,,,01.4A,NAF1993,N,-0.190166,44.809829,0.92,street,Lieu Dit l’Aubarede 33420 Lugaignac,33257_btdsa7,G,LIEU DIT L AUBAREDE,
433106762,00019,43310676200019,O,2000-10-01,NN,,,2008-11-08T01:57:46,true,4,,13,,,JEAN LARC,33420,LUGAIGNAC,,,33257,,,,,,,,,,,,,,,,,,,2002-07-01,F,,,,,45.3A,NAF1993,O,-0.197314,44.81091,0.86,housenumber,13 Lieu Dit Jean Larc 33420 Lugaignac,33257_gqg1vm_00013,G,13 LIEU DIT JEAN LARC,
434880274,00015,43488027400015,O,2001-01-23,NN,,,2015-12-02T08:53:04,true,3,MAZEROLLES,1,,,LE BOURG,33420,LUGAIGNAC,,,33257,,,,,,,,,,,,,,,,,,,2008-01-01,A,,,,,68.20B,NAFRev2,N,-0.193355,44.815641,0.94,street,Le Bourg 33420 Lugaignac,33257_g4albc,G,LE BOURG,
438231409,00048,43823140900048,O,2006-12-01,,,,2014-07-08T02:16:15,false,3,,,,LD,LA  BORY DE JEAN LARC NORD,33420,LUGAIGNAC,,,33257,,,,,,,,,,,,,,,,,,,2010-04-24,F,,,,,49.32Z,NAFRev2,N,-0.197942,44.813867,0.94,street,La Bory de Jean Larc Nord 33420 Lugaignac,33257_B011,G,LA BORY DE JEAN LARC NORD,
438324105,00016,43832410500016,O,2001-07-03,NN,,,2008-11-08T02:05:28,false,4,,10,,,LAUBAREDE,33420,LUGAIGNAC,,,33257,,,,,,,,,,,,,,,,,,,2002-12-31,F,,,,,45.2V,NAF1993,O,-0.191089,44.809615,0.79,housenumber,10 Lieu Dit l’Aubarede 33420 Lugaignac,33257_btdsa7_00010,G,10 LIEU DIT L AUBAREDE,
439397977,00018,43939797700018,O,2001-10-01,NN,,,2008-11-08T02:08:01,true,4,,,,,JEAN GOT,33420,LUGAIGNAC,,,33257,,,,,,,,,,,,,,,,,,,2003-04-30,F,,,,,28.5D,NAFRev1,N,-0.194733,44.816859,0.94,street,Jean Got 33420 Lugaignac,33257_B050,G,JEAN GOT,
440719235,00010,44071923500010,O,2002-01-29,NN,,,2013-04-26T14:26:36,true,4,,,,LD,LAUBAREDE,33420,LUGAIGNAC,,,33257,,,,,,,,,,,,,,,,,,,2009-04-16,F,,,,,01.61Z,NAFRev2,O,-0.190166,44.809829,0.75,street,Lieu Dit l’Aubarede 33420 Lugaignac,33257_btdsa7,G,LIEU DIT L AUBAREDE,
448036764,00018,44803676400018,O,2003-04-05,NN,,,2007-05-30T10:27:14,false,3,,15,,,BRUSSAC,33420,LUGAIGNAC,,,33257,,,,,,,,,,,,,,,,,,,2004-01-12,F,,,,,52.5Z,NAFRev1,N,-0.200336,44.816281,0.85,housenumber,15 Lieu Dit Brussac 33420 Lugaignac,33257_x7vbrt_00015,G,15 LIEU DIT BRUSSAC,
448259184,00027,44825918400027,O,2015-10-19,,,7420ZR,2021-02-23T13:29:49,true,1,,5,,,LD PEYRELEBADE,33420,LUGAIGNAC,,,33257,,,,,,,,,,,,,,,,,,,2015-10-19,A,,,,IMAGES D'ECOLES,74.20Z,NAFRev2,N,-0.190192,44.817906,0.86,housenumber,5 Lieu Dit Peyrelebade 33420 Lugaignac,33257_1edjmc_00005,G,5 LIEU DIT PEYRELEBADE,
452439821,00011,45243982100011,O,2004-03-08,NN,,,2008-01-05T21:34:52,true,3,,,,LD,LA BORY DE JEAN LARC NORD,33420,LUGAIGNAC,,,33257,,,,,,,,,,,,,,,,,,,2008-01-01,A,,,,,68.20B,NAFRev2,N,-0.197942,44.813867,0.94,street,La Bory de Jean Larc Nord 33420 Lugaignac,33257_B011,G,LA BORY DE JEAN LARC NORD,
477513808,00014,47751380800014,O,1995-09-04,NN,,,2018-09-29T12:14:31,true,4,MAIRIE,,,,,33420,LUGAIGNAC,,,33257,,,,,,,,,,,,,,,,,,,2008-01-01,A,,,,,93.12Z,NAFRev2,O,,,0,,,,,,
478729353,00019,47872935300019,O,2004-09-21,NN,,,2007-03-12T16:09:45,true,3,,,,,GUILLEBOT,33420,LUGAIGNAC,,,33257,,,,,,,,,,,,,,,,,,,2006-12-30,F,,,,,51.3J,NAFRev1,N,-0.185655,44.819508,0.92,street,Guillebot Ouest 33420 Lugaignac,33257_B045,G,GUILLEBOT OUEST,
487457731,00023,48745773100023,O,2015-03-09,,,,2017-03-07T03:09:25,true,2,,2,,LD,AU PEREY,33420,LUGAIGNAC,,,33257,,,,,,,,,,,,,,,,,,,2016-11-30,F,,,,,68.31Z,NAFRev2,N,-0.180519,44.813847,0.84,housenumber,2 Lieu Dit au Perey 33420 Lugaignac,33257_ypnbwv_00002,G,2 LIEU DIT AU PEREY,
489354258,00019,48935425800019,O,2006-01-31,02,2018,,2020-08-25T10:33:55,true,3,,,,,CHATEAU HAUT GUILLEBOT,33420,LUGAIGNAC,,,33257,,,,,,,,,,,,,,,,,,,2008-12-31,A,,,,,01.21Z,NAFRev2,O,-0.185069,44.819833,0.48,street,Lieu Dit Guillebot 33420 Lugaignac,33257_djwnqt,G,LIEU DIT GUILLEBOT,
489578690,00039,48957869000039,O,2018-11-24,01,2018,4321AB,2020-08-25T10:34:12,true,1,,4,,LD,AUX BARRAILS,33420,LUGAIGNAC,,,33257,,,,,,,,,,,,,,,,,,,2018-11-24,A,,,,LASER EMOTION,90.02Z,NAFRev2,N,-0.201065,44.819569,0.87,housenumber,4 Lieu Dit aux Barrails 33420 Lugaignac,33257_hiogvd_00004,G,4 LIEU DIT AUX BARRAILS,
491481727,00031,49148172700031,O,2011-01-01,,,,2021-06-11T09:45:24,true,1,,4,,,JEAN L'ARC,33420,LUGAIGNAC,,,33257,,,,,,,,,,,,,,,,,,,2011-01-01,A,,,,,64.20Z,NAFRev2,N,-0.197536,44.81236,0.65,housenumber,4 Lieu Dit Jean Larc 33420 Lugaignac,33257_gqg1vm_00004,G,4 LIEU DIT JEAN LARC,