siren,nic,siret,statutDiffusionEtablissement,dateCreationEtablissement,trancheEffectifsEtablissement,anneeEffectifsEtablissement,activitePrincipaleRegistreMetiersEtablissement,dateDernierTraitementEtablissement,etablissementSiege,nombrePeriodesEtablissement,complementAdresseEtablissement,numeroVoieEtablissement,indiceRepetitionEtablissement,typeVoieEtablissement,libelleVoieEtablissement,codePostalEtablissement,libelleCommuneEtablissement,libelleCommuneEtrangerEtablissement,distributionSpecialeEtablissement,codeCommuneEtablissement,codeCedexEtablissement,libelleCedexEtablissement,codePaysEtrangerEtablissement,libellePaysEtrangerEtablissement,complementAdresse2Etablissement,numeroVoie2Etablissement,indiceRepetition2Etablissement,typeVoie2Etablissement,libelleVoie2Etablissement,codePostal2Etablissement,libelleCommune2Etablissement,libelleCommuneEtranger2Etablissement,distributionSpeciale2Etablissement,codeCommune2Etablissement,codeCedex2Etablissement,libelleCedex2Etablissement,codePaysEtranger2Etablissement,libellePaysEtranger2Etablissement,dateDebut,etatAdministratifEtablissement,enseigne1Etablissement,enseigne2Etablissement,enseigne3Etablissement,denominationUsuelleEtablissement,activitePrincipaleEtablissement,nomenclatureActivitePrincipaleEtablissement,caractereEmployeurEtablissement,longitude,latitude,geo_score,geo_type,geo_adresse,geo_id,geo_ligne,geo_l4,geo_l5
200011252,00018,20001125200018,O,2007-11-05,02,2018,,2020-08-25T10:14:38,true,3,MAIRIE,,,,LE BOURG,40660,MESSANGES,,,40181,,,,,,,,,,,,,,,,,,,2008-02-05,A,,,,,84.11Z,NAFRev2,O,-1.379946,43.816654,0.94,street,Le Bourg 40660 Messanges,40181_t42su3,G,LE BOURG,
200024636,00017,20002463600017,O,2010-03-01,02,2018,,2020-08-25T10:14:43,true,2,MAIRIE,,,,LE BOURG,40660,MESSANGES,,,40181,,,,,,,,,,,,,,,,,,,2011-01-24,A,,,,,84.13Z,NAFRev2,O,-1.379946,43.816654,0.94,street,Le Bourg 40660 Messanges,40181_t42su3,G,LE BOURG,
214001810,00016,21400181000016,O,1983-03-01,11,2018,,2020-08-25T10:17:11,true,4,,,,,,40660,MESSANGES,,,40181,,,,,,,,,,,,,,,,,,,2008-01-01,A,MAIRIE,,,,84.11Z,NAFRev2,O,,,0,,,,,,
214001810,00024,21400181000024,O,1983-12-21,03,2018,,2020-08-25T10:17:11,false,3,,,,,,40660,MESSANGES,,,40181,,,,,,,,,,,,,,,,,,,2008-01-01,A,ECOLE PRIMAIRE PUBLIQUE,,,,85.20Z,NAFRev2,N,,,0,,,,,,
214001810,00032,21400181000032,O,1998-12-25,NN,,,2008-01-04T18:33:17,false,2,MAIRIE,,,,,40660,MESSANGES,,,40181,,,,,,,,,,,,,,,,,,,2008-01-01,A,SERVICE EAU ET ASSAINISSEMENT,,,,36.00Z,NAFRev2,N,-1.376016,43.812222,0.38,street,Avenue de l’Airial 40660 Messanges,40181_0134,D,AVENUE DE L AIRIAL,
214001810,00040,21400181000040,O,1999-03-31,NN,,,2008-01-04T18:33:17,false,3,MAIRIE,,,,,40660,MESSANGES,,,40181,,,,,,,,,,,,,,,,,,,2008-01-01,A,LOTISSEMENT LE COY,,,,42.99Z,NAFRev2,N,-1.376016,43.812222,0.38,street,Avenue de l’Airial 40660 Messanges,40181_0134,D,AVENUE DE L AIRIAL,
214001810,00057,21400181000057,O,2004-02-18,NN,,,2016-01-12T00:10:28,false,3,,,,,MAIRIE,40660,MESSANGES,,,40181,,,,,,,,,,,,,,,,,,,2008-01-01,A,GESTION FORET COMMUNALE,,,,02.10Z,NAFRev2,N,-1.376016,43.812222,0.38,street,Avenue de l’Airial 40660 Messanges,40181_0134,G,AVENUE DE L AIRIAL,
254002587,00015,25400258700015,O,1991-06-05,NN,,,2008-10-09T16:37:03,true,3,,,,,MAIRIE,40660,MESSANGES,,,40181,,,,,,,,,,,,,,,,,,,1996-12-25,F,,,,,75.1C,NAF1993,N,-1.376016,43.812222,0.38,street,Avenue de l’Airial 40660 Messanges,40181_0134,G,AVENUE DE L AIRIAL,
254003213,00017,25400321300017,O,2002-08-01,NN,,,2012-05-05T00:35:57,true,4,,,,,,40660,MESSANGES,,,40181,,,,,,,,,,,,,,,,,,,2010-02-28,F,,,,,84.13Z,NAFRev2,N,,,0,,,,,,
264001785,00015,26400178500015,O,1983-03-01,NN,,,2010-06-26T03:09:30,true,4,MAIRIE,,,,LE BOURG,40660,MESSANGES,,,40181,,,,,,,,,,,,,,,,,,,2008-01-01,A,,,,,88.99B,NAFRev2,N,-1.379946,43.816654,0.94,street,Le Bourg 40660 Messanges,40181_t42su3,G,LE BOURG,
294000021,00013,29400002100013,O,1983-11-21,NN,,,2006-11-25T09:10:39,true,4,MAIRIE,,,,,40660,MESSANGES,,,40181,,,,,,,,,,,,,,,,,,,1999-12-25,F,,,,,70.1C,NAF1993,N,-1.376016,43.812222,0.38,street,Avenue de l’Airial 40660 Messanges,40181_0134,D,AVENUE DE L AIRIAL,
294000229,00012,29400022900012,O,,NN,,,2006-11-25T09:10:39,true,1,,,,,,40660,MESSANGES,,,40181,,,,,,,,,,,,,,,,,,,1994-01-01,F,,,,,70.1C,NAF1993,N,,,0,,,,,,
294002522,00018,29400252200018,O,1995-12-25,NN,,,2019-03-08T08:35:24,true,3,,,,,MAIRIE,40660,MESSANGES,,,40181,,,,,,,,,,,,,,,,,,,2018-01-01,A,,,,,42.99Z,NAFRev2,O,-1.376016,43.812222,0.38,street,Avenue de l’Airial 40660 Messanges,40181_0134,G,AVENUE DE L AIRIAL,
301282083,00031,30128208300031,O,1994-01-01,NN,,,2007-01-18T09:10:37,true,3,GRAMPE,,,,,40660,MESSANGES,,,40181,,,,,,,,,,,,,,,,,,,2002-07-24,F,,,,,01.3Z,NAF1993,N,-1.370103,43.829557,0.38,street,Chemin de la Gravière 40660 Messanges,40181_0170,D,CHEMIN DE LA GRAVIERE,
301294815,00016,30129481500016,O,,,,,2006-11-25T09:12:57,true,1,,,,,MAIRIE,40660,MESSANGES,,,40181,,,,,,,,,,,,,,,,,,,,F,,,,,97.23,NAP,N,-1.376016,43.812222,0.38,street,Avenue de l’Airial 40660 Messanges,40181_0134,G,AVENUE DE L AIRIAL,
301838405,00019,30183840500019,O,1977-01-01,NN,,,2010-06-27T05:43:03,true,3,,,,,,40660,MESSANGES,,,40181,,,,,,,,,,,,,,,,,,,2008-01-01,A,,,,,68.20B,NAFRev2,N,,,0,,,,,,
303765630,00122,30376563000122,O,1996-10-01,NN,,,,false,3,,10,,RTE,D AZUR,40660,MESSANGES,,,40181,,,,,,,,,,,,,,,,,,,2003-12-25,F,,,,,74.4B,NAFRev1,N,-1.322345,43.795799,0.61,street,Route d’Azur 40660 Messanges,40181_0010,G,ROUTE D AZUR,
304539141,00024,30453914100024,O,1992-01-11,NN,,,2016-01-20T04:02:11,false,5,,,,RTE,DES LACS,40660,MESSANGES,,,40181,,,,,,,,,,,,,,,,,,,2015-12-31,F,,,,,23.63Z,NAFRev2,N,-1.378696,43.810156,0.81,street,Route des Lacs 40660 Messanges,40181_0050,G,ROUTE DES LACS,
305345712,00023,30534571200023,O,,NN,,,,true,1,,,,,LES PLATANES,40660,MESSANGES,,,40181,,,,,,,,,,,,,,,,,,,1991-08-28,F,,,,,55.72,NAP,N,-1.370089,43.814977,0.92,street,Quartier les Platanes 40660 Messanges,40181_A170,G,QUARTIER LES PLATANES,
305503740,00030,30550374000030,O,2003-04-15,NN,,,2006-11-25T09:19:19,true,3,,32,,QUA,AIRAL,40660,MESSANGES,,,40181,,,,,,,,,,,,,,,,,,,2003-12-25,F,,,,,74.1J,NAFRev1,N,,,0,,,,,,
306042292,00038,30604229200038,O,,NN,,,,true,1,,,,LOT,DU CENTRE,40660,MESSANGES,,,40181,,,,,,,,,,,,,,,,,,,1994-09-30,F,,,,,52.1B,NAF1993,O,-1.364952,43.793405,0.42,street,Chemin du Lot 40660 Messanges,40181_0181,G,CHEMIN DU LOT,
306174152,00018,30617415200018,O,1974-01-01,NN,,,,true,1,,,,,,40660,MESSANGES,,,40181,,,,,,,,,,,,,,,,,,,1999-01-01,F,,,,,70.2C,NAF1993,N,,,0,,,,,,
306202839,00024,30620283900024,O,1900-01-01,NN,,,,true,4,,,,RTE,DES LACS,40660,MESSANGES,,,40181,,,,,,,,,,,,,,,,,,,1994-12-25,F,,,,,14.2A,NAF1993,N,-1.378696,43.810156,0.81,street,Route des Lacs 40660 Messanges,40181_0050,G,ROUTE DES LACS,
309069342,00033,30906934200033,O,2008-06-01,,,,2008-10-24T10:00:22,false,2,CENTRE COMMERCIAL U ENTREE DROITE,,,RTE,DES LACS,40660,MESSANGES,,,40181,,,,,,,,,,,,,,,,,,,2008-09-15,F,,,,,47.78C,NAFRev2,N,-1.378696,43.810156,0.81,street,Route des Lacs 40660 Messanges,40181_0050,G,ROUTE DES LACS,
309794360,00029,30979436000029,O,,NN,,,,true,1,,19,,PL,DU CENTRE,40660,MESSANGES,,,40181,,,,,,,,,,,,,,,,,,,1994-11-23,F,,,,,93.0D,NAF1993,N,5.3063809,43.3637805,0.76,poi,Place du Centre (Pont) Marseille,https://osm.org/way/486999040,G,,
310045695,00031,31004569500031,O,2007-04-01,NN,,,2018-09-29T12:12:50,true,4,,,,,CAMPING LE VIEUX PORT,40660,MESSANGES,,,40181,,,,,,,,,,,,,,,,,,,2016-02-17,F,BAZAR DU VIEUX PORT,,,,47.78C,NAFRev2,O,-1.4008039,43.8001453,0.84,poi.camp_site,Airotel Le Vieux Port (Camping) Messanges,https://osm.org/way/122221392,G,,
310297098,00025,31029709800025,O,,NN,,,,true,1,,,,,,40660,MESSANGES,,,40181,,,,,,,,,,,,,,,,,,,1996-09-30,F,,,,,55.2C,NAF1993,N,,,0,,,,,,
310299631,00013,31029963100013,O,,,,,,true,1,,,,,,40660,MESSANGES,,,40181,,,,,,,,,,,,,,,,,,,1993-07-31,F,,,,,55.1A,NAF1993,N,,,0,,,,,,
310361837,00043,31036183700043,O,1996-09-01,NN,,,2006-11-25T09:26:11,false,4,,,,QUA,MOUTIC,40660,MESSANGES,,,40181,,,,,,,,,,,,,,,,,,,2003-10-01,F,GERANT ERAIME CREATIONS ROGER MILLIAN,,,,74.1J,NAFRev1,N,-1.322441,43.797284,0.63,street,Moutic 40660 Messanges,40181_ynl1bn,G,MOUTIC,
310372776,00057,31037277600057,O,2006-06-01,NN,,,2018-04-10T10:07:18,false,11,CAMPING D ALBRET,,,RTE,PLAGE SUD,40660,MESSANGES,,,40181,,,,,,,,,,,,,,,,,,,2014-08-31,F,,,,LE GALIPO,56.10C,NAFRev2,O,-1.396712,43.796952,0.74,street,Route de la Plage-Sud 40660 Messanges,40181_0092,G,ROUTE DE LA PLAGE SUD,
310372776,00065,31037277600065,O,2007-06-01,,,,2008-01-04T20:00:34,false,2,,,,,CAMPING D ALBRET,40660,MESSANGES,,,40181,,,,,,,,,,,,,,,,,,,2007-07-13,F,LE GALIPO,,,,55.3A,NAFRev1,O,0.3099768,44.1010404,0.83,poi.camp_site,"Aire Naturelle de Camping ""Les Contes d'Albret"" Nérac",https://osm.org/node/5013867029,G,,
311195432,00019,31119543200019,O,1977-01-01,NN,,,,true,4,,,,,VILLA MALGRE TOUT,40660,MESSANGES,,,40181,,,,,,,,,,,,,,,,,,,1999-12-31,F,,,,,05.0A,NAF1993,N,,,0,,,,,,
311195432,00043,31119543200043,O,1997-07-01,NN,,,,false,5,,,,,PLAGE SUD,40660,MESSANGES,,,40181,,,,,,,,,,,,,,,,,,,2002-12-25,F,CAMPING LA FORET,,,,55.2C,NAF1993,N,-1.396712,43.796952,0.92,street,Route de la Plage-Sud 40660 Messanges,40181_0092,G,ROUTE DE LA PLAGE SUD,
312224900,00018,31222490000018,O,1978-01-01,NN,,,2011-06-23T09:40:50,true,12,RIVAGES LOINTAINS,133,,CHE,DE CAMENTRON,40660,MESSANGES,,,40181,,,,,,,,,,,,,,,,,,,2011-06-21,A,,,,,47.78C,NAFRev2,N,-1.376385,43.802111,0.68,street,Chemin de Camentron 40660 Messanges,40181_0023,G,CHEMIN DE CAMENTRON,
312224918,00028,31222491800028,O,2012-06-15,,,,2016-09-16T09:56:13,true,2,QUARTIER MOUTIC,4400,,RTE,D AZUR,40660,MESSANGES,,,40181,,,,,,,,,,,,,,,,,,,2016-09-13,A,,,,ATELIER CARAIBES,47.89Z,NAFRev2,N,-1.319312,43.797002,0.83,housenumber,4400 Route d’Azur 40660 Messanges,40181_0010_04400,G,4400 ROUTE D AZUR,
312224918,00036,31222491800036,O,2000-01-01,,,,2021-02-23T10:39:31,false,1,,4400,,RTE,AZUR,40660,MESSANGES,,,40181,,,,,,,,,,,,,,,,,,,2000-01-01,A,,,,,68.20A,NAFRev2,N,-1.319312,43.797002,0.75,housenumber,4400 Route d’Azur 40660 Messanges,40181_0010_04400,G,4400 ROUTE D AZUR,
312293426,00044,31229342600044,O,1993-06-07,NN,,,,false,3,,,,,AU BOURG,40660,MESSANGES,,,40181,,,,,,,,,,,,,,,,,,,1995-12-31,F,,,,,52.5Z,NAF1993,N,-1.375904,43.814234,0.73,street,Avenue du Bourg 40660 Messanges,40181_0015,G,AVENUE DU BOURG,
313112831,00059,31311283100059,O,2004-01-01,,,,2014-07-04T09:14:42,true,2,,243,,AV,DU CENTRE,40660,MESSANGES,,,40181,,,,,,,,,,,,,,,,,,,2008-01-01,A,,,,,68.20A,NAFRev2,N,-1.379826,43.814582,0.61,street,Avenue du Centre 40660 Messanges,40181_0025,G,AVENUE DU CENTRE,
313726838,00037,31372683800037,O,2014-01-01,,,,2021-02-23T10:40:16,true,1,,4,,SQ,DOUS CASOUS,40660,MESSANGES,,,40181,,,,,,,,,,,,,,,,,,,2014-01-01,A,,,,,68.20A,NAFRev2,N,-1.373583,43.818907,0.82,housenumber,4 Square Dous Casous 40660 Messanges,40181_0153_00004,G,4 SQUARE DOUS CASOUS,
313807679,00011,31380767900011,O,,,,,,true,1,,,,,CAMPING MOISAN,40660,MESSANGES,,,40181,,,,,,,,,,,,,,,,,,,1999-10-25,F,,,,,62.43,NAP,N,-1.386557,43.813801,0.51,street,Moïsan 40660 Messanges,40181_qih8m0,G,MOISAN,
314827288,00023,31482728800023,O,1990-03-02,NN,,,2020-08-20T15:28:05,true,6,,18,,,LOT DE LA VALLEE,40660,MESSANGES,,,40181,,,,,,,,,,,,,,,,,,,2020-12-31,F,,,,,81.30Z,NAFRev2,N,-1.381713,43.812861,0.72,housenumber,18 Route de la Vallée 40660 Messanges,40181_0127_00018,G,18 ROUTE DE LA VALLEE,
315254755,00046,31525475500046,O,1998-06-15,NN,,,2016-04-26T02:14:28,false,7,BOUTIQUE NO 8 PLAGE SUD,,,,CAMPING LE VIEUX PORT,40660,MESSANGES,,,40181,,,,,,,,,,,,,,,,,,,2014-11-20,F,,,,,93.29Z,NAFRev2,O,-1.4008039,43.8001453,0.84,poi.camp_site,Airotel Le Vieux Port (Camping) Messanges,https://osm.org/way/122221392,G,,
316089531,00016,31608953100016,O,,NN,,,,true,1,,,,LD,LE HEROU,40660,MESSANGES,,,40181,,,,,,,,,,,,,,,,,,,1988-02-11,F,,,,,67.04,NAP,N,-1.331983,43.793807,0.62,street,Chemin du Hérou 40660 Messanges,40181_0175,G,CHEMIN DU HEROU,
316096791,00066,31609679100066,O,1998-04-27,NN,,,2016-01-06T03:59:48,true,4,,9,,RUE,DES GIROLLES,40660,MESSANGES,,,40181,,,,,,,,,,,,,,,,,,,2015-12-30,F,,,,,71.11Z,NAFRev2,N,-1.374932,43.811428,0.95,housenumber,9 Rue des Girolles 40660 Messanges,40181_0137_00009,G,9 RUE DES GIROLLES,
316748250,00024,31674825000024,O,1981-01-01,NN,,,,true,1,,,,,VILLA QUIETUDE,40660,MESSANGES,,,40181,,,,,,,,,,,,,,,,,,,1990-09-09,F,,,,,71.2A,NAF1993,N,,,0,,,,,,
316881374,00011,31688137400011,O,1979-01-01,NN,,,2017-05-04T02:43:55,true,4,,,,,MAISON LYON,40660,MESSANGES,,,40181,,,,,,,,,,,,,,,,,,,2015-12-31,F,,,,,01.11Z,NAFRev2,N,4.8567045,45.7776896,0.88,poi.attraction,Maison des singes (Attraction) Lyon,https://osm.org/relation/968990,G,,
318548146,00014,31854814600014,O,1980-01-01,03,2018,,2020-08-25T10:27:49,true,5,,,,,CAMPING DU VIEUX PORT,40660,MESSANGES,,,40181,,,,,,,,,,,,,,,,,,,2008-01-01,A,,,,,64.20Z,NAFRev2,O,1.9156892,45.0760185,0.72,poi.camp_site,Le Vieux Port (Camping) Monceaux-sur-Dordogne,https://osm.org/way/301212906,G,,
318548146,00022,31854814600022,O,1988-05-01,NN,,,,false,4,,,,RTE,D'AZUR,40660,MESSANGES,,,40181,,,,,,,,,,,,,,,,,,,2001-03-28,F,CAMPING LOU PIGNADA,,,,55.2C,NAF1993,N,-1.322345,43.795799,0.78,street,Route d’Azur 40660 Messanges,40181_0010,G,ROUTE D AZUR,
318548146,00030,31854814600030,O,1996-12-31,NN,,,,false,3,,,,,DU VIEUX PORT,40660,MESSANGES,,,40181,,,,,,,,,,,,,,,,,,,2001-12-25,F,,,,,01.1A,NAF1993,N,3.6965254,43.3979163,0.9,poi.bar,Bar du vieux port Sète,https://osm.org/node/3862480460,G,,
318548146,00048,31854814600048,O,2013-06-01,,,,2014-05-26T10:55:52,false,1,,,,,ZA DE PEY DE L'ANCRE,40660,MESSANGES,,,40181,,,,,,,,,,,,,,,,,,,2013-06-01,A,,,,,68.20B,NAFRev2,N,-1.389547,43.795833,0.77,street,Pey de l’Ancre 40660 Messanges,40181_B068,G,PEY DE L ANCRE,
319501318,00046,31950131800046,O,2014-06-15,,,5610CQ,2017-03-09T03:58:24,true,3,,125,,RTE,DES LACS,40660,MESSANGES,,,40181,,,,,,,,,,,,,,,,,,,2017-02-28,F,PIZZAS CASA,,,,56.10C,NAFRev2,N,-1.378696,43.810156,0.63,street,Route des Lacs 40660 Messanges,40181_0050,G,ROUTE DES LACS,
319643045,00036,31964304500036,O,2009-04-10,01,2018,,2020-10-20T19:34:47,true,6,CENTRE COMMERCIAL U,,,RTE,ROUTE DES LACS,40660,MESSANGES,,,40181,,,,,,,,,,,,,,,,,,,2020-09-30,F,,,,,47.51Z,NAFRev2,N,-1.378696,43.810156,0.82,street,Route des Lacs 40660 Messanges,40181_0050,G,ROUTE DES LACS,
319858957,00016,31985895700016,O,,NN,,,,true,1,,,,,,40660,MESSANGES,,,40181,,,,,,,,,,,,,,,,,,,,F,,,,,00.10,NAP,N,,,0,,,,,,
319859005,00021,31985900500021,O,,NN,,,,true,1,,,,,CAMPING D ALBRET PLAGE,40660,MESSANGES,,,40181,,,,,,,,,,,,,,,,,,,1991-09-15,F,,,,,62.11,NAP,N,-1.4035423,43.797313,0.75,poi.camp_site,Albret plage (Camping) Messanges,https://osm.org/way/122221394,G,,
320248925,00028,32024892500028,O,1997-07-04,NN,,,2020-10-02T03:46:24,true,11,,22,,AV,DU COY,40660,MESSANGES,,,40181,,,,,,,,,,,,,,,,,,,2020-09-30,F,,,,GENERATION BOIS,56.10C,NAFRev2,O,-1.369446,43.814987,0.81,housenumber,22 Avenue du Coy 40660 Messanges,40181_0031_00022,G,22 AVENUE DU COY,
320924483,00045,32092448300045,O,1995-05-15,NN,,,,false,3,NO5 CTRE CIAL LES GRILLONS,,,,,40660,MESSANGES,,,40181,,,,,,,,,,,,,,,,,,,1995-12-25,F,LOUIS FOILLAC,,,,52.2P,NAF1993,O,,,0,,,,,,
321169633,00013,32116963300013,O,,,,,,true,1,,,,,QU CALIOT,40660,MESSANGES,,,40181,,,,,,,,,,,,,,,,,,,1984-12-25,F,,,,,55.10,NAP,N,-1.375738,43.797469,0.75,street,Route du Quartier Caliot 40660 Messanges,40181_0177,G,ROUTE DU QUARTIER CALIOT,
321737736,00074,32173773600074,O,1989-01-01,NN,,,2011-07-05T09:34:12,false,4,,,,,CAMPING DU VIEUX PORT,40660,MESSANGES,,,40181,,,,,,,,,,,,,,,,,,,2010-12-31,F,,,,,68.20B,NAFRev2,N,1.9156892,45.0760185,0.72,poi.camp_site,Le Vieux Port (Camping) Monceaux-sur-Dordogne,https://osm.org/way/301212906,G,,
321859506,00040,32185950600040,O,2016-01-01,,,,2021-08-24T03:46:07,false,2,,10,,CHE,DE LUZEN,40660,MESSANGES,,,40181,,,,,,,,,,,,,,,,,,,2018-08-15,F,,,,,68.20A,NAFRev2,N,-1.369236,43.794447,0.64,street,Chemin de Luzen 40660 Messanges,40181_0182,G,CHEMIN DE LUZEN,
322229329,00022,32222932900022,O,1900-01-01,,,,2011-04-28T00:19:34,false,3,,,,RTE,DES LACS,40660,MESSANGES,,,40181,,,,,,,,,,,,,,,,,,,1993-12-25,F,,,,,74.8A,NAF1993,N,-1.378696,43.810156,0.81,street,Route des Lacs 40660 Messanges,40181_0050,G,ROUTE DES LACS,
322483777,00015,32248377700015,O,,NN,,,,true,1,,,,,CAMPING DE LA PLAGE,40660,MESSANGES,,,40181,,,,,,,,,,,,,,,,,,,1989-07-13,F,,,,,62.43,NAP,N,-1.380149,43.815943,0.57,street,Avenue de la Plage 40660 Messanges,40181_0089,G,AVENUE DE LA PLAGE,
322842477,00026,32284247700026,O,2000-06-01,,,,2008-11-07T00:39:19,false,3,CENTRE COMMERCIAL U,,,RTE,DES LACS,40660,MESSANGES,,,40181,,,,,,,,,,,,,,,,,,,2002-12-25,F,,,,,55.3A,NAF1993,O,-1.378696,43.810156,0.81,street,Route des Lacs 40660 Messanges,40181_0050,G,ROUTE DES LACS,
323683730,00044,32368373000044,O,1986-08-28,NN,,,,false,4,,,,,GARE,40660,MESSANGES,,,40181,,,,,,,,,,,,,,,,,,,1999-12-31,F,GLACIERES DE L ATLANTIQUE,,,,63.1D,NAF1993,N,-1.371291,43.811085,0.91,street,Impasse de la Gare 40660 Messanges,40181_0171,G,IMPASSE DE LA GARE,
324554377,00022,32455437700022,O,2004-07-01,NN,,,2006-11-25T09:57:30,true,3,CAMPING LE MOISAN,,,RTE,DE LA PLAGE,40660,MESSANGES,,,40181,,,,,,,,,,,,,,,,,,,2004-12-25,F,,,,,52.1B,NAFRev1,N,-1.396712,43.796952,0.83,street,Route de la Plage-Sud 40660 Messanges,40181_0092,G,ROUTE DE LA PLAGE SUD,
324838150,00054,32483815000054,O,1999-01-01,NN,,,2015-06-10T17:19:30,true,5,,55,,RUE,DARROCS,40660,MESSANGES,,,40181,,,,,,,,,,,,,,,,,,,2013-07-01,A,,,,,02.10Z,NAFRev2,N,-1.371039,43.809531,0.51,street,Chemin des Darrocs 40660 Messanges,40181_0172,G,CHEMIN DES DARROCS,
324908482,00023,32490848200023,O,1995-07-01,NN,,,2012-07-16T21:30:53,true,4,,8,,RUE,DE LA FORET,40660,MESSANGES,,,40181,,,,,,,,,,,,,,,,,,,2012-06-30,F,,,,,86.90D,NAFRev2,N,-1.374217,43.814929,0.95,housenumber,8 Rue de la Foret 40660 Messanges,40181_0040_00008,G,8 RUE DE LA FORET,
324930833,00011,32493083300011,O,,,,,,true,1,,,,,CPG DE MOISAN,40660,MESSANGES,,,40181,,,,,,,,,,,,,,,,,,,1987-04-27,F,,,,,62.43,NAP,N,-1.383036,43.816687,0.54,street,Quartier Moisan la Dune 40660 Messanges,40181_A090,G,QUARTIER MOISAN LA DUNE,
325277929,00031,32527792900031,O,2012-02-13,,,,2015-11-04T05:20:57,true,2,C15,16,,AV,DES PLATANES,40660,MESSANGES,,,40181,,,,,,,,,,,,,,,,,,,2015-10-31,F,,,,,58.11Z,NAFRev2,N,-1.372884,43.815083,0.84,housenumber,16 Avenue des Platanes 40660 Messanges,40181_0115_00016,G,16 AVENUE DES PLATANES,
325508703,00056,32550870300056,O,1993-07-01,NN,,,,false,4,,,,,PORTE DU VIEUX BOUCAU,40660,MESSANGES,,,40181,,,,,,,,,,,,,,,,,,,1995-12-31,F,OCEAN,,,,52.4C,NAF1993,O,,,0,,,,,,
326061405,00014,32606140500014,O,,,,,,true,1,,,,,MAISON L ANGELUS,40660,MESSANGES,,,40181,,,,,,,,,,,,,,,,,,,1984-12-25,F,,,,,66.04,NAP,N,,,0,,,,,,
326327442,00066,32632744200066,O,,NN,,,,true,1,,,,,CAMPING D ALBRET,40660,MESSANGES,,,40181,,,,,,,,,,,,,,,,,,,1989-09-30,F,,,,,67.01,NAP,N,0.3099768,44.1010404,0.83,poi.camp_site,"Aire Naturelle de Camping ""Les Contes d'Albret"" Nérac",https://osm.org/node/5013867029,G,,
326642543,00010,32664254300010,O,,,,,,true,1,,,,,CAMPING LOU PIGNADA,40660,MESSANGES,,,40181,,,,,,,,,,,,,,,,,,,1988-09-30,F,,,,,67.13,NAP,N,-1.4606796,43.5686747,0.91,poi.camp_site,Camping Lou Pignada Ondres,https://osm.org/way/250536152,G,,
327118188,00025,32711818800025,O,2018-11-05,,,,2021-02-23T10:48:51,true,1,,1,,RUE,DE LA COURTILLE,40660,MESSANGES,,,40181,,,,,,,,,,,,,,,,,,,2018-11-05,A,,,,,68.20A,NAFRev2,N,-1.378942,43.815678,0.95,housenumber,1 Rue de la Courtille 40660 Messanges,40181_0157_00001,G,1 RUE DE LA COURTILLE,
327691044,00017,32769104400017,O,1900-01-01,,,,2011-04-28T00:23:32,false,2,,,,,CAMPING DE MOISAN,40660,MESSANGES,,,40181,,,,,,,,,,,,,,,,,,,1984-12-25,F,,,,,67.03,NAP,N,-1.386557,43.813801,0.45,street,Moïsan 40660 Messanges,40181_qih8m0,G,MOISAN,
328808134,00014,32880813400014,O,,NN,,,,true,1,,,,,CARRAOU,40660,MESSANGES,,,40181,,,,,,,,,,,,,,,,,,,,F,,,,,01.00,NAP,N,-1.37863,43.801065,0.94,street,Carraou 40660 Messanges,40181_q6bbtt,G,CARRAOU,
329190532,00013,32919053200013,O,1984-01-01,NN,,,2008-12-31T16:49:16,false,7,,,,QUAI,CALIOT,40660,MESSANGES,,,40181,,,,,,,,,,,,,,,,,,,2008-12-31,F,,,,,02.20Z,NAFRev2,N,-1.375738,43.797469,0.71,street,Route du Quartier Caliot 40660 Messanges,40181_0177,G,ROUTE DU QUARTIER CALIOT,
329190532,00021,32919053200021,O,2005-12-31,NN,,,2018-10-22T09:43:55,true,3,,,,QUAI,CALIOT,40660,MESSANGES,,,40181,,,,,,,,,,,,,,,,,,,2017-12-31,F,,,,,01.11Z,NAFRev2,N,-1.375738,43.797469,0.71,street,Route du Quartier Caliot 40660 Messanges,40181_0177,G,ROUTE DU QUARTIER CALIOT,
329696215,00014,32969621500014,O,1984-02-23,NN,,,2005-12-05T03:44:57,true,1,,,,,MOUTIC,40660,MESSANGES,,,40181,,,,,,,,,,,,,,,,,,,2000-09-20,F,,,,,01.1A,NAF1993,N,-1.322441,43.797284,0.94,street,Moutic 40660 Messanges,40181_ynl1bn,G,MOUTIC,
330016676,00042,33001667600042,O,2003-06-02,NN,,,,false,2,LIEU-DIT LE MOULIN,,,RTE,DE LA PLAGE,40660,MESSANGES,,,40181,,,,,,,,,,,,,,,,,,,2003-12-25,F,,,,,74.1J,NAFRev1,N,-1.396712,43.796952,0.83,street,Route de la Plage-Sud 40660 Messanges,40181_0092,G,ROUTE DE LA PLAGE SUD,
330202060,00019,33020206000019,O,1984-06-01,00,2018,,2021-01-27T09:03:48,true,7,,390,,CHE,BARRAILS,40660,MESSANGES,,,40181,,,,,,,,,,,,,,,,,,,2021-01-25,A,,,,,55.30Z,NAFRev2,O,-1.374577,43.795341,0.84,housenumber,390 Chemin Barrails 40660 Messanges,40181_0183_00390,G,390 CHEMIN BARRAILS,
330202060,00027,33020206000027,O,2016-12-20,NN,,,2018-09-29T12:25:39,false,1,,375,,RTE,DE LA PLAGE SUD,40660,MESSANGES,,,40181,,,,,,,,,,,,,,,,,,,2016-12-20,A,,,,,55.30Z,NAFRev2,O,-1.392585,43.796229,0.87,housenumber,375 Route de la Plage-Sud 40660 Messanges,40181_0092_00375,G,375 ROUTE DE LA PLAGE SUD,
330234220,00029,33023422000029,O,,NN,,,,true,1,,,,,CAMPING D ALBRET,40660,MESSANGES,,,40181,,,,,,,,,,,,,,,,,,,1991-09-30,F,,,,,67.01,NAP,N,0.3099768,44.1010404,0.83,poi.camp_site,"Aire Naturelle de Camping ""Les Contes d'Albret"" Nérac",https://osm.org/node/5013867029,G,,
330579723,00041,33057972300041,O,1995-06-17,NN,,,,false,5,,,,,CAMPING ALBRET PLAGE,40660,MESSANGES,,,40181,,,,,,,,,,,,,,,,,,,2000-12-31,F,CREPERIE LE MENHIR,,,,55.3A,NAF1993,N,-1.4035423,43.797313,0.82,poi.camp_site,Albret plage (Camping) Messanges,https://osm.org/way/122221394,G,,
331711242,00023,33171124200023,O,2008-06-28,,,,2013-04-17T08:15:51,false,2,,,,CHE,DE L USAGE,40660,MESSANGES,,,40181,,,,,,,,,,,,,,,,,,,2011-10-01,F,,,,,47.89Z,NAFRev2,N,-1.366711,43.796835,0.83,street,Chemin de l’Usage 40660 Messanges,40181_0110,G,CHEMIN DE L USAGE,
332044635,00032,33204463500032,O,2012-01-19,,,,2021-06-11T08:54:19,true,2,BLUENOSE,,,CHE,DE CAMENTRON,40660,MESSANGES,,,40181,,,,,,,,,,,,,,,,,,,2020-12-31,F,,,,,86.90E,NAFRev2,N,-1.376385,43.802111,0.84,street,Chemin de Camentron 40660 Messanges,40181_0023,G,CHEMIN DE CAMENTRON,
332044643,00028,33204464300028,O,1989-02-20,NN,,,2015-05-14T06:37:56,false,5,,,,RTE,DE LA PLAGE,40660,MESSANGES,,,40181,,,,,,,,,,,,,,,,,,,2013-03-04,F,,,,,86.21Z,NAFRev2,O,-1.396712,43.796952,0.83,street,Route de la Plage-Sud 40660 Messanges,40181_0092,G,ROUTE DE LA PLAGE SUD,
332044643,00036,33204464300036,O,2013-03-04,NN,,,2018-09-29T12:27:09,true,3,,10,,RUE,DE LA COURTILLE,40660,MESSANGES,,,40181,,,,,,,,,,,,,,,,,,,2017-11-05,F,,,,,86.21Z,NAFRev2,O,-1.379174,43.81571,0.95,housenumber,10 Rue de la Courtille 40660 Messanges,40181_0157_00010,G,10 RUE DE LA COURTILLE,
332240654,00035,33224065400035,O,1990-03-01,NN,,,,false,4,,,,LOT,,40660,MESSANGES,,,40181,,,,,,,,,,,,,,,,,,,1998-03-05,F,,,,,70.2C,NAF1993,N,-1.364952,43.793405,0.91,street,Chemin du Lot 40660 Messanges,40181_0181,G,CHEMIN DU LOT,
332636257,00021,33263625700021,O,2017-12-01,,,,2017-11-29T08:55:34,true,1,,,,LD,LAHITTE,40660,MESSANGES,,,40181,,,,,,,,,,,,,,,,,,,2017-12-01,A,,,,,02.10Z,NAFRev2,N,-1.368971,43.830703,0.35,street,Route de la Côte d’Argent 40660 Messanges,40181_0165,G,ROUTE DE LA COTE D ARGENT,