siren,nic,siret,statutDiffusionEtablissement,dateCreationEtablissement,trancheEffectifsEtablissement,anneeEffectifsEtablissement,activitePrincipaleRegistreMetiersEtablissement,dateDernierTraitementEtablissement,etablissementSiege,nombrePeriodesEtablissement,complementAdresseEtablissement,numeroVoieEtablissement,indiceRepetitionEtablissement,typeVoieEtablissement,libelleVoieEtablissement,codePostalEtablissement,libelleCommuneEtablissement,libelleCommuneEtrangerEtablissement,distributionSpecialeEtablissement,codeCommuneEtablissement,codeCedexEtablissement,libelleCedexEtablissement,codePaysEtrangerEtablissement,libellePaysEtrangerEtablissement,complementAdresse2Etablissement,numeroVoie2Etablissement,indiceRepetition2Etablissement,typeVoie2Etablissement,libelleVoie2Etablissement,codePostal2Etablissement,libelleCommune2Etablissement,libelleCommuneEtranger2Etablissement,distributionSpeciale2Etablissement,codeCommune2Etablissement,codeCedex2Etablissement,libelleCedex2Etablissement,codePaysEtranger2Etablissement,libellePaysEtranger2Etablissement,dateDebut,etatAdministratifEtablissement,enseigne1Etablissement,enseigne2Etablissement,enseigne3Etablissement,denominationUsuelleEtablissement,activitePrincipaleEtablissement,nomenclatureActivitePrincipaleEtablissement,caractereEmployeurEtablissement,longitude,latitude,geo_score,geo_type,geo_adresse,geo_id,geo_ligne,geo_l4,geo_l5
214200917,00018,21420091700018,O,1983-03-01,NN,,,2018-09-29T12:05:20,true,4,,,,,LE BOURG,42380,ESTIVAREILLES,,,42091,,,,,,,,,,,,,,,,,,,2008-01-01,A,MAIRIE,,,,84.11Z,NAFRev2,O,4.017571,45.411921,0.32,street,Route du Bouchet 42380 Estivareilles,42091_0003,G,ROUTE DU BOUCHET,
214200917,00026,21420091700026,O,1983-12-21,03,2018,,2020-08-25T10:17:15,false,3,,,,,,42380,ESTIVAREILLES,,,42091,,,,,,,,,,,,,,,,,,,2008-01-01,A,ECOLE PRIMAIRE PUBLIQUE,,,,85.20Z,NAFRev2,N,,,0,,,,,,
214200917,00034,21420091700034,O,1996-01-01,NN,,,2020-10-27T15:43:47,false,4,MAIRIE,,,,LE BOURG,42380,ESTIVAREILLES,,,42091,,,,,,,,,,,,,,,,,,,2019-12-31,F,SCE EAU ET ASSAINISSEMENT,,,,36.00Z,NAFRev2,N,4.017571,45.411921,0.32,street,Route du Bouchet 42380 Estivareilles,42091_0003,G,ROUTE DU BOUCHET,
214200917,00042,21420091700042,O,2001-01-01,NN,,,2008-01-04T18:33:40,false,3,MAIRIE,,,,LE BOURG,42380,ESTIVAREILLES,,,42091,,,,,,,,,,,,,,,,,,,2008-01-01,A,ZAC DU GENEVRET,,,,42.99Z,NAFRev2,N,4.017571,45.411921,0.32,street,Route du Bouchet 42380 Estivareilles,42091_0003,G,ROUTE DU BOUCHET,
214200917,00059,21420091700059,O,1999-05-18,NN,,,2008-01-04T18:33:40,false,3,,,,RUE,DU COUVENT,42380,ESTIVAREILLES,,,42091,,,,,,,,,,,,,,,,,,,2008-01-01,A,MUSEE RESISTANCE DEPORTATION XX SIECLE,,,,91.03Z,NAFRev2,N,4.009508,45.416011,0.95,street,Rue du Couvent 42380 Estivareilles,42091_0010,G,RUE DU COUVENT,
214200917,00067,21420091700067,O,2003-05-01,NN,,,2008-01-04T18:33:40,false,3,,,,,LE BOURG,42380,ESTIVAREILLES,,,42091,,,,,,,,,,,,,,,,,,,2008-01-01,A,CAMPING MUNICIPAL LE COLOMBIER,,,,55.30Z,NAFRev2,N,4.017571,45.411921,0.32,street,Route du Bouchet 42380 Estivareilles,42091_0003,G,ROUTE DU BOUCHET,
214200917,00075,21420091700075,O,2008-12-01,,,,2021-02-23T10:32:22,false,1,MAIRIE,,,,,42380,ESTIVAREILLES,,,42091,,,,,,,,,,,,,,,,,,,2008-12-01,A,CENTRE DE LOISIRS PERISCOLAIRE,,,,93.29Z,NAFRev2,N,4.008964,45.414329,0.38,street,Impasse de la Carderie 42380 Estivareilles,42091_0006,D,IMPASSE DE LA CARDERIE,
264202128,00015,26420212800015,O,1992-01-01,NN,,,2019-07-10T13:52:47,true,4,,,,,MAIRIE,42380,ESTIVAREILLES,,,42091,,,,,,,,,,,,,,,,,,,2019-01-01,F,CCAS,,,,88.99B,NAFRev2,N,4.008964,45.414329,0.38,street,Impasse de la Carderie 42380 Estivareilles,42091_0006,G,IMPASSE DE LA CARDERIE,
300769171,00012,30076917100012,O,1900-01-01,NN,,,2008-11-07T00:16:55,false,4,,,,,,42380,ESTIVAREILLES,,,42091,,,,,,,,,,,,,,,,,,,1997-12-31,F,,,,,45.4J,NAF1993,N,,,0,,,,,,
300769171,00020,30076917100020,O,1997-06-01,NN,,,2008-11-07T00:16:55,true,3,,,,LD,LES ECHANAUX,42380,ESTIVAREILLES,,,42091,,,,,,,,,,,,,,,,,,,2006-12-31,F,,,,,45.4J,NAFRev1,N,4.003782,45.420889,0.31,street,Route de la Chapelle 42380 Estivareilles,42091_0005,G,ROUTE DE LA CHAPELLE,
300770062,00028,30077006200028,O,1997-06-01,NN,,,,true,1,,,,LD,LES ECHANAUX,42380,ESTIVAREILLES,,,42091,,,,,,,,,,,,,,,,,,,2001-05-31,F,,,,,45.4J,NAF1993,N,4.003782,45.420889,0.31,street,Route de la Chapelle 42380 Estivareilles,42091_0005,G,ROUTE DE LA CHAPELLE,
301167599,00010,30116759900010,O,1900-01-01,,,,,true,3,,,,,,42380,ESTIVAREILLES,,,42091,,,,,,,,,,,,,,,,,,,1994-12-25,F,,,,,51.2A,NAF1993,N,,,0,,,,,,
301485074,00019,30148507400019,O,1974-01-01,NN,,,2008-11-07T00:17:34,false,4,,,,,,42380,ESTIVAREILLES,,,42091,,,,,,,,,,,,,,,,,,,1997-12-31,F,,,,,45.4J,NAF1993,O,,,0,,,,,,
301485074,00027,30148507400027,O,1997-06-01,NN,,,2008-11-07T00:17:34,true,3,,,,LD,LES ECHANAUX,42380,ESTIVAREILLES,,,42091,,,,,,,,,,,,,,,,,,,2006-12-31,F,,,,,45.4J,NAFRev1,N,4.003782,45.420889,0.31,street,Route de la Chapelle 42380 Estivareilles,42091_0005,G,ROUTE DE LA CHAPELLE,
302116199,00134,30211619900134,O,2006-10-01,02,2018,,2020-12-30T03:43:26,false,4,,,,,LE CHANTIER,42380,ESTIVAREILLES,,,42091,,,,,,,,,,,,,,,,,,,2010-07-01,A,,,,,46.73A,NAFRev2,O,3.999221,45.426291,0.47,street,Chemin de Chabarnier 42380 Estivareilles,42091_0027,G,CHEMIN DE CHABARNIER,
302359567,00054,30235956700054,O,2003-01-01,NN,,,2016-01-12T00:10:41,false,3,,,,LD,LE CHABANY,42380,ESTIVAREILLES,,,42091,,,,,,,,,,,,,,,,,,,2008-01-01,A,,,,,02.20Z,NAFRev2,N,4.008992,45.459796,0.68,street,Impasse du Chabany 42380 Estivareilles,42091_0026,G,IMPASSE DU CHABANY,
302841010,00010,30284101000010,O,1965-01-01,NN,,,,true,1,,,,,LE GROS TERME,42380,ESTIVAREILLES,,,42091,,,,,,,,,,,,,,,,,,,2001-03-31,F,,,,,45.3E,NAF1993,N,4.011571,45.417818,0.73,street,Impasse du Gros Terme 42380 Estivareilles,42091_0054,G,IMPASSE DU GROS TERME,
308685486,00018,30868548600018,O,,NN,,,,true,1,,,,,,42380,ESTIVAREILLES,,,42091,,,,,,,,,,,,,,,,,,,,F,,,,,67.07,NAP,N,,,0,,,,,,
308961556,00013,30896155600013,O,1900-01-01,NN,,,,true,3,,,,,BOURG,42380,ESTIVAREILLES,,,42091,,,,,,,,,,,,,,,,,,,1993-11-22,F,,,,,29.3D,NAF1993,N,4.017571,45.411921,0.44,street,Route du Bouchet 42380 Estivareilles,42091_0003,G,ROUTE DU BOUCHET,
309688752,00026,30968875200026,O,1978-10-01,NN,,,2008-11-07T00:24:34,true,3,,,,LD,LE CROS,42380,ESTIVAREILLES,,,42091,,,,,,,,,,,,,,,,,,,2007-09-30,F,,,,,45.3A,NAFRev1,N,3.980461,45.429927,0.34,street,Route du Crozet 42380 Estivareilles,42091_0034,G,ROUTE DU CROZET,
309994895,00022,30999489500022,O,1981-02-02,NN,,,2008-11-07T00:24:54,false,4,,,,,LE BOURG MAISON PAILLET,42380,ESTIVAREILLES,,,42091,,,,,,,,,,,,,,,,,,,2000-01-01,F,,,,,45.4J,NAF1993,N,,,0,,,,,,
309994895,00030,30999489500030,O,2000-01-01,NN,,,2012-03-28T12:37:13,true,6,,,,,LE BOURG,42380,ESTIVAREILLES,,,42091,,,,,,,,,,,,,,,,,,,2012-03-30,F,,,,,43.34Z,NAFRev2,N,4.017571,45.411921,0.32,street,Route du Bouchet 42380 Estivareilles,42091_0003,G,ROUTE DU BOUCHET,
310414263,00031,31041426300031,O,,NN,,,,true,1,,,,,LE BOURG,42380,ESTIVAREILLES,,,42091,,,,,,,,,,,,,,,,,,,1989-09-09,F,,,,,67.08,NAP,N,4.017571,45.411921,0.32,street,Route du Bouchet 42380 Estivareilles,42091_0003,G,ROUTE DU BOUCHET,
310960877,00010,31096087700010,O,,NN,,,,true,1,,,,RUE,DU LAVOIR,42380,ESTIVAREILLES,,,42091,,,,,,,,,,,,,,,,,,,,F,,,,,69.12,NAP,N,4.00887,45.415506,0.49,street,Rue du 21 Aout 1944 42380 Estivareilles,42091_0002,G,RUE DU 21 AOUT 1944,
310974597,00018,31097459700018,O,,,,,,true,1,,,,PL,DU MONUMENT,42380,ESTIVAREILLES,,,42091,,,,,,,,,,,,,,,,,,,1985-12-25,F,,,,,67.07,NAP,N,4.008504,45.416531,0.82,street,Place du Monument 42380 Estivareilles,42091_0100,G,PLACE DU MONUMENT,
312947971,00015,31294797100015,O,1978-01-01,NN,,,2008-01-04T20:18:49,true,3,,,,,LE CHANTIER,42380,ESTIVAREILLES,,,42091,,,,,,,,,,,,,,,,,,,2008-01-01,A,,,,,68.20B,NAFRev2,N,3.999221,45.426291,0.47,street,Chemin de Chabarnier 42380 Estivareilles,42091_0027,G,CHEMIN DE CHABARNIER,
313276883,00011,31327688300011,O,1978-01-01,NN,,,2008-11-07T00:28:30,true,3,,,,RTE,DE LA CHAPELLE,42380,ESTIVAREILLES,,,42091,,,,,,,,,,,,,,,,,,,2004-06-30,F,,,,,02.0B,NAFRev1,N,4.003782,45.420889,0.85,street,Route de la Chapelle 42380 Estivareilles,42091_0005,G,ROUTE DE LA CHAPELLE,
314320961,00019,31432096100019,O,,NN,,,,true,1,,,,,LE CROS,42380,ESTIVAREILLES,,,42091,,,,,,,,,,,,,,,,,,,1978-10-01,F,,,,,45.3A,NAF1993,N,3.980461,45.429927,0.34,street,Route du Crozet 42380 Estivareilles,42091_0034,G,ROUTE DU CROZET,
314735960,00028,31473596000028,O,,NN,,,,true,1,,,,CHE,DU PAVILLON,42380,ESTIVAREILLES,,,42091,,,,,,,,,,,,,,,,,,,1989-11-22,F,,,,,60.06,NAP,N,4.01026,45.417164,0.83,street,Chemin du Pavillon 42380 Estivareilles,42091_0121,G,CHEMIN DU PAVILLON,
317811065,00026,31781106500026,O,1989-09-11,01,2018,,2020-08-25T10:27:29,true,5,,,,,LE BOURG,42380,ESTIVAREILLES,,,42091,,,,,,,,,,,,,,,,,,,2019-06-10,F,,,,,55.10Z,NAFRev2,O,4.017571,45.411921,0.32,street,Route du Bouchet 42380 Estivareilles,42091_0003,G,ROUTE DU BOUCHET,
318675097,00055,31867509700055,O,2004-06-24,NN,,,2018-09-29T12:17:20,false,4,,,,,L ETANG,42380,ESTIVAREILLES,,,42091,,,,,,,,,,,,,,,,,,,2015-12-31,F,,,,,56.10A,NAFRev2,O,4.014087,45.418949,0.91,street,Impasse de l’Étang 42380 Estivareilles,42091_0042,G,IMPASSE DE L ETANG,
319476503,00036,31947650300036,O,1994-03-08,NN,,,2011-04-23T05:02:11,false,5,,,,PL,DU MONUMENT,42380,ESTIVAREILLES,,,42091,,,,,,,,,,,,,,,,,,,2009-03-01,F,,,,,10.71C,NAFRev2,O,4.008504,45.416531,0.82,street,Place du Monument 42380 Estivareilles,42091_0100,G,PLACE DU MONUMENT,
321857104,00012,32185710400012,O,,,,,,true,1,,,,RUE,DU COUVENT,42380,ESTIVAREILLES,,,42091,,,,,,,,,,,,,,,,,,,1985-12-25,F,,,,,62.11,NAP,N,4.009508,45.416011,0.95,street,Rue du Couvent 42380 Estivareilles,42091_0010,G,RUE DU COUVENT,
321999773,00013,32199977300013,O,,,,1610AQ,2015-03-17T00:16:16,true,1,,,,,LIBERCIER,42380,ESTIVAREILLES,,,42091,,,,,,,,,,,,,,,,,,,1984-12-25,F,,,,,02.20,NAP,N,4.002314,45.40992,0.92,street,Chemin de Libercier 42380 Estivareilles,42091_0082,G,CHEMIN DE LIBERCIER,
323581793,00011,32358179300011,O,,NN,,,,true,1,,498,,RTE,NATIONALE,42380,ESTIVAREILLES,,,42091,,,,,,,,,,,,,,,,,,,1987-06-30,F,,,,,65.06,NAP,N,1.2279812,49.230352,0.77,poi,Route Nationale (Pont) Saint-Pierre-du-Vauvray,https://osm.org/way/95838375,G,,
324035393,00010,32403539300010,O,,NN,,,,true,1,,,,,LES GRANGES,42380,ESTIVAREILLES,,,42091,,,,,,,,,,,,,,,,,,,1991-01-18,F,,,,,67.01,NAP,N,3.995414,45.431833,0.51,street,Impasse de Grande Saigne 42380 Estivareilles,42091_0052,G,IMPASSE DE GRANDE SAIGNE,
324043942,00022,32404394200022,O,2003-07-04,NN,,,2011-04-23T05:15:41,true,5,,,,LD,LIBERCIER,42380,ESTIVAREILLES,,,42091,,,,,,,,,,,,,,,,,,,2010-09-13,F,,,,,49.41B,NAFRev2,N,4.002314,45.40992,0.92,street,Chemin de Libercier 42380 Estivareilles,42091_0082,G,CHEMIN DE LIBERCIER,
324147891,00018,32414789100018,O,,NN,,,,true,1,,,,,LE BOURG,42380,ESTIVAREILLES,,,42091,,,,,,,,,,,,,,,,,,,1996-04-24,F,,,,,55.3A,NAF1993,N,4.017571,45.411921,0.32,street,Route du Bouchet 42380 Estivareilles,42091_0003,G,ROUTE DU BOUCHET,
324171750,00015,32417175000015,O,1981-12-31,NN,,,2008-01-04T18:54:12,true,3,,,,,LE BOURG,42380,ESTIVAREILLES,,,42091,,,,,,,,,,,,,,,,,,,2008-01-01,A,,,,,68.20B,NAFRev2,N,4.017571,45.411921,0.32,street,Route du Bouchet 42380 Estivareilles,42091_0003,G,ROUTE DU BOUCHET,
324232255,00012,32423225500012,O,1981-12-31,NN,,,2008-01-04T18:54:47,true,3,,,,,LE BOURG,42380,ESTIVAREILLES,,,42091,,,,,,,,,,,,,,,,,,,2008-01-01,A,,,,,56.10A,NAFRev2,N,4.017571,45.411921,0.32,street,Route du Bouchet 42380 Estivareilles,42091_0003,G,ROUTE DU BOUCHET,
324232255,00020,32423225500020,O,1985-01-01,,,,2021-02-23T10:47:18,false,1,,,,LD,LE PONCHON,42380,ESTIVAREILLES,,,42091,,,,,,,,,,,,,,,,,,,1985-01-01,A,,,,,01.49Z,NAFRev2,N,2.1978905,49.352508,0.88,poi.residential,Le Larris (Zone résidentielle) Ponchon,https://osm.org/way/160571831,G,,
324622208,00019,32462220800019,O,1989-12-04,01,2018,,2020-08-25T10:30:53,true,6,,,,,MAIRIE,42380,ESTIVAREILLES,,,42091,,,,,,,,,,,,,,,,,,,2012-10-01,A,,,,,88.99B,NAFRev2,O,4.008964,45.414329,0.38,street,Impasse de la Carderie 42380 Estivareilles,42091_0006,G,IMPASSE DE LA CARDERIE,
325594620,00016,32559462000016,O,,,,,,true,1,,,,LD,LE CLOS JARRIGE,42380,ESTIVAREILLES,,,42091,,,,,,,,,,,,,,,,,,,1993-07-31,F,,,,,72.4Z,NAF1993,N,4.005819,45.43742,0.32,street,Route du Clos 42380 Estivareilles,42091_0016,G,ROUTE DU CLOS,
328649868,00010,32864986800010,O,1984-01-01,03,2018,,2020-08-25T10:33:21,true,5,LE BOURG,313,,RTE,DU MUSEE,42380,ESTIVAREILLES,,,42091,,,,,,,,,,,,,,,,,,,2019-04-24,F,,,,,46.75Z,NAFRev2,O,4.011403,45.416652,0.84,housenumber,313 Route du Musée 42380 Estivareilles,42091_0115_00313,G,313 ROUTE DU MUSEE,
328993431,00019,32899343100019,O,,NN,,,,true,1,,,,RUE,DU COUVENT,42380,ESTIVAREILLES,,,42091,,,,,,,,,,,,,,,,,,,,F,,,,,62.11,NAP,N,4.009508,45.416011,0.95,street,Rue du Couvent 42380 Estivareilles,42091_0010,G,RUE DU COUVENT,
329014708,00021,32901470800021,O,2007-06-15,,,,2021-02-23T10:49:59,true,2,,,,,LE CHAUFFOUR,42380,ESTIVAREILLES,,,42091,,,,,,,,,,,,,,,,,,,2008-01-01,A,,,,,90.03B,NAFRev2,N,4.028027,45.417174,0.72,street,Chemin du Chauffour 42380 Estivareilles,42091_0011,G,CHEMIN DU CHAUFFOUR,
329863294,00024,32986329400024,O,1992-11-01,NN,,,2008-01-04T19:53:52,true,3,,,,,LA GOUTTE,42380,ESTIVAREILLES,,,42091,,,,,,,,,,,,,,,,,,,2008-01-01,A,,,,,01.46Z,NAFRev2,N,4.013108,45.420053,0.92,street,Chemin de la Goutte 42380 Estivareilles,42091_0050,G,CHEMIN DE LA GOUTTE,
330201609,00014,33020160900014,O,1984-06-09,NN,,,2008-01-04T19:57:18,true,3,,,,LD,LE GROS TERME,42380,ESTIVAREILLES,,,42091,,,,,,,,,,,,,,,,,,,2008-01-01,A,,,,,94.99Z,NAFRev2,N,4.011571,45.417818,0.73,street,Impasse du Gros Terme 42380 Estivareilles,42091_0054,G,IMPASSE DU GROS TERME,
331061499,00017,33106149900017,O,,NN,,,,true,1,,,,LD,L'ECLOSE,42380,ESTIVAREILLES,,,42091,,,,,,,,,,,,,,,,,,,,F,,,,,02.20,NAP,N,4.003319,45.430024,0.62,street,Chemin de l’Écloze 42380 Estivareilles,42091_0036,G,CHEMIN DE L ECLOZE,
331103689,00013,33110368900013,O,1984-11-01,NN,,,2008-01-04T20:08:06,true,3,,,,LD,LA MARGEE,42380,ESTIVAREILLES,,,42091,,,,,,,,,,,,,,,,,,,2008-01-01,A,,,,,01.50Z,NAFRev2,N,4.049819,45.417791,0.92,street,Route de la Margée 42380 Estivareilles,42091_0088,G,ROUTE DE LA MARGEE,
332881523,00010,33288152300010,O,,NN,,,,true,1,,,,PL,DU MONUMENT,42380,ESTIVAREILLES,,,42091,,,,,,,,,,,,,,,,,,,1989-09-06,F,,,,,38.40,NAP,N,4.008504,45.416531,0.82,street,Place du Monument 42380 Estivareilles,42091_0100,G,PLACE DU MONUMENT,
333491041,00062,33349104100062,O,2001-01-01,NN,,,2012-05-05T02:20:46,false,4,,,,,EGARANDE,42380,ESTIVAREILLES,,,42091,,,,,,,,,,,,,,,,,,,2010-05-31,A,,,,,87.90A,NAFRev2,N,4.00514,45.441308,0.92,street,Route d’Égarande 42380 Estivareilles,42091_0040,G,ROUTE D EGARANDE,
334390358,00011,33439035800011,O,,NN,,,,true,1,,,,LD,AU BOURG,42380,ESTIVAREILLES,,,42091,,,,,,,,,,,,,,,,,,,1994-12-31,F,,,,,17.1C,NAF1993,N,4.017571,45.411921,0.42,street,Route du Bouchet 42380 Estivareilles,42091_0003,G,ROUTE DU BOUCHET,
338203607,00019,33820360700019,O,,NN,,,,true,1,,,,,A PICHILLON,42380,ESTIVAREILLES,,,42091,,,,,,,,,,,,,,,,,,,1987-10-01,F,,,,,02.20,NAP,N,4.04143,45.422549,0.78,street,Route de Pichillon 42380 Estivareilles,42091_0124,G,ROUTE DE PICHILLON,
338294044,00031,33829404400031,O,1997-01-01,NN,,,2009-06-27T05:14:04,true,4,,,,,LE BOURG,42380,ESTIVAREILLES,,,42091,,,,,,,,,,,,,,,,,,,2007-11-26,F,,,,,55.4C,NAFRev1,O,4.017571,45.411921,0.32,street,Route du Bouchet 42380 Estivareilles,42091_0003,G,ROUTE DU BOUCHET,
338670094,00014,33867009400014,O,1986-08-01,NN,,,2012-01-12T06:02:59,true,4,,,,,LA GOUTTE,42380,ESTIVAREILLES,,,42091,,,,,,,,,,,,,,,,,,,2011-12-31,F,,,,,01.46Z,NAFRev2,N,4.013108,45.420053,0.92,street,Chemin de la Goutte 42380 Estivareilles,42091_0050,G,CHEMIN DE LA GOUTTE,
339109688,00012,33910968800012,O,1986-10-11,NN,,,,true,1,,,,LD,L ECLOZE,42380,ESTIVAREILLES,,,42091,,,,,,,,,,,,,,,,,,,1998-10-31,F,,,,,02.0B,NAF1993,N,4.003319,45.430024,0.92,street,Chemin de l’Écloze 42380 Estivareilles,42091_0036,G,CHEMIN DE L ECLOZE,
340252857,00016,34025285700016,O,1987-01-01,NN,,,2018-01-17T08:27:50,true,3,,,,LD,VIVIERS,42380,ESTIVAREILLES,,,42091,,,,,,,,,,,,,,,,,,,2008-01-01,A,,,,,01.41Z,NAFRev2,N,4.030852,45.436621,0.92,street,Route de Viviers 42380 Estivareilles,42091_0178,G,ROUTE DE VIVIERS,
340588011,00015,34058801100015,O,,NN,,,,true,1,,,,,AU BOURG,42380,ESTIVAREILLES,,,42091,,,,,,,,,,,,,,,,,,,1992-06-30,F,,,,,02.0B,NAF1993,N,4.017571,45.411921,0.42,street,Route du Bouchet 42380 Estivareilles,42091_0003,G,ROUTE DU BOUCHET,
340812999,00019,34081299900019,O,1987-04-06,NN,,,2013-05-18T03:54:18,true,5,,,,RUE,DU PAVILLON,42380,ESTIVAREILLES,,,42091,,,,,,,,,,,,,,,,,,,2011-12-31,F,,,,,43.34Z,NAFRev2,O,4.01026,45.417164,0.71,street,Chemin du Pavillon 42380 Estivareilles,42091_0121,G,CHEMIN DU PAVILLON,
341169985,00015,34116998500015,O,1987-04-01,NN,,,,true,1,,,,,LE BOURG,42380,ESTIVAREILLES,,,42091,,,,,,,,,,,,,,,,,,,2000-12-31,F,,,,,52.4Z,NAF1993,N,4.017571,45.411921,0.32,street,Route du Bouchet 42380 Estivareilles,42091_0003,G,ROUTE DU BOUCHET,
341609931,00017,34160993100017,O,1987-05-01,NN,,,2008-01-04T21:54:17,true,3,,,,,,42380,ESTIVAREILLES,,,42091,,,,,,,,,,,,,,,,,,,2008-01-01,A,,,,,91.03Z,NAFRev2,N,,,0,,,,,,
342559598,00012,34255959800012,O,,NN,,,,true,1,,,,,A PICHILLON,42380,ESTIVAREILLES,,,42091,,,,,,,,,,,,,,,,,,,1996-12-31,F,,,,,02.0B,NAF1993,N,4.04143,45.422549,0.78,street,Route de Pichillon 42380 Estivareilles,42091_0124,G,ROUTE DE PICHILLON,
343381497,00019,34338149700019,O,1988-01-01,NN,,,2019-06-13T14:40:54,true,3,MONTONNET,,,,2247 ROUTE DU BOUCHET,42380,ESTIVAREILLES,,,42091,,,,,,,,,,,,,,,,,,,2008-01-01,A,,,,,01.41Z,NAFRev2,N,4.035871,45.411243,0.95,housenumber,2247 Route du Bouchet 42380 Estivareilles,42091_0003_02247,G,2247 ROUTE DU BOUCHET,
343651212,00015,34365121200015,O,,NN,,,,true,1,,,,,L'ETANG,42380,ESTIVAREILLES,,,42091,,,,,,,,,,,,,,,,,,,1995-12-31,F,,,,,45.3A,NAF1993,O,4.014087,45.418949,0.91,street,Impasse de l’Étang 42380 Estivareilles,42091_0042,G,IMPASSE DE L ETANG,
344407986,00019,34440798600019,O,1988-04-01,NN,,4520AB,2021-02-23T10:59:26,true,4,LE GENERRET,235,,RTE,DE SAINT BONNET,42380,ESTIVAREILLES,,,42091,,,,,,,,,,,,,,,,,,,2011-08-27,A,,,,,45.11Z,NAFRev2,O,4.017251,45.419714,0.87,housenumber,235 Route de Saint Bonnet 42380 Estivareilles,42091_0152_00235,G,235 ROUTE DE SAINT BONNET,
347720120,00067,34772012000067,O,2006-01-01,NN,,,2009-06-27T05:43:35,false,2,,,,,LE CHANTIER,42380,ESTIVAREILLES,,,42091,,,,,,,,,,,,,,,,,,,2007-04-26,F,,,,,51.5F,NAFRev1,O,3.999221,45.426291,0.47,street,Chemin de Chabarnier 42380 Estivareilles,42091_0027,G,CHEMIN DE CHABARNIER,
349795724,00013,34979572400013,O,1989-02-01,NN,,,2008-01-04T23:08:49,true,3,,,,,SOULACROUX,42380,ESTIVAREILLES,,,42091,,,,,,,,,,,,,,,,,,,2008-01-01,A,,,,,01.41Z,NAFRev2,N,4.021076,45.451622,0.93,street,Route de Soulacroux 42380 Estivareilles,42091_0154,G,ROUTE DE SOULACROUX,
356000828,04754,35600082804754,O,1991-01-01,NN,,,2006-10-28T00:12:14,false,3,,,,,LE BOURG,42380,ESTIVAREILLES,,,42091,,,,,,,,,,,,,,,,,,,2005-10-01,F,BUREAU DE POSTE,,,,64.1A,NAFRev1,O,4.017571,45.411921,0.32,street,Route du Bouchet 42380 Estivareilles,42091_0003,G,ROUTE DU BOUCHET,
377771779,00016,37777177900016,O,,NN,,,,true,1,,,,,LE BOURG,42380,ESTIVAREILLES,,,42091,,,,,,,,,,,,,,,,,,,1991-12-31,F,,,,,67.01,NAP,N,4.017571,45.411921,0.32,street,Route du Bouchet 42380 Estivareilles,42091_0003,G,ROUTE DU BOUCHET,
378136873,00023,37813687300023,O,1980-01-01,NN,,,2007-02-22T10:54:31,false,3,,,,,SOULACROUX,42380,ESTIVAREILLES,,,42091,,,,,,,,,,,,,,,,,,,2007-01-01,F,,,,,01.1A,NAFRev1,N,4.021076,45.451622,0.93,street,Route de Soulacroux 42380 Estivareilles,42091_0154,G,ROUTE DE SOULACROUX,
379246226,00011,37924622600011,O,1984-07-01,NN,,,2008-01-04T21:26:50,true,3,,,,,L ECLOSE,42380,ESTIVAREILLES,,,42091,,,,,,,,,,,,,,,,,,,2008-01-01,A,,,,,01.42Z,NAFRev2,N,4.003319,45.430024,0.62,street,Chemin de l’Écloze 42380 Estivareilles,42091_0036,G,CHEMIN DE L ECLOZE,
379246317,00018,37924631700018,O,,NN,,,,true,1,,,,,L ECLOSE,42380,ESTIVAREILLES,,,42091,,,,,,,,,,,,,,,,,,,1994-12-31,F,,,,,02.0B,NAF1993,N,4.003319,45.430024,0.62,street,Chemin de l’Écloze 42380 Estivareilles,42091_0036,G,CHEMIN DE L ECLOZE,
379246408,00015,37924640800015,O,,NN,,,,true,1,,,,,L ECLOSE,42380,ESTIVAREILLES,,,42091,,,,,,,,,,,,,,,,,,,1994-12-31,F,,,,,02.0B,NAF1993,N,4.003319,45.430024,0.62,street,Chemin de l’Écloze 42380 Estivareilles,42091_0036,G,CHEMIN DE L ECLOZE,
380432583,00017,38043258300017,O,,NN,,,,true,1,,,,,LE CROS,42380,ESTIVAREILLES,,,42091,,,,,,,,,,,,,,,,,,,1994-08-30,F,,,,,20.1A,NAF1993,O,3.980461,45.429927,0.34,street,Route du Crozet 42380 Estivareilles,42091_0034,G,ROUTE DU CROZET,
380908376,00011,38090837600011,O,1991-01-01,NN,,,,false,4,,,,,,42380,ESTIVAREILLES,,,42091,,,,,,,,,,,,,,,,,,,2000-10-19,F,,,,,91.3E,NAF1993,O,,,0,,,,,,
380908376,00029,38090837600029,O,2000-10-19,02,2018,,2021-07-21T08:43:08,true,4,,,,,LE BOURG ANCIENNE MAIRIE,42380,ESTIVAREILLES,,,42091,,,,,,,,,,,,,,,,,,,2021-05-27,A,,,,,94.99Z,NAFRev2,N,4.1109495,46.8789072,0.89,poi.bus_stop,Le Bourg Ancienne Mairie (Arrêt de bus) La Comelle,https://osm.org/node/2770336013,G,,
381808385,00011,38180838500011,O,,NN,,,,true,1,,,,,MONTBUZAC,42380,ESTIVAREILLES,,,42091,,,,,,,,,,,,,,,,,,,1996-06-30,F,,,,,74.1J,NAF1993,N,4.020008,45.452352,0.91,street,Chemin des Hauts de Montbuzac 42380 Estivareilles,42091_0056,G,CHEMIN DES HAUTS DE MONTBUZAC,
382203214,00020,38220321400020,O,1996-04-02,NN,,,2014-02-24T08:47:18,true,13,,,,RTE,DU 21 AOUT 1944,42380,ESTIVAREILLES,,,42091,,,,,,,,,,,,,,,,,,,2008-05-15,A,,,,,56.10C,NAFRev2,N,4.00887,45.415506,0.81,street,Rue du 21 Aout 1944 42380 Estivareilles,42091_0002,G,RUE DU 21 AOUT 1944,
382549061,00010,38254906100010,O,1991-07-01,NN,,,2008-01-04T22:11:36,true,4,,,,,LE BOUCHET,42380,ESTIVAREILLES,,,42091,,,,,,,,,,,,,,,,,,,2008-01-01,A,,,,,68.20B,NAFRev2,N,4.017571,45.411921,0.68,street,Route du Bouchet 42380 Estivareilles,42091_0003,G,ROUTE DU BOUCHET,
384366183,00018,38436618300018,O,,NN,,,,true,1,,,,PL,DU MONUMENT,42380,ESTIVAREILLES,,,42091,,,,,,,,,,,,,,,,,,,1994-02-28,F,,,,,15.8C,NAF1993,O,4.008504,45.416531,0.82,street,Place du Monument 42380 Estivareilles,42091_0100,G,PLACE DU MONUMENT,
384597191,00012,38459719100012,O,1992-02-03,NN,,3312ZA,2015-03-18T01:05:39,true,4,,,,,LES ECHANAUX,42380,ESTIVAREILLES,,,42091,,,,,,,,,,,,,,,,,,,2013-12-31,F,,,,,33.12Z,NAFRev2,N,4.003782,45.420889,0.31,street,Route de la Chapelle 42380 Estivareilles,42091_0005,G,ROUTE DE LA CHAPELLE,
388147308,00018,38814730800018,O,1974-01-01,NN,,,2017-08-28T09:10:29,false,3,,,,LD,LA MAISONNEUVE,42380,ESTIVAREILLES,,,42091,,,,,,,,,,,,,,,,,,,2006-12-31,F,,,,,01.4A,NAFRev1,N,4.03264,45.421394,0.92,street,Impasse de la Maisonneuve 42380 Estivareilles,42091_0085,G,IMPASSE DE LA MAISONNEUVE,
388147308,00026,38814730800026,O,2017-06-29,,,,2019-08-07T03:38:04,true,2,,,,,PLACE DU MONUMENT,42380,ESTIVAREILLES,,,42091,,,,,,,,,,,,,,,,,,,2018-06-25,F,,,,,35.11Z,NAFRev2,N,4.008504,45.416531,0.94,street,Place du Monument 42380 Estivareilles,42091_0100,G,PLACE DU MONUMENT,
388778664,00010,38877866400010,O,1992-10-01,NN,,,2007-05-19T11:19:47,true,5,,,,,LE CHANTIER,42380,ESTIVAREILLES,,,42091,,,,,,,,,,,,,,,,,,,2005-12-31,F,,,,,52.4Y,NAFRev1,O,3.999221,45.426291,0.47,street,Chemin de Chabarnier 42380 Estivareilles,42091_0027,G,CHEMIN DE CHABARNIER,
389436262,00015,38943626200015,O,1983-05-01,NN,,,2016-10-17T09:17:59,false,4,,,,,TORTOREL,42380,ESTIVAREILLES,,,42091,,,,,,,,,,,,,,,,,,,2016-04-30,F,,,,,01.41Z,NAFRev2,N,4.0328121,45.4359286,0.88,poi.information,Tortorel (Informations) Estivareilles,https://osm.org/node/1369136297,G,,
389692922,00013,38969292200013,O,1992-12-15,NN,,,2006-10-28T01:31:03,true,3,,,,,LE CHABANY,42380,ESTIVAREILLES,,,42091,,,,,,,,,,,,,,,,,,,2005-09-30,F,,,,,01.2C,NAFRev1,N,4.008992,45.459796,0.68,street,Impasse du Chabany 42380 Estivareilles,42091_0026,G,IMPASSE DU CHABANY,