siren,nic,siret,statutDiffusionEtablissement,dateCreationEtablissement,trancheEffectifsEtablissement,anneeEffectifsEtablissement,activitePrincipaleRegistreMetiersEtablissement,dateDernierTraitementEtablissement,etablissementSiege,nombrePeriodesEtablissement,complementAdresseEtablissement,numeroVoieEtablissement,indiceRepetitionEtablissement,typeVoieEtablissement,libelleVoieEtablissement,codePostalEtablissement,libelleCommuneEtablissement,libelleCommuneEtrangerEtablissement,distributionSpecialeEtablissement,codeCommuneEtablissement,codeCedexEtablissement,libelleCedexEtablissement,codePaysEtrangerEtablissement,libellePaysEtrangerEtablissement,complementAdresse2Etablissement,numeroVoie2Etablissement,indiceRepetition2Etablissement,typeVoie2Etablissement,libelleVoie2Etablissement,codePostal2Etablissement,libelleCommune2Etablissement,libelleCommuneEtranger2Etablissement,distributionSpeciale2Etablissement,codeCommune2Etablissement,codeCedex2Etablissement,libelleCedex2Etablissement,codePaysEtranger2Etablissement,libellePaysEtranger2Etablissement,dateDebut,etatAdministratifEtablissement,enseigne1Etablissement,enseigne2Etablissement,enseigne3Etablissement,denominationUsuelleEtablissement,activitePrincipaleEtablissement,nomenclatureActivitePrincipaleEtablissement,caractereEmployeurEtablissement,longitude,latitude,geo_score,geo_type,geo_adresse,geo_id,geo_ligne,geo_l4,geo_l5
214603375,00012,21460337500012,O,1983-03-01,02,2018,,2020-08-25T10:17:27,true,4,,,,,,46200,MAYRAC,,,46337,,,,,,,,,,,,,,,,,,,2008-01-01,A,MAIRIE,,,,84.11Z,NAFRev2,O,,,0,,,,,,
214603375,00020,21460337500020,O,1983-12-21,01,2018,,2020-08-25T10:17:27,false,3,,,,,,46200,MAYRAC,,,46337,,,,,,,,,,,,,,,,,,,2008-01-01,A,ECOLE PRIMAIRE PUBLIQUE,,,,85.20Z,NAFRev2,N,,,0,,,,,,
264604364,00010,26460436400010,O,1984-11-20,NN,,,2017-08-06T14:12:09,true,4,,,,,MAIRIE,46200,MAYRAC,,,46337,,,,,,,,,,,,,,,,,,,2017-08-01,F,CCAS,,,,88.99B,NAFRev2,N,3.0709671,50.6304695,0.92,poi.townhall,Hôtel de Ville Lille,https://osm.org/way/40917078,G,,
294601620,00015,29460162000015,O,1983-09-14,01,2018,,2020-08-25T10:21:34,true,4,,,,,MAIRIE,46200,MAYRAC,,,46337,,,,,,,,,,,,,,,,,,,2019-10-23,A,,,,,36.00Z,NAFRev2,N,3.0709671,50.6304695,0.92,poi.townhall,Hôtel de Ville Lille,https://osm.org/way/40917078,G,,
303882898,00016,30388289800016,O,,,,,,true,1,,,,LD,LE PIGEON,46200,MAYRAC,,,46337,,,,,,,,,,,,,,,,,,,1988-05-25,F,,,,,67.01,NAP,N,1.534396,44.905224,0.92,locality,Le Pigeon Bas 46200 Mayrac,46337_B059,G,LE PIGEON BAS,
304226830,00020,30422683000020,O,2017-07-15,,,,2018-03-02T11:43:23,true,1,,,,,LE GARRIT HAUT,46200,MAYRAC,,,46337,,,,,,,,,,,,,,,,,,,2017-07-15,A,,,,,68.20A,NAFRev2,N,1.545241,44.894269,0.93,locality,Le Garrit Haut 46200 Mayrac,46337_B033,G,LE GARRIT HAUT,
304360290,00015,30436029000015,O,,,,,,true,1,,,,LD,LE PIGEON,46200,MAYRAC,,,46337,,,,,,,,,,,,,,,,,,,1984-12-25,F,,,,,55.73,NAP,N,1.534396,44.905224,0.92,locality,Le Pigeon Bas 46200 Mayrac,46337_B059,G,LE PIGEON BAS,
309812063,00050,30981206300050,O,2012-05-21,,,3109BA,2021-02-23T10:38:27,true,1,,,,,LD LE FUSTIE,46200,MAYRAC,,,46337,,,,,,,,,,,,,,,,,,,2012-05-21,A,ANTIQUITES DU CAUSSE,,,,47.79Z,NAFRev2,N,1.52102,44.893948,0.36,locality,Le Faget Haut 46200 Mayrac,46337_B030,G,LE FAGET HAUT,
315745943,00011,31574594300011,O,1900-01-01,NN,,,2006-11-25T09:37:15,true,3,,,,,,46200,MAYRAC,,,46337,,,,,,,,,,,,,,,,,,,2005-12-31,F,,,,,52.6E,NAFRev1,N,,,0,,,,,,
316809805,00013,31680980500013,O,,,,,2007-01-18T09:14:28,true,1,,,,LD,LE FAGET,46200,MAYRAC,,,46337,,,,,,,,,,,,,,,,,,,1984-06-06,F,,,,,01.2G,NAF1993,N,1.527604,44.893804,0.92,locality,Le Faget Bas 46200 Mayrac,46337_B029,G,LE FAGET BAS,
317230621,00029,31723062100029,O,1984-01-20,NN,,,2014-07-08T00:20:58,true,6,,,,,LES AGASSES,46200,MAYRAC,,,46337,,,,,,,,,,,,,,,,,,,2010-11-06,F,,,,,43.91B,NAFRev2,N,,,0,,,,,,
322119124,00012,32211912400012,O,1981-04-13,NN,,,2021-02-09T09:24:39,true,3,,,,,,46200,MAYRAC,,,46337,,,,,,,,,,,,,,,,,,,2008-01-01,A,,,,,01.42Z,NAFRev2,N,,,0,,,,,,
322511064,00014,32251106400014,O,,NN,,,,true,1,,,,,,46200,MAYRAC,,,46337,,,,,,,,,,,,,,,,,,,1988-06-14,F,,,,,55.60,NAP,N,,,0,,,,,,
324324797,00020,32432479700020,O,1994-07-01,NN,,4312BB,2021-02-23T10:47:21,true,4,,,,,LD RAISADE,46200,MAYRAC,,,46337,,,,,,,,,,,,,,,,,,,2008-02-12,A,MINAGE SERVICE ET TP SERVICE 46,,,,43.12A,NAFRev2,N,1.55371,44.902561,0.45,street,Rayjade 46200 Mayrac,46337_rq355a,G,RAYJADE,
325111946,00019,32511194600019,O,1981-05-26,NN,,,2016-02-02T14:21:23,false,4,,,,,,46200,MAYRAC,,,46337,,,,,,,,,,,,,,,,,,,2016-01-14,F,,,,,01.61Z,NAFRev2,N,,,0,,,,,,
325111946,00027,32511194600027,O,2016-01-14,,,,2021-02-23T10:47:45,true,1,LE FAGET,,,,CHEZ LE PRESIDENT,46200,MAYRAC,,,46337,,,,,,,,,,,,,,,,,,,2016-01-14,A,,,,,01.61Z,NAFRev2,N,,,0,,,,,,
331453654,00021,33145365400021,O,1996-01-01,NN,,,,true,3,,,,,,46200,MAYRAC,,,46337,,,,,,,,,,,,,,,,,,,2000-12-31,F,,,,,00.0Z,NAF1993,N,,,0,,,,,,
334201811,00018,33420181100018,O,1984-12-18,NN,,,,true,1,,,,LD,LE GARRIT HAUT,46200,MAYRAC,,,46337,,,,,,,,,,,,,,,,,,,1998-12-31,F,,,,,01.2A,NAF1993,N,1.545241,44.894269,0.93,locality,Le Garrit Haut 46200 Mayrac,46337_B033,G,LE GARRIT HAUT,
340585124,00019,34058512400019,O,1987-03-15,NN,,,2007-08-22T06:49:58,true,4,,,,,,46200,MAYRAC,,,46337,,,,,,,,,,,,,,,,,,,2006-12-31,F,,,,,01.1D,NAFRev1,N,,,0,,,,,,
343440608,00010,34344060800010,O,,NN,,,,true,1,,,,,LE FAGET,46200,MAYRAC,,,46337,,,,,,,,,,,,,,,,,,,1993-06-11,F,,,,,01.3Z,NAF1993,N,1.527604,44.893804,0.92,locality,Le Faget Bas 46200 Mayrac,46337_B029,G,LE FAGET BAS,
347838641,00012,34783864100012,O,1988-05-06,NN,,,2010-04-18T05:10:00,true,4,,,,,LE FAGET,46200,MAYRAC,,,46337,,,,,,,,,,,,,,,,,,,2008-01-01,A,,,,,01.50Z,NAFRev2,N,1.527604,44.893804,0.92,locality,Le Faget Bas 46200 Mayrac,46337_B029,G,LE FAGET BAS,
349761171,00017,34976117100017,O,1989-03-01,NN,,,2008-01-04T23:08:25,true,3,,,,,AU PIT,46200,MAYRAC,,,46337,,,,,,,,,,,,,,,,,,,2008-01-01,A,,,,,68.20A,NAFRev2,N,4.2986693,46.9481586,0.89,poi.cafe,Au Pit' Café Autun,https://osm.org/node/4973168532,G,,
350624995,00014,35062499500014,O,1989-04-01,NN,,,,true,1,,,,,,46200,MAYRAC,,,46337,,,,,,,,,,,,,,,,,,,2000-12-31,F,,,,,55.2E,NAF1993,N,,,0,,,,,,
350778569,00060,35077856900060,O,2010-12-13,,,,2012-11-09T00:41:30,false,2,,,,LD,LE PIGEON BAS,46200,MAYRAC,,,46337,,,,,,,,,,,,,,,,,,,2011-08-01,F,,,,,01.28Z,NAFRev2,N,1.534396,44.905224,0.93,locality,Le Pigeon Bas 46200 Mayrac,46337_B059,G,LE PIGEON BAS,
350778569,00078,35077856900078,O,2011-01-01,,,2341ZZ,2016-08-19T03:34:45,true,1,,,,LD,LD LE PIGEON BAS,46200,MAYRAC,,,46337,,,,,,,,,,,,,,,,,,,2011-01-01,A,,,,,23.41Z,NAFRev2,N,1.534396,44.905224,0.93,locality,Le Pigeon Bas 46200 Mayrac,46337_B059,G,LE PIGEON BAS,
351612528,00015,35161252800015,O,,NN,,,,true,1,,,,LD,LE PIGEON,46200,MAYRAC,,,46337,,,,,,,,,,,,,,,,,,,1991-12-31,F,,,,,57.05,NAP,N,1.534396,44.905224,0.92,locality,Le Pigeon Bas 46200 Mayrac,46337_B059,G,LE PIGEON BAS,
353567597,00011,35356759700011,O,1990-01-12,NN,,,2008-01-04T23:55:53,true,3,,,,,LE PIGEON,46200,MAYRAC,,,46337,,,,,,,,,,,,,,,,,,,2008-01-01,A,,,,,68.20A,NAFRev2,N,1.534396,44.905224,0.92,locality,Le Pigeon Bas 46200 Mayrac,46337_B059,G,LE PIGEON BAS,
380545483,00014,38054548300014,O,1990-01-01,NN,,,,true,1,,,,,,46200,MAYRAC,,,46337,,,,,,,,,,,,,,,,,,,1999-09-30,F,,,,,01.1A,NAF1993,N,,,0,,,,,,
383052677,00010,38305267700010,O,1991-09-20,NN,,,,true,1,,,,,LAUMEDE,46200,MAYRAC,,,46337,,,,,,,,,,,,,,,,,,,1999-11-30,F,,,,,01.3Z,NAF1993,N,1.56372,44.908167,0.33,locality,Le Colombier de Labbunhies 46200 Mayrac,46337_B015,G,LE COLOMBIER DE LABBUNHIES,
388241549,00012,38824154900012,O,,NN,,,,true,1,,,,,PIC,46200,MAYRAC,,,46337,,,,,,,,,,,,,,,,,,,1996-09-30,F,,,,,45.4M,NAF1993,N,1.534396,44.905224,0.37,locality,Le Pigeon Bas 46200 Mayrac,46337_B059,G,LE PIGEON BAS,
388264681,00015,38826468100015,O,1992-01-01,NN,,,2012-02-24T08:32:53,true,4,,,,LD,LE PIGEON,46200,MAYRAC,,,46337,,,,,,,,,,,,,,,,,,,2004-07-01,F,,,,,60.2L,NAFRev1,O,1.534396,44.905224,0.92,locality,Le Pigeon Bas 46200 Mayrac,46337_B059,G,LE PIGEON BAS,
388409856,00019,38840985600019,O,1983-01-01,NN,,,2006-10-28T01:21:45,true,3,,,,,LE PIGEON,46200,MAYRAC,,,46337,,,,,,,,,,,,,,,,,,,2004-07-01,F,,,,,01.2A,NAFRev1,N,1.534396,44.905224,0.92,locality,Le Pigeon Bas 46200 Mayrac,46337_B059,G,LE PIGEON BAS,
388493082,00019,38849308200019,O,1992-09-01,NN,,,,true,4,,,,LD,LE PIGEON,46200,MAYRAC,,,46337,,,,,,,,,,,,,,,,,,,2001-08-01,F,,,,,55.1A,NAF1993,O,1.534396,44.905224,0.92,locality,Le Pigeon Bas 46200 Mayrac,46337_B059,G,LE PIGEON BAS,
389996414,00014,38999641400014,O,1993-01-01,03,2018,4299ZP,2020-08-25T10:25:02,true,4,,,,,LE BOURG,46200,MAYRAC,,,46337,,,,,,,,,,,,,,,,,,,2008-12-31,A,,,,,81.30Z,NAFRev2,O,1.56372,44.908167,0.31,locality,Le Colombier de Labbunhies 46200 Mayrac,46337_B015,G,LE COLOMBIER DE LABBUNHIES,
391993334,00013,39199333400013,O,1986-01-01,NN,,,2013-01-28T16:23:45,true,4,,,,,,46200,MAYRAC,,,46337,,,,,,,,,,,,,,,,,,,2012-12-31,F,,,,,01.46Z,NAFRev2,N,,,0,,,,,,
392025938,00011,39202593800011,O,1993-06-11,NN,,,2008-01-05T00:00:12,true,3,,,,,,46200,MAYRAC,,,46337,,,,,,,,,,,,,,,,,,,2008-01-01,A,,,,,01.50Z,NAFRev2,N,,,0,,,,,,
392362778,00012,39236277800012,O,1993-07-29,NN,,,2021-02-23T11:18:10,true,3,,,,,LE PIGEON HAUT,46200,MAYRAC,,,46337,,,,,,,,,,,,,,,,,,,2008-01-01,A,,,,,01.45Z,NAFRev2,N,1.522505,44.903561,0.93,locality,Le Pigeon Haut 46200 Mayrac,46337_B060,G,LE PIGEON HAUT,
394259519,00012,39425951900012,O,1993-01-01,NN,,,2007-01-18T09:35:28,true,3,,,,,,46200,MAYRAC,,,46337,,,,,,,,,,,,,,,,,,,2002-12-31,F,,,,,01.1A,NAF1993,N,,,0,,,,,,
395344948,00017,39534494800017,O,1994-04-28,NN,,4520AB,2015-03-17T00:41:48,true,6,,,,LD,LE PIGEON,46200,MAYRAC,,,46337,,,,,,,,,,,,,,,,,,,2012-06-30,A,,,,,45.20A,NAFRev2,N,1.534396,44.905224,0.92,locality,Le Pigeon Bas 46200 Mayrac,46337_B059,G,LE PIGEON BAS,
397685918,00013,39768591800013,O,1976-02-28,02,2018,,2020-08-25T10:30:12,true,4,,,,,LE GARRIT,46200,MAYRAC,,,46337,,,,,,,,,,,,,,,,,,,2008-01-01,A,,,,,01.50Z,NAFRev2,N,1.539765,44.896563,0.92,locality,Le Garrit Bas 46200 Mayrac,46337_B032,G,LE GARRIT BAS,
397692070,00014,39769207000014,O,1984-06-06,,,,2016-04-27T08:36:43,true,4,LE FAGET,,,LD,LE FAGET,46200,MAYRAC,,,46337,,,,,,,,,,,,,,,,,,,2015-03-17,A,,,,,68.20A,NAFRev2,N,1.527604,44.893804,0.92,locality,Le Faget Bas 46200 Mayrac,46337_B029,G,LE FAGET BAS,
399915248,00021,39991524800021,O,2008-02-01,,,,2008-03-10T14:30:20,true,1,,,,,DOUCEMENDE,46200,MAYRAC,,,46337,,,,,,,,,,,,,,,,,,,2008-02-01,A,,,,,01.50Z,NAFRev2,N,,,0,,,,,,
404564338,00014,40456433800014,O,1976-01-01,NN,,,2016-12-13T03:11:24,true,5,,,,,LES GREZALS,46200,MAYRAC,,,46337,,,,,,,,,,,,,,,,,,,2017-01-01,A,,,,,01.50Z,NAFRev2,N,,,0,,,,,,
404564346,00017,40456434600017,O,1983-03-01,NN,,,2008-12-22T14:28:01,true,5,,,,,LE GARRIT,46200,MAYRAC,,,46337,,,,,,,,,,,,,,,,,,,2008-08-27,F,,,,,01.46Z,NAFRev2,N,1.539765,44.896563,0.92,locality,Le Garrit Bas 46200 Mayrac,46337_B032,G,LE GARRIT BAS,
404564353,00013,40456435300013,O,1985-11-08,NN,,,2008-01-04T20:42:32,true,3,,,,,LA RAISADE,46200,MAYRAC,,,46337,,,,,,,,,,,,,,,,,,,2008-01-01,A,,,,,01.11Z,NAFRev2,N,1.55371,44.902561,0.35,street,Rayjade 46200 Mayrac,46337_rq355a,G,RAYJADE,
404564361,00016,40456436100016,O,1992-01-01,NN,,,2008-01-04T20:42:32,true,3,,,,,LE FAGET,46200,MAYRAC,,,46337,,,,,,,,,,,,,,,,,,,2008-01-01,A,,,,,01.42Z,NAFRev2,N,1.527604,44.893804,0.92,locality,Le Faget Bas 46200 Mayrac,46337_B029,G,LE FAGET BAS,
404564379,00018,40456437900018,O,1994-03-01,NN,,,2019-04-09T03:56:24,true,4,,,,,,46200,MAYRAC,,,46337,,,,,,,,,,,,,,,,,,,2018-12-31,F,,,,,01.11Z,NAFRev2,N,,,0,,,,,,
408111623,00026,40811162300026,O,2005-07-01,,,,2006-10-28T03:31:59,true,2,,,,LD,LE CASTANET,46200,MAYRAC,,,46337,,,,,,,,,,,,,,,,,,,2005-07-02,F,,,,,70.2A,NAFRev1,N,1.56372,44.908167,0.32,locality,Le Colombier de Labbunhies 46200 Mayrac,46337_B015,G,LE COLOMBIER DE LABBUNHIES,
408114643,00021,40811464300021,O,2007-02-01,,,,2008-02-21T08:45:50,true,5,DOUCEMENDE,,,,,46200,MAYRAC,,,46337,,,,,,,,,,,,,,,,,,,2008-01-31,F,,,,,01.24Z,NAFRev2,N,,,0,,,,,,
408115756,00012,40811575600012,O,1982-06-06,NN,,,,true,1,,,,,REYJADE,46200,MAYRAC,,,46337,,,,,,,,,,,,,,,,,,,2000-02-18,F,,,,,01.3Z,NAF1993,N,1.55371,44.902561,0.58,street,Rayjade 46200 Mayrac,46337_rq355a,G,RAYJADE,
408416790,00025,40841679000025,O,1999-12-01,NN,,,2007-02-02T06:42:39,true,3,,,,,LE PIGEON HAUT,46200,MAYRAC,,,46337,,,,,,,,,,,,,,,,,,,2007-01-31,F,,,,,52.6D,NAFRev1,N,1.522505,44.903561,0.93,locality,Le Pigeon Haut 46200 Mayrac,46337_B060,G,LE PIGEON HAUT,
408712883,00011,40871288300011,O,1996-07-31,NN,,,2010-06-06T18:17:56,true,4,,,,,LAC REDON,46200,MAYRAC,,,46337,,,,,,,,,,,,,,,,,,,2009-09-09,F,,,,,46.74A,NAFRev2,N,1.544658,44.896991,0.93,locality,Lac Redon 46200 Mayrac,46337_B037,G,LAC REDON,
413317116,00023,41331711600023,O,2018-04-02,,,8121ZZ,2021-02-23T11:35:39,true,1,,,,LD,DONNIX,46200,MAYRAC,,,46337,,,,,,,,,,,,,,,,,,,2018-04-02,A,,,,,81.21Z,NAFRev2,N,,,0,,,,,,
414997171,00015,41499717100015,O,1998-01-01,NN,,,2021-02-23T11:37:28,true,3,,,,,LE FAGET,46200,MAYRAC,,,46337,,,,,,,,,,,,,,,,,,,2008-01-01,A,,,,,01.41Z,NAFRev2,N,1.527604,44.893804,0.92,locality,Le Faget Bas 46200 Mayrac,46337_B029,G,LE FAGET BAS,
418011961,00012,41801196100012,O,1998-01-01,NN,,,2014-09-13T12:31:39,true,4,CHEZ ARLIE EDMOND,,,,,46200,MAYRAC,,,46337,,,,,,,,,,,,,,,,,,,2014-09-08,F,,,,,70.10Z,NAFRev2,N,,,0,,,,,,
420607558,00046,42060755800046,O,2016-11-01,,,,2021-02-23T11:41:44,true,1,,,,LD,LE GARRIT,46200,MAYRAC,,,46337,,,,,,,,,,,,,,,,,,,2016-11-01,A,,,,,46.19B,NAFRev2,N,1.539765,44.896563,0.92,locality,Le Garrit Bas 46200 Mayrac,46337_B032,G,LE GARRIT BAS,
423583590,00017,42358359000017,O,1999-01-01,NN,,,2011-05-23T02:55:11,true,4,,,,,LE GARRIT,46200,MAYRAC,,,46337,,,,,,,,,,,,,,,,,,,2011-01-01,A,,,,,01.42Z,NAFRev2,N,1.539765,44.896563,0.92,locality,Le Garrit Bas 46200 Mayrac,46337_B032,G,LE GARRIT BAS,
425267689,00015,42526768900015,O,1969-01-01,NN,,,2008-01-05T01:14:31,true,3,,,,,BOURG,46200,MAYRAC,,,46337,,,,,,,,,,,,,,,,,,,2008-01-01,A,,,,,01.42Z,NAFRev2,N,-1.229143,44.2011043,0.89,poi.school,École du bourg Mimizan,https://osm.org/way/35215942,G,,
425267770,00013,42526777000013,O,1989-01-01,NN,,,2008-01-05T01:14:31,true,4,,,,,,46200,MAYRAC,,,46337,,,,,,,,,,,,,,,,,,,2008-01-01,A,,,,,01.11Z,NAFRev2,N,,,0,,,,,,
428125454,00010,42812545400010,O,1999-10-01,NN,,,2019-01-04T11:43:11,true,5,,,,,,46200,MAYRAC,,,46337,,,,,,,,,,,,,,,,,,,2018-12-26,A,,,,,01.46Z,NAFRev2,N,,,0,,,,,,
428125454,00028,42812545400028,O,2018-11-02,,,,2019-01-04T11:45:53,false,2,,,,LD,LA ROCHELLE,46200,MAYRAC,,,46337,,,,,,,,,,,,,,,,,,,2018-12-26,A,,,,,10.11Z,NAFRev2,N,2.3684082,48.8681161,0.9,poi.bar,La Rochelle (Bar) Paris,https://osm.org/node/4890477521,G,,
430523860,00012,43052386000012,O,1991-01-01,NN,,,2007-01-18T09:42:48,true,3,,,,,MAYRAC,46200,MAYRAC,,,46337,,,,,,,,,,,,,,,,,,,2002-12-31,F,,,,,01.3Z,NAF1993,N,1.55371,44.902561,0.93,municipality,Mayrac,46337,G,MAYRAC,
430525287,00016,43052528700016,O,1975-01-01,NN,,,2008-01-05T01:54:08,true,3,,,,,LE FAGET,46200,MAYRAC,,,46337,,,,,,,,,,,,,,,,,,,2008-01-01,A,,,,,01.42Z,NAFRev2,N,1.527604,44.893804,0.92,locality,Le Faget Bas 46200 Mayrac,46337_B029,G,LE FAGET BAS,
432001592,00018,43200159200018,O,2000-02-19,NN,,,,true,3,,,,,REYJADE,46200,MAYRAC,,,46337,,,,,,,,,,,,,,,,,,,2003-12-31,F,,,,,01.3Z,NAFRev1,N,1.55371,44.902561,0.58,street,Rayjade 46200 Mayrac,46337_rq355a,G,RAYJADE,
432643831,00014,43264383100014,O,2000-06-23,NN,,,2015-02-18T09:07:17,true,3,,,,,LES ESPEROS,46200,MAYRAC,,,46337,,,,,,,,,,,,,,,,,,,2008-01-01,A,,,,,68.20A,NAFRev2,N,,,0,,,,,,
434602678,00014,43460267800014,O,2001-01-02,NN,,,2008-01-04T19:31:57,true,3,,,,,LE PIT,46200,MAYRAC,,,46337,,,,,,,,,,,,,,,,,,,2008-01-01,A,,,,,41.10D,NAFRev2,N,1.522505,44.903561,0.64,locality,Le Pigeon Haut 46200 Mayrac,46337_B060,G,LE PIGEON HAUT,
434759247,00019,43475924700019,O,2001-02-01,NN,,,2008-01-04T19:35:40,true,3,,,,,LE PIT,46200,MAYRAC,,,46337,,,,,,,,,,,,,,,,,,,2008-01-01,A,,,,,55.30Z,NAFRev2,N,1.522505,44.903561,0.64,locality,Le Pigeon Haut 46200 Mayrac,46337_B060,G,LE PIGEON HAUT,
437665276,00022,43766527600022,O,2006-02-16,NN,,,2009-06-27T10:02:51,true,2,,,,,LE BOURG,46200,MAYRAC,,,46337,,,,,,,,,,,,,,,,,,,2007-09-17,F,MACONNERIE MONTEIL,,,,45.2V,NAFRev1,N,1.56372,44.908167,0.31,locality,Le Colombier de Labbunhies 46200 Mayrac,46337_B015,G,LE COLOMBIER DE LABBUNHIES,
438744948,00011,43874494800011,O,2001-07-25,NN,,,2012-05-02T05:14:02,true,4,,,,LD,LE PIGEON BAS,46200,MAYRAC,,,46337,,,,,,,,,,,,,,,,,,,2003-12-25,F,,,,,55.1A,NAFRev1,O,1.534396,44.905224,0.93,locality,Le Pigeon Bas 46200 Mayrac,46337_B059,G,LE PIGEON BAS,
439480278,00019,43948027800019,O,2001-08-01,NN,,,2011-03-23T08:49:16,false,4,SOC HOTELIERE DU PIGEON,,,LD,LE PIGEON,46200,MAYRAC,,,46337,,,,,,,,,,,,,,,,,,,2003-04-28,F,,,,,74.1J,NAFRev1,N,1.534396,44.905224,0.92,locality,Le Pigeon Bas 46200 Mayrac,46337_B059,G,LE PIGEON BAS,
444934137,00019,44493413700019,O,2001-05-02,NN,,,2018-10-29T15:45:31,true,3,,,,,PECH TOULOUMO,46200,MAYRAC,,,46337,,,,,,,,,,,,,,,,,,,2008-01-01,A,,,,,55.20Z,NAFRev2,N,1.560274,44.893754,0.93,locality,Pech Touloumo 46200 Mayrac,46337_B052,G,PECH TOULOUMO,
452844053,00010,45284405300010,O,2004-01-01,NN,,,2016-04-26T02:20:48,true,5,,,,,LA PERIERE,46200,MAYRAC,,,46337,,,,,,,,,,,,,,,,,,,2011-01-01,A,,,,,01.24Z,NAFRev2,N,1.9217476,43.4837352,0.89,poi.track,Chemin de la Periere Montégut-Lauragais,https://osm.org/way/292520148,G,,
478210362,00016,47821036200016,O,2004-05-11,,,,2011-10-20T17:23:54,true,4,LE PIGEON HAUT,,,,,46200,MAYRAC,,,46337,,,,,,,,,,,,,,,,,,,2008-01-01,A,,,,,01.41Z,NAFRev2,N,1.522505,44.903561,0.93,locality,Le Pigeon Haut 46200 Mayrac,46337_B060,D,LE PIGEON HAUT,
478210362,00024,47821036200024,O,2004-07-01,,,,2021-02-23T13:39:59,false,1,,,,,LE PIGEON HAUT,46200,MAYRAC,,,46337,,,,,,,,,,,,,,,,,,,2004-07-01,A,,,,,01.61Z,NAFRev2,N,1.522505,44.903561,0.93,locality,Le Pigeon Haut 46200 Mayrac,46337_B060,G,LE PIGEON HAUT,
481062891,00017,48106289100017,O,2005-02-01,,,,2021-02-23T13:44:29,true,2,LE FAGET,,,,,46200,MAYRAC,,,46337,,,,,,,,,,,,,,,,,,,2008-01-01,A,,,,,01.11Z,NAFRev2,N,1.527604,44.893804,0.92,locality,Le Faget Bas 46200 Mayrac,46337_B029,D,LE FAGET BAS,
482787991,00017,48278799100017,O,2005-06-14,,,,2008-01-05T21:50:29,true,2,,,,,LE PIT,46200,MAYRAC,,,46337,,,,,,,,,,,,,,,,,,,2008-01-01,A,,,,,68.20B,NAFRev2,N,1.522505,44.903561,0.64,locality,Le Pigeon Haut 46200 Mayrac,46337_B060,G,LE PIGEON HAUT,
482939576,00013,48293957600013,O,2005-05-23,00,2018,4321AB,2020-08-25T10:27:49,true,8,,,,,LE PIT,46200,MAYRAC,,,46337,,,,,,,,,,,,,,,,,,,2020-01-24,A,CAMPING LE PIC,,,,55.30Z,NAFRev2,O,1.522505,44.903561,0.64,locality,Le Pigeon Haut 46200 Mayrac,46337_B060,G,LE PIGEON HAUT,
493538466,00019,49353846600019,O,2006-12-12,,,,2013-05-27T02:39:21,true,4,,,,,LE FUSTIE,46200,MAYRAC,,,46337,,,,,,,,,,,,,,,,,,,2013-01-01,A,,,,,01.45Z,NAFRev2,N,1.52102,44.893948,0.36,locality,Le Faget Haut 46200 Mayrac,46337_B030,G,LE FAGET HAUT,
494536857,00019,49453685700019,O,2006-11-17,,,,2008-01-05T05:13:05,true,2,,,,,LABRUNIE,46200,MAYRAC,,,46337,,,,,,,,,,,,,,,,,,,2008-01-01,A,,,,,01.11Z,NAFRev2,N,1.56372,44.908167,0.31,locality,Le Colombier de Labbunhies 46200 Mayrac,46337_B015,G,LE COLOMBIER DE LABBUNHIES,
499830776,00013,49983077600013,O,2007-10-15,,,,2008-01-05T01:29:15,true,2,,,,,LE SARRAGOUS,46200,MAYRAC,,,46337,,,,,,,,,,,,,,,,,,,2008-01-01,A,,,,,86.90D,NAFRev2,N,,,0,,,,,,
502902414,00015,50290241400015,O,2008-01-01,,,,2008-03-04T04:58:43,true,1,,,,,LE PIGEON HAUT,46200,MAYRAC,,,46337,,,,,,,,,,,,,,,,,,,2008-01-01,A,,,,,01.45Z,NAFRev2,N,1.522505,44.903561,0.93,locality,Le Pigeon Haut 46200 Mayrac,46337_B060,G,LE PIGEON HAUT,
504499054,00022,50449905400022,O,2010-11-01,,,,2011-11-28T05:43:33,true,2,,,,,LE CASTANET,46200,MAYRAC,,,46337,,,,,,,,,,,,,,,,,,,2011-11-01,F,,,,SOS ENTRETIEN,81.30Z,NAFRev2,N,1.56372,44.908167,0.32,locality,Le Colombier de Labbunhies 46200 Mayrac,46337_B015,G,LE COLOMBIER DE LABBUNHIES,
504974841,00018,50497484100018,O,2008-01-01,NN,,,2012-05-05T14:09:52,true,2,,,,,MAIRIE,46200,MAYRAC,,,46337,,,,,,,,,,,,,,,,,,,2008-12-21,A,,,,,94.99Z,NAFRev2,O,3.0709671,50.6304695,0.92,poi.townhall,Hôtel de Ville Lille,https://osm.org/way/40917078,G,,
508357746,00017,50835774600017,O,2008-10-01,,,,2014-07-10T01:30:32,true,2,,,,,LD LE POUZADOU,46200,MAYRAC,,,46337,,,,,,,,,,,,,,,,,,,2009-12-09,F,D.G PEINTURE,,,,43.34Z,NAFRev2,N,1.522505,44.903561,0.32,locality,Le Pigeon Haut 46200 Mayrac,46337_B060,G,LE PIGEON HAUT,
509992186,00015,50999218600015,O,2009-01-22,,,,2009-07-02T05:19:51,true,2,,,,LD,PIGEON,46200,MAYRAC,,,46337,,,,,,,,,,,,,,,,,,,2009-02-18,F,,,,,86.90E,NAFRev2,N,1.534396,44.905224,0.91,locality,Le Pigeon Bas 46200 Mayrac,46337_B059,G,LE PIGEON BAS,
511812554,00018,51181255400018,O,2009-03-01,01,2018,,2020-08-25T10:26:21,true,2,,,,,LD LALARDE,46200,MAYRAC,,,46337,,,,,,,,,,,,,,,,,,,2014-01-27,A,,,,,35.11Z,NAFRev2,O,,,0,,,,,,
511812554,00026,51181255400026,O,2016-12-20,,,,2016-12-26T18:51:29,false,1,,,,LD,LE GARRIT,46200,MAYRAC,,,46337,,,,,,,,,,,,,,,,,,,2016-12-20,A,,,,,35.11Z,NAFRev2,N,1.539765,44.896563,0.92,locality,Le Garrit Bas 46200 Mayrac,46337_B032,G,LE GARRIT BAS,
511812554,00034,51181255400034,O,2020-09-07,,,,2021-02-23T15:20:35,false,1,I058,,,,LE GARRIT BAS,46200,MAYRAC,,,46337,,,,,,,,,,,,,,,,,,,2020-09-07,A,,,,,35.11Z,NAFRev2,N,1.539765,44.896563,0.93,locality,Le Garrit Bas 46200 Mayrac,46337_B032,G,LE GARRIT BAS,
514801414,02919,51480141402919,O,2016-08-24,,,,2021-09-10T08:48:39,false,2,,,,,LE FAGET,46200,MAYRAC,,,46337,,,,,,,,,,,,,,,,,,,2021-09-07,F,,,,,35.11Z,NAFRev2,N,1.527604,44.893804,0.92,locality,Le Faget Bas 46200 Mayrac,46337_B029,G,LE FAGET BAS,
519124531,00012,51912453100012,O,2010-01-04,,,,2012-11-10T01:37:26,true,1,LASCOUX,,,,,46200,MAYRAC,,,46337,,,,,,,,,,,,,,,,,,,2010-01-04,A,,,,,85.59A,NAFRev2,N,,,0,,,,,,
519689137,00015,51968913700015,O,2009-08-28,,,,2010-01-26T05:21:56,true,1,,,,,LE FAGET,46200,MAYRAC,,,46337,,,,,,,,,,,,,,,,,,,2009-08-28,A,GRENAILLE,,,,01.11Z,NAFRev2,N,1.527604,44.893804,0.92,locality,Le Faget Bas 46200 Mayrac,46337_B029,G,LE FAGET BAS,
519933147,00018,51993314700018,O,2009-08-28,,,,2019-11-20T20:01:48,true,1,,,,,LE FAGET,46200,MAYRAC,,,46337,,,,,,,,,,,,,,,,,,,2009-08-28,A,,,,,01.11Z,NAFRev2,N,1.527604,44.893804,0.92,locality,Le Faget Bas 46200 Mayrac,46337_B029,G,LE FAGET BAS,
522026137,00011,52202613700011,O,2010-04-26,,,,2010-04-27T11:59:58,true,1,,,,,LE POUZADOU,46200,MAYRAC,,,46337,,,,,,,,,,,,,,,,,,,2010-04-26,A,,,,,70.10Z,NAFRev2,N,1.522505,44.903561,0.32,locality,Le Pigeon Haut 46200 Mayrac,46337_B060,G,LE PIGEON HAUT,
532854502,00012,53285450200012,O,2011-05-30,,,8121ZZ,2016-10-14T03:12:04,true,2,,,,,LASCOUX,46200,MAYRAC,,,46337,,,,,,,,,,,,,,,,,,,2016-09-30,F,,,,SAP ECO LOT,81.21Z,NAFRev2,N,1.9993736,46.2074938,0.89,poi.pharmacy,Pharmacie Lascoux Ajain,https://osm.org/way/187773559,G,,
535321848,00017,53532184800017,O,2011-12-01,,,,2016-12-13T03:11:24,true,2,,,,,,46200,MAYRAC,,,46337,,,,,,,,,,,,,,,,,,,2016-12-31,F,,,,,01.50Z,NAFRev2,N,,,0,,,,,,
538466525,00036,53846652500036,O,2015-01-19,,,9524ZZ,2021-02-23T15:59:46,true,1,CHEZ DALE,,,,LE BOURG,46200,MAYRAC,,,46337,,,,,,,,,,,,,,,,,,,2015-01-19,A,,,,,43.32A,NAFRev2,N,1.56372,44.908167,0.31,locality,Le Colombier de Labbunhies 46200 Mayrac,46337_B015,G,LE COLOMBIER DE LABBUNHIES,
641643762,00017,64164376200017,O,,,,,,true,1,,,,,,46200,MAYRAC,,,46337,,,,,,,,,,,,,,,,,,,1989-12-31,F,,,,,22.02,NAP,N,,,0,,,,,,
777093410,00010,77709341000010,O,,NN,,,,true,1,,,,LD,LE PIGEON MAYRAC,46200,MAYRAC,,,46337,,,,,,,,,,,,,,,,,,,1987-08-01,F,,,,,55.71,NAP,N,1.534396,44.905224,0.87,locality,Le Pigeon Bas 46200 Mayrac,46337_B059,G,LE PIGEON BAS,
777098492,00013,77709849200013,O,1900-01-01,NN,,,2008-01-05T03:02:54,true,3,,,,,MAIRIE,46200,MAYRAC,,,46337,,,,,,,,,,,,,,,,,,,2008-01-01,A,,,,,01.61Z,NAFRev2,N,3.0709671,50.6304695,0.92,poi.townhall,Hôtel de Ville Lille,https://osm.org/way/40917078,G,,