siren,nic,siret,statutDiffusionEtablissement,dateCreationEtablissement,trancheEffectifsEtablissement,anneeEffectifsEtablissement,activitePrincipaleRegistreMetiersEtablissement,dateDernierTraitementEtablissement,etablissementSiege,nombrePeriodesEtablissement,complementAdresseEtablissement,numeroVoieEtablissement,indiceRepetitionEtablissement,typeVoieEtablissement,libelleVoieEtablissement,codePostalEtablissement,libelleCommuneEtablissement,libelleCommuneEtrangerEtablissement,distributionSpecialeEtablissement,codeCommuneEtablissement,codeCedexEtablissement,libelleCedexEtablissement,codePaysEtrangerEtablissement,libellePaysEtrangerEtablissement,complementAdresse2Etablissement,numeroVoie2Etablissement,indiceRepetition2Etablissement,typeVoie2Etablissement,libelleVoie2Etablissement,codePostal2Etablissement,libelleCommune2Etablissement,libelleCommuneEtranger2Etablissement,distributionSpeciale2Etablissement,codeCommune2Etablissement,codeCedex2Etablissement,libelleCedex2Etablissement,codePaysEtranger2Etablissement,libellePaysEtranger2Etablissement,dateDebut,etatAdministratifEtablissement,enseigne1Etablissement,enseigne2Etablissement,enseigne3Etablissement,denominationUsuelleEtablissement,activitePrincipaleEtablissement,nomenclatureActivitePrincipaleEtablissement,caractereEmployeurEtablissement,longitude,latitude,geo_score,geo_type,geo_adresse,geo_id,geo_ligne,geo_l4,geo_l5
216601393,00012,21660139300012,O,1983-03-01,01,2018,,2020-08-25T10:18:33,true,3,HOTEL DE VILLE,,,,,66730,PEZILLA-DE-CONFLENT,,,66139,,,,,,,,,,,,,,,,,,,2008-01-01,A,MAIRIE,,,,84.11Z,NAFRev2,N,2.481512,42.738383,0.5,street,Le Village 66730 Pézilla-de-Conflent,66139_mg06t3,D,LE VILLAGE,
216601393,00020,21660139300020,O,1995-12-25,NN,,,2020-11-12T11:54:59,false,3,MAIRIE,,,,HOTEL DE VILLE,66730,PEZILLA-DE-CONFLENT,,,66139,,,,,,,,,,,,,,,,,,,2019-12-31,F,EAU ET ASSAINISSEMENT,,,,36.00Z,NAFRev2,N,2.481512,42.738383,0.5,street,Le Village 66730 Pézilla-de-Conflent,66139_mg06t3,G,LE VILLAGE,
216601393,00038,21660139300038,O,1900-01-01,,,,2019-11-14T14:00:52,false,2,,,,,,66730,PEZILLA-DE-CONFLENT,,,66139,,,,,,,,,,,,,,,,,,,1995-12-25,F,,,,,41.0Z,NAF1993,N,,,0,,,,,,
216601393,00046,21660139300046,O,1900-01-01,,,,2019-11-14T14:00:52,false,2,HOTEL DE VILLE,,,,,66730,PEZILLA-DE-CONFLENT,,,66139,,,,,,,,,,,,,,,,,,,1995-12-25,F,,,,,90.0A,NAF1993,N,2.481512,42.738383,0.5,street,Le Village 66730 Pézilla-de-Conflent,66139_mg06t3,D,LE VILLAGE,
266602697,00010,26660269700010,O,1998-03-18,NN,,,2019-11-14T14:00:52,true,4,,593,,,LE VILLAGE,66730,PEZILLA-DE-CONFLENT,,,66139,,,,,,,,,,,,,,,,,,,2015-10-30,F,CCAS,,,,88.99B,NAFRev2,N,2.481512,42.738383,0.94,street,Le Village 66730 Pézilla-de-Conflent,66139_mg06t3,G,LE VILLAGE,
276600855,00015,27660085500015,O,,,,,2019-11-14T14:00:52,true,1,,,,,MAIRIE,66730,PEZILLA-DE-CONFLENT,,,66139,,,,,,,,,,,,,,,,,,,1995-12-25,F,,,,,41.0Z,NAF1993,N,2.482416,42.73811,0.9,street,Rue de la Mairie 66730 Pézilla-de-Conflent,66139_0230,G,RUE DE LA MAIRIE,
296602402,00012,29660240200012,O,1983-09-14,NN,,,2021-02-04T15:24:11,true,4,,,,,HOTEL DE VILLE,66730,PEZILLA-DE-CONFLENT,,,66139,,,,,,,,,,,,,,,,,,,2019-06-25,F,,,,,42.99Z,NAFRev2,N,2.481512,42.738383,0.5,street,Le Village 66730 Pézilla-de-Conflent,66139_mg06t3,G,LE VILLAGE,
323720730,00015,32372073000015,O,,NN,,,2019-11-14T14:00:52,true,1,,,,RTE,,66730,PEZILLA-DE-CONFLENT,,,66139,,,,,,,,,,,,,,,,,,,,F,,,,,55.60,NAP,N,2.480798,42.738078,0.36,street,Impasse de la Voute 66730 Pézilla-de-Conflent,66139_0500,G,IMPASSE DE LA VOUTE,
323729475,00018,32372947500018,O,,,,,2019-11-14T14:00:52,true,1,,,,,PRESBYTERE,66730,PEZILLA-DE-CONFLENT,,,66139,,,,,,,,,,,,,,,,,,,1984-12-25,F,,,,,84.12,NAP,N,2.481254,42.738771,0.91,street,Rue du Presbytère 66730 Pézilla-de-Conflent,66139_0360,G,RUE DU PRESBYTERE,
323954164,00014,32395416400014,O,,NN,,,2019-11-14T14:00:52,true,1,,9,,RTE,NATIONALE,66730,PEZILLA-DE-CONFLENT,,,66139,,,,,,,,,,,,,,,,,,,,F,,,,,00.10,NAP,N,1.2279812,49.230352,0.77,poi,Route Nationale (Pont) Saint-Pierre-du-Vauvray,https://osm.org/way/95838375,G,,
327347746,00015,32734774600015,O,,,,,2019-11-14T14:00:52,true,1,,1,,,GRANDE RUE,66730,PEZILLA-DE-CONFLENT,,,66139,,,,,,,,,,,,,,,,,,,1985-12-25,F,,,,,62.46,NAP,N,2.48355,42.738272,0.43,housenumber,1 Rue de la Mairie 66730 Pézilla-de-Conflent,66139_0230_00001,G,1 RUE DE LA MAIRIE,
349941997,00018,34994199700018,O,1989-01-01,NN,,,2019-11-14T14:00:52,true,3,,,,,LE MOULIN,66730,PEZILLA-DE-CONFLENT,,,66139,,,,,,,,,,,,,,,,,,,2008-01-01,A,,,,,01.47Z,NAFRev2,N,2.480425,42.735567,0.46,street,La Mouliero Nord 66730 Pézilla-de-Conflent,66139_B037,G,LA MOULIERO NORD,
350931127,00020,35093112700020,O,1990-12-28,NN,,,2019-11-14T14:00:52,false,3,LOT SAN FRANCES,,,RUE,DE LA LIBERTE,66730,PEZILLA-DE-CONFLENT,,,66139,,,,,,,,,,,,,,,,,,,2008-01-01,A,,,,,41.10D,NAFRev2,N,2.482416,42.73811,0.53,street,Rue de la Mairie 66730 Pézilla-de-Conflent,66139_0230,G,RUE DE LA MAIRIE,
380287128,00017,38028712800017,O,1991-01-02,,,,2019-11-14T14:00:52,false,3,,,,,,66730,PEZILLA-DE-CONFLENT,,,66139,,,,,,,,,,,,,,,,,,,1997-03-28,F,,,,,74.8K,NAF1993,N,,,0,,,,,,
381712280,00092,38171228000092,O,2021-01-10,,,,2021-02-23T11:10:07,false,1,,2,,IMP,DU REAL,66730,PEZILLA-DE-CONFLENT,,,66139,,,,,,,,,,,,,,,,,,,2021-01-10,A,CONSULTIVITY,,,CONSULTIVITY,74.90B,NAFRev2,N,2.481337,42.738018,0.35,housenumber,2 Impasse de l’Arche 66730 Pézilla-de-Conflent,66139_0040_00002,G,2 IMPASSE DE L ARCHE,
403620065,00017,40362006500017,O,1996-01-01,NN,,,2019-11-14T14:00:52,false,4,,4,,RUE,PRINCIPALE,66730,PEZILLA-DE-CONFLENT,,,66139,,,,,,,,,,,,,,,,,,,2000-09-28,F,,,,,52.6D,NAF1993,N,2.481938,42.738282,0.93,housenumber,4 Rue Principale 66730 Pézilla-de-Conflent,66139_0370_00004,G,4 RUE PRINCIPALE,
403620065,00025,40362006500025,O,1996-10-23,NN,,,2019-11-14T14:00:52,true,3,,4,,RUE,PRINCIPALE,66730,PEZILLA-DE-CONFLENT,,,66139,,,,,,,,,,,,,,,,,,,2008-01-01,A,,,,,01.21Z,NAFRev2,N,2.481938,42.738282,0.93,housenumber,4 Rue Principale 66730 Pézilla-de-Conflent,66139_0370_00004,G,4 RUE PRINCIPALE,
403620065,00041,40362006500041,O,2010-05-03,,,,2019-11-14T14:00:52,false,2,,6,,RUE,DU PRESBYTERE,66730,PEZILLA-DE-CONFLENT,,,66139,,,,,,,,,,,,,,,,,,,2011-12-22,F,,,,,43.12A,NAFRev2,N,2.481272,42.738895,0.93,housenumber,6 Rue du Presbytère 66730 Pézilla-de-Conflent,66139_0360_00006,G,6 RUE DU PRESBYTERE,
409805637,00017,40980563700017,O,1996-10-14,NN,,,2019-11-14T14:00:52,true,1,,,,,MAS BLANCS,66730,PEZILLA-DE-CONFLENT,,,66139,,,,,,,,,,,,,,,,,,,2001-12-31,F,,,,,01.1C,NAF1993,N,4.1200233,44.2570031,0.73,poi.guest_house,Mas Blanc (Maison d'hôte) Robiac-Rochessadoule,https://osm.org/node/2100488096,G,,
413205311,00017,41320531100017,O,1987-12-31,NN,,,2019-11-14T14:00:52,true,1,,,,,,66730,PEZILLA-DE-CONFLENT,,,66139,,,,,,,,,,,,,,,,,,,2002-12-31,F,,,,,01.1G,NAF1993,N,,,0,,,,,,
424697852,00012,42469785200012,O,1999-10-18,NN,,4332AA,2019-11-14T14:00:52,true,8,,1,,IMP,DE BAOUS,66730,PEZILLA-DE-CONFLENT,,,66139,,,,,,,,,,,,,,,,,,,2019-03-13,A,,,,,43.32A,NAFRev2,O,2.481143,42.737915,0.78,housenumber,1 Impasse Baous 66730 Pézilla-de-Conflent,66139_0060_00001,G,1 IMPASSE BAOUS,
440602340,00018,44060234000018,O,2002-01-22,NN,,,2019-11-14T14:00:52,true,3,,7,,PL,DE LA FONTAINE,66730,PEZILLA-DE-CONFLENT,,,66139,,,,,,,,,,,,,,,,,,,2008-01-01,A,,,,,01.24Z,NAFRev2,N,2.481615,42.738297,0.84,housenumber,7 Place de la Fontaine 66730 Pézilla-de-Conflent,66139_0150_00007,G,7 PLACE DE LA FONTAINE,
440956068,00017,44095606800017,O,1982-01-01,NN,,,2019-11-14T14:00:52,true,3,,,,,LE VILLAGE,66730,PEZILLA-DE-CONFLENT,,,66139,,,,,,,,,,,,,,,,,,,2008-01-01,A,,,,,01.21Z,NAFRev2,N,2.481512,42.738383,0.94,street,Le Village 66730 Pézilla-de-Conflent,66139_mg06t3,G,LE VILLAGE,
440956118,00010,44095611800010,O,1968-01-01,NN,,,2019-11-14T14:00:52,true,1,,,,,LE VILLAGE,66730,PEZILLA-DE-CONFLENT,,,66139,,,,,,,,,,,,,,,,,,,2000-08-07,F,,,,,01.3Z,NAF1993,N,2.481512,42.738383,0.94,street,Le Village 66730 Pézilla-de-Conflent,66139_mg06t3,G,LE VILLAGE,
442353538,00014,44235353800014,O,2002-05-28,NN,,,2019-11-14T14:00:52,true,3,,7,,RUE,DE LA FONTAINE,66730,PEZILLA-DE-CONFLENT,,,66139,,,,,,,,,,,,,,,,,,,2008-01-01,A,,,,,02.30Z,NAFRev2,N,2.481323,42.738048,0.93,housenumber,7 Rue de la Fontaine 66730 Pézilla-de-Conflent,66139_0151_00007,G,7 RUE DE LA FONTAINE,
444340731,00017,44434073100017,O,2003-01-01,NN,,,2019-11-14T14:00:52,true,3,,1,,RUE,DE LA MAIRIE,66730,PEZILLA-DE-CONFLENT,,,66139,,,,,,,,,,,,,,,,,,,2003-12-25,F,,,,,01.1G,NAFRev1,N,2.48355,42.738272,0.93,housenumber,1 Rue de la Mairie 66730 Pézilla-de-Conflent,66139_0230_00001,G,1 RUE DE LA MAIRIE,
477646848,00028,47764684800028,O,2004-08-03,,,,2019-11-14T14:00:52,true,4,,6,,RUE,DE LA MAJOU,66730,PEZILLA-DE-CONFLENT,,,66139,,,,,,,,,,,,,,,,,,,2015-10-26,F,,,,,70.22Z,NAFRev2,N,2.481545,42.738005,0.93,housenumber,6 Rue de la Majou 66730 Pézilla-de-Conflent,66139_0241_00006,G,6 RUE DE LA MAJOU,
488298449,00015,48829844900015,O,2006-01-23,,,4399CZ,2019-11-14T14:00:52,true,3,,5,,RUE,DU PRESBYTERE,66730,PEZILLA-DE-CONFLENT,,,66139,,,,,,,,,,,,,,,,,,,2013-10-24,F,,,,,43.99C,NAFRev2,N,2.481172,42.738648,0.93,housenumber,5 Rue du Presbytère 66730 Pézilla-de-Conflent,66139_0360_00005,G,5 RUE DU PRESBYTERE,
490284387,00019,49028438700019,O,2006-05-27,NN,,,2019-11-14T14:00:52,false,4,,1,,RUE,DU PRESBYTERE,66730,PEZILLA-DE-CONFLENT,,,66139,,,,,,,,,,,,,,,,,,,2009-09-15,F,,,,,85.51Z,NAFRev2,O,2.481237,42.738435,0.93,housenumber,1 Rue du Presbytère 66730 Pézilla-de-Conflent,66139_0360_00001,G,1 RUE DU PRESBYTERE,
491624110,00012,49162411000012,O,1983-05-02,,,,2019-11-14T14:00:52,true,2,,,,,MAIRIE,66730,PEZILLA-DE-CONFLENT,,,66139,,,,,,,,,,,,,,,,,,,2008-01-01,A,,,,,94.99Z,NAFRev2,N,2.482416,42.73811,0.9,street,Rue de la Mairie 66730 Pézilla-de-Conflent,66139_0230,G,RUE DE LA MAIRIE,
501488993,00012,50148899300012,O,2008-01-02,,,4331ZB,2019-11-14T14:00:52,true,2,,1,,RUE,DE LA FONTAINE,66730,PEZILLA-DE-CONFLENT,,,66139,,,,,,,,,,,,,,,,,,,2010-12-31,F,,,,,43.31Z,NAFRev2,N,2.481566,42.738181,0.93,housenumber,1 Rue de la Fontaine 66730 Pézilla-de-Conflent,66139_0151_00001,G,1 RUE DE LA FONTAINE,
511904856,00016,51190485600016,O,2009-04-01,,,,2019-11-14T14:00:52,true,2,,,,,,66730,PEZILLA-DE-CONFLENT,,,66139,,,,,,,,,,,,,,,,,,,2011-10-15,F,,,,,01.24Z,NAFRev2,N,,,0,,,,,,
512179938,00018,51217993800018,O,1973-09-04,,,,2019-11-14T14:00:52,true,1,,3,,RUE,PRINCIPALE,66730,PEZILLA-DE-CONFLENT,,,66139,,,,,,,,,,,,,,,,,,,1973-09-04,A,,,,,94.99Z,NAFRev2,N,2.482074,42.738415,0.93,housenumber,3 Rue Principale 66730 Pézilla-de-Conflent,66139_0370_00003,G,3 RUE PRINCIPALE,
523555894,00014,52355589400014,O,2010-07-01,,,,2019-11-14T14:00:52,true,1,,6,,RUE,DE LA MAIRIE,66730,PEZILLA-DE-CONFLENT,,,66139,,,,,,,,,,,,,,,,,,,2010-07-01,A,,,,,68.20A,NAFRev2,N,2.481941,42.737966,0.93,housenumber,6 Rue de la Mairie 66730 Pézilla-de-Conflent,66139_0230_00006,G,6 RUE DE LA MAIRIE,
523786812,00017,52378681200017,O,2009-07-17,,,,2019-11-14T14:00:52,true,2,,8,,RUE,DU PRESBYTERE,66730,PEZILLA-DE-CONFLENT,,,66139,,,,,,,,,,,,,,,,,,,2011-05-30,F,,,,,90.03B,NAFRev2,N,2.481254,42.739106,0.93,housenumber,8 Rue du Presbytère 66730 Pézilla-de-Conflent,66139_0360_00008,G,8 RUE DU PRESBYTERE,
538222555,00038,53822255500038,O,2017-05-15,,,,2021-02-23T15:59:18,true,1,,8,,RUE,PRINCIPALE,66730,PEZILLA-DE-CONFLENT,,,66139,,,,,,,,,,,,,,,,,,,2017-05-15,A,LA PASSIONNEE,,,LA PASSIONNEE,32.99Z,NAFRev2,N,2.482136,42.738347,0.93,housenumber,8 Rue Principale 66730 Pézilla-de-Conflent,66139_0370_00008,G,8 RUE PRINCIPALE,
776191413,00017,77619141300017,O,,,,,2019-11-14T14:00:52,true,1,,,,,,66730,PEZILLA-DE-CONFLENT,,,66139,,,,,,,,,,,,,,,,,,,1994-01-01,F,,,,,15.9G,NAF1993,N,,,0,,,,,,
829903657,00023,82990365700023,O,2021-08-31,,,,2021-09-02T03:44:38,false,1,,6,,RUE,DU PRESBYTERE,66730,PEZILLA-DE-CONFLENT,,,66139,,,,,,,,,,,,,,,,,,,2021-08-31,A,,,,,01.21Z,NAFRev2,N,2.481272,42.738895,0.93,housenumber,6 Rue du Presbytère 66730 Pézilla-de-Conflent,66139_0360_00006,G,6 RUE DU PRESBYTERE,
830780581,00013,83078058100013,O,2017-06-21,,,,2020-08-07T03:38:16,true,1,,3,A,,LE VILLAGE,66730,PEZILLA-DE-CONFLENT,,,66139,,,,,,,,,,,,,,,,,,,2017-06-21,A,,,,,68.20B,NAFRev2,N,2.482306,42.73837,0.94,interpolation,3 Le Village 66730 Pézilla-de-Conflent,,G,1 LE VILLAGE,
892666686,00019,89266668600019,O,2021-01-01,,,,2021-01-20T03:41:52,true,1,,4,,RUE,DES MOINES,66730,PEZILLA-DE-CONFLENT,,,66139,,,,,,,,,,,,,,,,,,,2021-01-01,A,,,,,77.40Z,NAFRev2,N,2.4811,42.738064,0.68,housenumber,4 Rue du Moine 66730 Pézilla-de-Conflent,66139_0260_00004,G,4 RUE DU MOINE,
894740448,00010,89474044800010,O,2021-02-22,,,,2021-03-05T12:10:37,true,1,2 IMPASSE DU REAL,,,,,66730,PEZILLA-DE-CONFLENT,,,66139,,,,,,,,,,,,,,,,,,,2021-02-22,A,,,,,68.20B,NAFRev2,N,2.481337,42.738018,0.57,housenumber,2 Impasse de l’Arche 66730 Pézilla-de-Conflent,66139_0040_00002,D,2 IMPASSE DE L ARCHE,
897768909,00011,89776890900011,O,2021-05-01,,,,2021-05-23T18:01:01,true,1,,1,,IMP,DU BAOUS,66730,PEZILLA-DE-CONFLENT,,,66139,,,,,,,,,,,,,,,,,,,2021-05-01,A,LE RUCHET DES GRAGNOTTES,,,,01.49Z,NAFRev2,N,2.481143,42.737915,0.61,housenumber,1 Impasse Baous 66730 Pézilla-de-Conflent,66139_0060_00001,G,1 IMPASSE BAOUS,
