siren,nic,siret,statutDiffusionEtablissement,dateCreationEtablissement,trancheEffectifsEtablissement,anneeEffectifsEtablissement,activitePrincipaleRegistreMetiersEtablissement,dateDernierTraitementEtablissement,etablissementSiege,nombrePeriodesEtablissement,complementAdresseEtablissement,numeroVoieEtablissement,indiceRepetitionEtablissement,typeVoieEtablissement,libelleVoieEtablissement,codePostalEtablissement,libelleCommuneEtablissement,libelleCommuneEtrangerEtablissement,distributionSpecialeEtablissement,codeCommuneEtablissement,codeCedexEtablissement,libelleCedexEtablissement,codePaysEtrangerEtablissement,libellePaysEtrangerEtablissement,complementAdresse2Etablissement,numeroVoie2Etablissement,indiceRepetition2Etablissement,typeVoie2Etablissement,libelleVoie2Etablissement,codePostal2Etablissement,libelleCommune2Etablissement,libelleCommuneEtranger2Etablissement,distributionSpeciale2Etablissement,codeCommune2Etablissement,codeCedex2Etablissement,libelleCedex2Etablissement,codePaysEtranger2Etablissement,libellePaysEtranger2Etablissement,dateDebut,etatAdministratifEtablissement,enseigne1Etablissement,enseigne2Etablissement,enseigne3Etablissement,denominationUsuelleEtablissement,activitePrincipaleEtablissement,nomenclatureActivitePrincipaleEtablissement,caractereEmployeurEtablissement,longitude,latitude,geo_score,geo_type,geo_adresse,geo_id,geo_ligne,geo_l4,geo_l5
180070039,00128,18007003900128,O,1983-03-16,NN,,,,false,4,,,,AV,DE MONTFORT,78320,LA VERRIERE,,,78644,,,,,,,,,,,,,,,,,,,2000-12-25,F,UNI REGION SRIV INST M RIVIERE,,,,73.1Z,NAF1993,N,1.947638,48.75105,0.83,street,Avenue de Montfort 78320 La Verrière,78644_0104,G,AVENUE DE MONTFORT,
197832595,00015,19783259500015,O,1983-03-01,12,2018,,2020-08-25T10:14:26,true,4,,,,AV,GEORGES LAPIERRE,78320,LA VERRIERE,,,78644,,,,,,,,,,,,,,,,,,,2016-04-03,A,,,,,85.20Z,NAFRev2,O,1.942817,48.752232,0.86,street,Avenue Georges Lapierre 78320 La Verrière,78644_c5ugop,G,AVENUE GEORGES LAPIERRE,
200076305,00396,20007630500396,O,2018-01-01,,,,2021-02-23T10:30:46,false,1,,3,,RUE,EMILE DUREUIL,78320,LA VERRIERE,,,78644,,,,,,,,,,,,,,,,,,,2018-01-01,A,CMP LA VERRIERE,,,,86.10Z,NAFRev2,N,1.964098,48.758983,0.95,housenumber,3 Rue Emile Dureuil 78320 La Verrière,78644_0052_00003,G,3 RUE EMILE DUREUIL,
217806447,00017,21780644700017,O,1983-03-01,22,2018,,2020-08-25T10:19:13,true,4,,1,,AV,DES NOES,78320,LA VERRIERE,,,78644,,,,,,,,,,,,,,,,,,,2008-01-01,A,MAIRIE,,,,84.11Z,NAFRev2,O,1.957898,48.758231,0.65,street,Avenue des Noés 78320 La Verrière,78644_0108,G,AVENUE DES NOES,
217806447,00025,21780644700025,O,1983-12-21,12,2018,,2020-08-25T10:19:13,false,4,,4,,RUE,EMILE DUREUIL,78320,LA VERRIERE,,,78644,,,,,,,,,,,,,,,,,,,2014-12-25,A,ECOLE ELEMENTAIRE BOIS DE L'ETANG,,,,85.20Z,NAFRev2,N,1.963267,48.7594,0.95,housenumber,4 Rue Emile Dureuil 78320 La Verrière,78644_0052_00004,G,4 RUE EMILE DUREUIL,
217806447,00033,21780644700033,O,1983-12-21,03,2018,,2020-08-25T10:19:13,false,4,,6,,RUE,EMILE DUREUIL,78320,LA VERRIERE,,,78644,,,,,,,,,,,,,,,,,,,2014-12-25,A,ECOLE MATERNELLE BOIS DE L'ETANG,,,,85.10Z,NAFRev2,N,1.963699,48.75913,0.95,housenumber,6 Rue Emile Dureuil 78320 La Verrière,78644_0052_00006,G,6 RUE EMILE DUREUIL,
217806447,00041,21780644700041,O,1983-12-21,03,2018,,2020-08-25T10:19:13,false,4,,4,,ALL,DES CHENES,78320,LA VERRIERE,,,78644,,,,,,,,RES,DU BOIS DE L ETANG,78320,LA VERRIERE,,,78644,,,,,2014-12-25,A,ECOLE MATERNELLE ETANG DES NOES,,,,85.10Z,NAFRev2,N,1.965362,48.757629,0.84,housenumber,4 Allee des Chenes 78320 La Verrière,78644_0042_00004,G,4 ALLEE DES CHENES,
217806447,00058,21780644700058,O,1983-12-21,11,2018,,2020-08-25T10:19:13,false,4,,2,,AV,DE LA GARE,78320,LA VERRIERE,,,78644,,,,,,,,,,,,,,,,,,,2014-12-25,A,ECOLE MATERNELLE PARC DU CHATEAU,,,,85.10Z,NAFRev2,N,1.951112,48.75664,0.84,housenumber,2 Avenue de la Gare 78320 La Verrière,78644_0065_00002,G,2 AVENUE DE LA GARE,
217806447,00066,21780644700066,O,1983-12-21,12,2018,,2020-08-25T10:19:13,false,4,,2,,AV,DE LA GARE,78320,LA VERRIERE,,,78644,,,,,,,,,,,,,,,,,,,2014-12-25,A,ECOLE ELEMENTAIRE PARC DU CHATEAU,,,,85.20Z,NAFRev2,N,1.951112,48.75664,0.84,housenumber,2 Avenue de la Gare 78320 La Verrière,78644_0065_00002,G,2 AVENUE DE LA GARE,
217806447,00074,21780644700074,O,1983-12-21,NN,,,2015-09-04T14:25:08,false,4,,21,,AV,DU GEN LECLERC,78320,LA VERRIERE,,,78644,,,,,,,,,,,,,,,,,,,2008-01-01,F,ECOL PRIM VILLAGE,,,,85.20Z,NAFRev2,N,1.954894,48.75454,0.79,housenumber,21 Avenue du Général Leclerc 78320 La Verrière,78644_0075_00021,G,21 AVENUE DU GENERAL LECLERC,
217806447,00082,21780644700082,O,1995-12-25,NN,,,2015-09-04T12:51:29,false,3,MAIRIE,1,,AV,DES NOES,78320,LA VERRIERE,,,78644,,,,,,,,,,,,,,,,,,,2014-12-25,A,SERVICE D'EAU,,,,36.00Z,NAFRev2,N,1.957898,48.758231,0.65,street,Avenue des Noés 78320 La Verrière,78644_0108,G,AVENUE DES NOES,
217806447,00090,21780644700090,O,1976-11-01,NN,,,2007-06-22T15:12:19,false,3,,9,,AV,DU GEN LECLERC,78320,LA VERRIERE,,,78644,,,,,,,,,,,,,,,,,,,2007-04-01,F,CENTRE DE PROTECTION INFANTILE,,,,85.1C,NAFRev1,N,1.95591,48.755268,0.78,housenumber,9 Avenue du Général Leclerc 78320 La Verrière,78644_0075_00009,G,9 AVENUE DU GENERAL LECLERC,
217806447,00108,21780644700108,O,1975-07-01,NN,,,2012-05-05T00:31:44,false,4,,15,,RUE,DU CHATEAU D EAU,78320,LA VERRIERE,,,78644,,,,,,,,,,,,,,,,,,,2008-01-01,A,CRECHE FAMILIALE COMMUNALE,,,,88.91A,NAFRev2,N,1.953366,48.752846,0.96,housenumber,15 Rue du Château d’Eau 78320 La Verrière,78644_0035_00015,G,15 RUE DU CHATEAU D EAU,
217806447,00116,21780644700116,O,2006-11-17,NN,,,2021-02-23T10:33:24,false,2,,3,,RES,DU BOIS DE L ETANG,78320,LA VERRIERE,,,78644,,,,,,,,,,,,,,,,,,,2008-01-01,A,HALTE-GARDERIE COMMUNALE CANOE,,,,88.91A,NAFRev2,N,1.965956,48.758994,0.91,housenumber,3 Residence du Bois de l’Etang 78320 La Verrière,78644_a001_00003,G,3 RESIDENCE DU BOIS DE L ETANG,
247800030,00014,24780003000014,O,,NN,,,,true,1,,7,,RUE,MARCEL RIVIERE,78320,LA VERRIERE,,,78644,,,,,,,,,,,,,,,,,,,1987-05-14,F,,,,,90.11,NAP,N,1.94878,48.755496,0.96,housenumber,7 Rue Marcel Rivière 78320 La Verrière,78644_0095_00007,G,7 RUE MARCEL RIVIERE,
267800100,00278,26780010000278,O,1996-12-25,,,,2018-10-09T14:09:19,false,3,,3,,RUE,EMILE DUREUIL,78320,LA VERRIERE,,,78644,,,,,,,,,,,,,,,,,,,2018-01-01,F,CENTRE MEDICO PSYCHOLOGIQUE 78I05,,,,88.99B,NAFRev2,N,1.964098,48.758983,0.95,housenumber,3 Rue Emile Dureuil 78320 La Verrière,78644_0052_00003,G,3 RUE EMILE DUREUIL,
267802627,00013,26780262700013,O,1983-03-01,NN,,,2018-09-29T12:08:43,true,5,MAIRIE,1,,AV,DES NOES,78320,LA VERRIERE,,,78644,,,,,,,,,,,,,,,,,,,2014-12-25,A,,,,,88.99B,NAFRev2,O,1.957898,48.758231,0.65,street,Avenue des Noés 78320 La Verrière,78644_0108,G,AVENUE DES NOES,
267802783,00014,26780278300014,O,1986-01-06,02,2018,,2020-08-25T10:21:22,true,4,MAIRIE,,,AV,DES NOES,78320,LA VERRIERE,,,78644,,,,,,,,,,,,,,,,,,,2014-12-25,A,,,,,88.99B,NAFRev2,O,1.957898,48.758231,0.78,street,Avenue des Noés 78320 La Verrière,78644_0108,G,AVENUE DES NOES,
301182333,00015,30118233300015,O,,NN,,,,true,1,,,,RUE,DE CHEVREUSE,78320,LA VERRIERE,,,78644,,,,,,,,,,,,,,,,,,,1988-12-27,F,,,,,55.1A,NAF1993,N,1.95524,48.747723,0.96,street,Rue de Chevreuse 78320 La Verrière,78644_0045,G,RUE DE CHEVREUSE,
301292876,00028,30129287600028,O,,,,,2006-11-25T09:12:57,true,1,,19,,AV,DU GEN LECLERC,78320,LA VERRIERE,,,78644,,,,,,,,,,,,,,,,,,,,F,,,,,96.25,NAP,N,1.954923,48.754558,0.79,housenumber,19 Avenue du Général Leclerc 78320 La Verrière,78644_0075_00019,G,19 AVENUE DU GENERAL LECLERC,
301499042,00135,30149904200135,O,1991-01-02,NN,,,,false,4,PARC D ACTIVITE,40,,RUE,DE PANICALE,78320,LA VERRIERE,,,78644,,,,,,,,,,,,,,,,,,,1995-12-25,F,,,,,51.5F,NAF1993,O,1.946462,48.757317,0.83,housenumber,40 Rue Panicale 78320 La Verrière,78644_0109_00040,G,40 RUE PANICALE,
301499042,00317,30149904200317,O,2012-03-31,02,2018,,2020-08-25T10:22:00,false,1,,52,,RUE,DE PANICALE,78320,LA VERRIERE,,,78644,,,,,,,,,,,,,,,,,,,2012-03-31,A,,,,,43.99A,NAFRev2,O,1.946889,48.757405,0.83,housenumber,52 Rue Panicale 78320 La Verrière,78644_0109_00052,G,52 RUE PANICALE,
301833448,00014,30183344800014,O,1975-01-01,NN,,,,true,1,,,,,CENTRE COM BOIS FOLIE,78320,LA VERRIERE,,,78644,,,,,,,,,,,,,,,,,,,2000-06-30,F,,,,,52.2C,NAF1993,N,-0.3393478,49.201367,0.68,poi.mall,Centre Commercial Haute Folie (Galerie marchande) Hérouville-Saint-Clair,https://osm.org/node/3710577805,G,,
301854899,00053,30185489900053,O,1997-01-01,NN,,,2007-05-19T08:31:07,true,3,ZA DE L'AGIOT,54,,RUE,DE PANICALE,78320,LA VERRIERE,,,78644,,,,,,,,,,,,,,,,,,,2006-01-17,F,,,,,21.2G,NAFRev1,O,1.946687,48.757156,0.83,housenumber,54 Rue Panicale 78320 La Verrière,78644_0109_00054,G,54 RUE PANICALE,
302066444,00035,30206644400035,O,1999-12-26,NN,,,2006-10-26T23:55:05,true,3,,22,,RUE,DE PANICALE,78320,LA VERRIERE,,,78644,,,,,,,,,,,,,,,,,,,2004-12-25,F,,,,,51.8G,NAFRev1,O,1.946032,48.757188,0.83,housenumber,22 Rue Panicale 78320 La Verrière,78644_0109_00022,G,22 RUE PANICALE,
302068119,00197,30206811900197,O,2007-12-01,NN,,,2013-05-18T02:26:21,false,2,30 A 52,30,,RUE,DE PANICALE,78320,LA VERRIERE,,,78644,,,,,,,,,,,,,,,,,,,2011-06-15,F,,,,,46.73B,NAFRev2,O,1.945973,48.757769,0.83,housenumber,30 Rue Panicale 78320 La Verrière,78644_0109_00030,G,30 RUE PANICALE,
302581939,00022,30258193900022,O,1900-01-01,NN,,,2006-10-26T23:57:51,true,3,BAT B N92,,,RES,DU BOIS DE L ETANG,78320,LA VERRIERE,,,78644,,,,,,,,,,,,,,,,,,,2006-03-01,F,,,,,52.6D,NAFRev1,N,1.965627,48.759123,0.91,street,Residence du Bois de l’Etang 78320 La Verrière,78644_A001,G,RESIDENCE DU BOIS DE L ETANG,
303291041,00018,30329104100018,O,,NN,,,,true,1,,,,,CTRE COM BOIS DE L ETANG,78320,LA VERRIERE,,,78644,,,,,,,,,,,,,,,,,,,,F,,,,,64.30,NAP,N,1.965627,48.759123,0.66,street,Residence du Bois de l’Etang 78320 La Verrière,78644_A001,G,RESIDENCE DU BOIS DE L ETANG,
304037625,00015,30403762500015,O,,NN,,,,true,1,,9,,RUE,DE CHEVREUSE,78320,LA VERRIERE,,,78644,,,,,,,,,,,,,,,,,,,1988-11-14,F,,,,,55.60,NAP,N,1.956294,48.74868,0.96,housenumber,9 Rue de Chevreuse 78320 La Verrière,78644_0045_00009,G,9 RUE DE CHEVREUSE,
304037633,00019,30403763300019,O,,,,,,true,1,,,,RUE,DU BOIS,78320,LA VERRIERE,,,78644,,,,,,,,,,,,,,,,,,,1984-12-25,F,,,,,55.73,NAP,N,1.960336,48.75819,0.96,street,Rue du Bois 78320 La Verrière,78644_0025,G,RUE DU BOIS,
304414485,00017,30441448500017,O,,,,,,true,1,,20,,AV,DU GEN LECLERC,78320,LA VERRIERE,,,78644,,,,,,,,,,,,,,,,,,,1987-09-25,F,,,,,55.60,NAP,N,1.956958,48.756417,0.79,housenumber,20 Avenue du Général Leclerc 78320 La Verrière,78644_0075_00020,G,20 AVENUE DU GENERAL LECLERC,
305448771,00017,30544877100017,O,1964-01-01,NN,,,,true,4,,16,,AV,DU CHEMIN VERT,78320,LA VERRIERE,,,78644,,,,,,,,,,,,,,,,,,,2001-05-31,F,,,,,93.0A,NAF1993,O,1.955064,48.753195,0.87,housenumber,16 Avenue du Chemin Vert 78320 La Verrière,78644_0040_00016,G,16 AVENUE DU CHEMIN VERT,
305740052,00058,30574005200058,O,,NN,,,,true,1,,10,,RUE,DU CHATEAU D EAU,78320,LA VERRIERE,,,78644,,,,,,,,,,,,,,,,,,,1990-12-31,F,,,,,69.23,NAP,N,1.953724,48.753107,0.96,housenumber,10 Rue du Château d’Eau 78320 La Verrière,78644_0035_00010,G,10 RUE DU CHATEAU D EAU,
306140229,00056,30614022900056,O,1993-05-11,NN,,,,true,1,,14,,RUE,DE PANICALE,78320,LA VERRIERE,,,78644,,,,,,,,,,,,,,,,,,,1994-03-22,F,,,,,45.2V,NAF1993,O,1.945619,48.75697,0.83,housenumber,14 Rue Panicale 78320 La Verrière,78644_0109_00014,G,14 RUE PANICALE,
306383407,00013,30638340700013,O,,,,,,true,1,,,,,L AGIOT,78320,LA VERRIERE,,,78644,,,,,,,,,,,,,,,,,,,1984-12-25,F,,,,,65.02,NAP,N,1.957288,48.759461,0.95,street,L’Agiot 78320 La Verrière,78644_afostt,G,L AGIOT,
306440504,00034,30644050400034,O,1984-06-01,NN,,,2009-06-27T03:45:22,true,4,CTRE COMMERCIAL ORLY PARC,,,RUE,MARCEL RIVIERE,78320,LA VERRIERE,,,78644,,,,,,,,,,,,,,,,,,,2007-03-31,F,,,,,52.4R,NAFRev1,O,1.947476,48.754623,0.96,street,Rue Marcel Rivière 78320 La Verrière,78644_0095,G,RUE MARCEL RIVIERE,
306473521,00046,30647352100046,O,1993-05-05,,,,,true,1,,14,,RUE,DE PANICALE,78320,LA VERRIERE,,,78644,,,,,,,,,,,,,,,,,,,1994-03-29,F,,,,,45.2V,NAF1993,N,1.945619,48.75697,0.83,housenumber,14 Rue Panicale 78320 La Verrière,78644_0109_00014,G,14 RUE PANICALE,
306591769,00014,30659176900014,O,1900-01-01,NN,,,2016-07-07T09:22:47,true,5,,8,,RUE,LOUIS LORMAND,78320,LA VERRIERE,,BP 13,78644,,,,,,,,,,,,,,,,,,,2014-12-31,F,,,,,94.20Z,NAFRev2,O,1.948377,48.757412,0.95,housenumber,8 Rue Louis Lormand 78320 La Verrière,78644_0092_00008,G,8 RUE LOUIS LORMAND,
306889759,00024,30688975900024,O,1997-04-01,NN,,,2008-11-07T00:22:33,false,4,,9,,RUE,DU CHATEAU D EAU,78320,LA VERRIERE,,,78644,,,,,,,,,,,,,,,,,,,2005-08-02,F,,,,,60.2E,NAFRev1,O,1.953816,48.753089,0.96,housenumber,9 Rue du Château d’Eau 78320 La Verrière,78644_0035_00009,G,9 RUE DU CHATEAU D EAU,
306894619,00015,30689461900015,O,1964-01-01,,,4321AB,2015-03-17T00:11:51,false,4,,52,,RUE,DE L ETANG,78320,LA VERRIERE,,,78644,,,,,,,,,,,,,,,,,,,2008-01-01,A,,,,,43.21A,NAFRev2,N,1.962416,48.757327,0.96,housenumber,52 Rue de l’Etang 78320 La Verrière,78644_0055_00052,G,52 RUE DE L ETANG,
307326520,00052,30732652000052,O,2008-07-01,,,,2021-02-23T10:37:42,true,1,,12,,RUE,DE LA MARE,78320,LA VERRIERE,,,78644,,,,,,,,,,,,,,,,,,,2008-07-01,A,,,,,43.32A,NAFRev2,N,1.955224,48.756109,0.96,housenumber,12 Rue de la Mare 78320 La Verrière,78644_0100_00012,G,12 RUE DE LA MARE,
307783290,00025,30778329000025,O,1998-06-04,,,,2007-01-04T11:43:16,true,3,CENTRE COMMERCIAL,,,,ORLY PARC,78320,LA VERRIERE,,,78644,,,,,,,,,,,,,,,,,,,2006-12-31,F,,,,,85.1E,NAFRev1,N,1.9416861,48.7522647,0.91,poi.park,Orly Parc 2 La Verrière,https://osm.org/way/560484608,G,,
308223643,00039,30822364300039,O,1972-03-12,NN,,,2020-03-14T03:52:08,true,3,RN 10 DOMAINE DE L AGIOT,,,,L AGIOT,78320,LA VERRIERE,,,78644,,,,,,,,,,,,,,,,,,,2008-01-01,A,,,,,68.20B,NAFRev2,N,1.957288,48.759461,0.95,street,L’Agiot 78320 La Verrière,78644_afostt,G,L AGIOT,
308267368,00030,30826736800030,O,1995-09-11,NN,,,2007-05-19T08:42:36,true,4,ZA DE L'AGIOT,54,,RUE,DE PANICALE,78320,LA VERRIERE,,,78644,,,,,,,,,,,,,,,,,,,2006-01-17,F,,,,,25.2G,NAFRev1,O,1.946687,48.757156,0.83,housenumber,54 Rue Panicale 78320 La Verrière,78644_0109_00054,G,54 RUE PANICALE,
309126357,00024,30912635700024,O,,NN,,,,true,1,,24,,RUE,DE L ETANG,78320,LA VERRIERE,,,78644,,,,,,,,,,,,,,,,,,,1992-11-30,F,,,,,60.2E,NAF1993,N,1.959913,48.756981,0.96,housenumber,24 Rue de l’Etang 78320 La Verrière,78644_0055_00024,G,24 RUE DE L ETANG,
309132785,00010,30913278500010,O,1977-01-01,12,2018,,2021-06-06T20:05:48,true,6,LIEU-DIT L'AGIOT,,,RTE,NATIONALE 10,78320,LA VERRIERE,,,78644,,,,,,,,,,,,,,,,,,,2017-05-04,A,VIDALAUTOS,,,,45.11Z,NAFRev2,O,1.960014,48.760958,0.84,street,Route Nationale 10 78320 La Verrière,78644_0107,G,ROUTE NATIONALE 10,
309239713,00022,30923971300022,O,,,,,,true,1,,,,RUE,MARCEL RIVIERE,78320,LA VERRIERE,,,78644,,,,,,,,,,,,,,,,,,,1987-06-30,F,,,,,38.40,NAP,N,1.947476,48.754623,0.96,street,Rue Marcel Rivière 78320 La Verrière,78644_0095,G,RUE MARCEL RIVIERE,
309763928,00012,30976392800012,O,,NN,,,,true,1,,17,,RES,DU BOIS DE L ETANG,78320,LA VERRIERE,,,78644,,,,,,,,,,,,,,,,,,,,F,,,,,62.46,NAP,N,1.966035,48.760258,0.91,housenumber,17 Residence du Bois de l’Etang 78320 La Verrière,78644_a001_00017,G,17 RESIDENCE DU BOIS DE L ETANG,
310624366,00095,31062436600095,O,2005-07-01,NN,,,2010-06-30T15:42:00,false,3,30 A 52,30,,RUE,DE PANICALE,78320,LA VERRIERE,,,78644,,,,,,,,,,,,,,,,,,,2009-08-31,F,,,,,68.20B,NAFRev2,N,1.945973,48.757769,0.83,housenumber,30 Rue Panicale 78320 La Verrière,78644_0109_00030,G,30 RUE PANICALE,
311218598,00010,31121859800010,O,1977-01-01,NN,,,2008-11-07T00:26:10,true,3,,17,,RUE,DE LA MARE,78320,LA VERRIERE,,,78644,,,,,,,,,,,,,,,,,,,2006-01-31,F,,,,,28.5C,NAFRev1,N,1.955266,48.756152,0.96,housenumber,17 Rue de la Mare 78320 La Verrière,78644_0100_00017,G,17 RUE DE LA MARE,
311972046,00016,31197204600016,O,1978-01-01,NN,,,,true,1,,28,,AV,DU GEN LECLERC,78320,LA VERRIERE,,,78644,,,,,,,,,,,,,,,,,,,2002-06-30,F,,,,,52.6D,NAF1993,N,1.956444,48.755748,0.79,housenumber,28 Avenue du Général Leclerc 78320 La Verrière,78644_0075_00028,G,28 AVENUE DU GENERAL LECLERC,
312101322,00013,31210132200013,O,,,,,,true,1,,,,RUE,DES CHAMPS,78320,LA VERRIERE,,,78644,,,,,,,,,,,,,,,,,,,1984-12-25,F,,,,,55.73,NAP,N,1.955197,48.751279,0.96,street,Rue des Champs 78320 La Verrière,78644_0030,G,RUE DES CHAMPS,
312460462,00020,31246046200020,O,,NN,,,,true,1,,8,,RTE,NATIONALE 10,78320,LA VERRIERE,,,78644,,,,,,,,,,,,,,,,,,,1994-12-31,F,,,,,45.3A,NAF1993,N,1.960014,48.760958,0.75,street,Route Nationale 10 78320 La Verrière,78644_0107,G,ROUTE NATIONALE 10,
312747728,00011,31274772800011,O,,NN,,,,true,1,,9,,RES,DU BOIS DE L ETANG,78320,LA VERRIERE,,,78644,,,,,,,,,,,,,,,,,,,1990-12-25,F,,,,,62.43,NAP,N,1.963526,48.75941,0.91,housenumber,9 Residence du Bois de l’Etang 78320 La Verrière,78644_a001_00009,G,9 RESIDENCE DU BOIS DE L ETANG,
312937998,00093,31293799800093,O,1995-01-01,NN,,,2012-02-07T05:54:07,false,4,RN 10,,,,L AGIOT,78320,LA VERRIERE,,,78644,,,,,,,,,,,,,,,,,,,2012-01-26,F,,,,,27.52Z,NAFRev2,O,1.957288,48.759461,0.95,street,L’Agiot 78320 La Verrière,78644_afostt,G,L AGIOT,
313771156,00012,31377115600012,O,,,,,,true,1,,,,,L AGIOT,78320,LA VERRIERE,,,78644,,,,,,,,,,,,,,,,,,,1987-06-03,F,,,,,67.01,NAP,N,1.957288,48.759461,0.95,street,L’Agiot 78320 La Verrière,78644_afostt,G,L AGIOT,
314537804,00010,31453780400010,O,1978-01-01,,,,,true,4,,2,,RES,DU BOIS DE L ETANG,78320,LA VERRIERE,,,78644,,,,,,,,,,,,,,,,,,,1997-12-25,F,,,,,91.3E,NAF1993,N,1.966418,48.758636,0.91,housenumber,2 Residence du Bois de l’Etang 78320 La Verrière,78644_a001_00002,G,2 RESIDENCE DU BOIS DE L ETANG,
315325951,00012,31532595100012,O,1979-01-01,NN,,,2010-04-18T03:44:32,true,5,,41,,RUE,DE CHEVREUSE,78320,LA VERRIERE,,,78644,,,,,,,,,,,,,,,,,,,2008-03-21,F,,,,,55.10Z,NAFRev2,O,1.953896,48.746285,0.96,housenumber,41 Rue de Chevreuse 78320 La Verrière,78644_0045_00041,G,41 RUE DE CHEVREUSE,
315593301,00023,31559330100023,O,,NN,,,,true,1,,20,,RUE,DES VIEUX PRES,78320,LA VERRIERE,,,78644,,,,,,,,,,,,,,,,,,,1982-02-28,F,,,,,18.2E,NAF1993,N,1.956444,48.750957,0.96,housenumber,20 Rue des Vieux Prés 78320 La Verrière,78644_0135_00020,G,20 RUE DES VIEUX PRES,
316090901,00018,31609090100018,O,,,,,,true,1,,,,AV,JOSEPH ROLLO,78320,LA VERRIERE,,,78644,,,,,,,,,,,,,,,,,,,1985-12-25,F,,,,,55.72,NAP,N,1.941389,48.753223,0.84,street,Avenue Joseph Rollo 78320 La Verrière,78644_0085,G,AVENUE JOSEPH ROLLO,
316615137,00015,31661513700015,O,,,,,,true,1,,7,,RUE,MARCEL RIVIERE,78320,LA VERRIERE,,,78644,,,,,,,,,,,,,,,,,,,1997-09-30,F,,,,,74.2B,NAF1993,N,1.94878,48.755496,0.96,housenumber,7 Rue Marcel Rivière 78320 La Verrière,78644_0095_00007,G,7 RUE MARCEL RIVIERE,
316799337,00019,31679933700019,O,,NN,,,,true,1,,27,,RUE,DES FLEURS,78320,LA VERRIERE,,,78644,,,,,,,,,,,,,,,,,,,1992-11-17,F,,,,,45.2V,NAF1993,N,1.956121,48.749726,0.96,housenumber,27 Rue des Fleurs 78320 La Verrière,78644_0060_00027,G,27 RUE DES FLEURS,
317331031,00011,31733103100011,O,1900-01-01,,,,2011-04-28T00:16:44,false,2,,,,,CTRE COM MARCEL RIVIERE,78320,LA VERRIERE,,,78644,,,,,,,,,,,,,,,,,,,1984-12-25,F,,,,,64.48,NAP,N,1.945228,48.754234,0.79,street,Centre Commercial Marcel Riviere 78320 La Verrière,78644_A023,G,CENTRE COMMERCIAL MARCEL RIVIERE,
317681237,00010,31768123700010,O,1980-01-01,NN,,,,true,1,,,,,L AGIOT,78320,LA VERRIERE,,,78644,,,,,,,,,,,,,,,,,,,1997-12-24,F,,,,,70.2C,NAF1993,N,1.957288,48.759461,0.95,street,L’Agiot 78320 La Verrière,78644_afostt,G,L AGIOT,
317875912,00030,31787591200030,O,,NN,,,,true,1,,8,,RES,DU BOIS DE L ETANG,78320,LA VERRIERE,,,78644,,,,,,,,,,,,,,,,,,,1990-03-06,F,,,,,67.07,NAP,N,1.965267,48.759088,0.91,housenumber,8 Residence du Bois de l’Etang 78320 La Verrière,78644_a001_00008,G,8 RESIDENCE DU BOIS DE L ETANG,
317912442,00033,31791244200033,O,1988-01-01,NN,,,,false,4,,25,,RUE,DE LA MARE,78320,LA VERRIERE,,,78644,,,,,,,,,,,,,,,,,,,1995-12-25,F,AGENCE FINANCIERE COMMERCE ET INDUSTRIE,,,,70.3A,NAF1993,O,1.955969,48.755825,0.96,housenumber,25 Rue de la Mare 78320 La Verrière,78644_0100_00025,G,25 RUE DE LA MARE,
318732781,00014,31873278100014,O,1900-01-01,12,2018,,2021-05-12T14:42:55,true,4,LIEUDIT L AGIOT,,,RTE,NATIONALE 10,78320,LA VERRIERE,,,78644,,,,,,,,,,,,,,,,,,,2008-01-01,A,,,,,45.11Z,NAFRev2,O,1.960014,48.760958,0.84,street,Route Nationale 10 78320 La Verrière,78644_0107,G,ROUTE NATIONALE 10,
319461299,00020,31946129900020,O,1987-12-25,NN,,,2017-03-28T12:13:49,true,4,,34,B,RUE,DES CHAMPS,78320,LA VERRIERE,,,78644,,,,,,,,,,,,,,,,,,,2016-12-31,F,,,,,71.11Z,NAFRev2,N,1.954457,48.750545,0.87,housenumber,34bis Rue des Champs 78320 La Verrière,78644_0030_00034_bis,G,34BIS RUE DES CHAMPS,
319838348,00021,31983834800021,O,1989-07-01,,,,2011-04-28T00:18:07,false,4,,,,RUE,MARCEL RIVIERE,78320,LA VERRIERE,,,78644,,,,,,,,,,,,,,,,,,,1998-04-07,F,,,,,15.8C,NAF1993,N,1.947476,48.754623,0.96,street,Rue Marcel Rivière 78320 La Verrière,78644_0095,G,RUE MARCEL RIVIERE,
321234718,00039,32123471800039,O,,,,,,true,1,,,,,L AGIOT,78320,LA VERRIERE,,,78644,,,,,,,,,,,,,,,,,,,1990-12-25,F,,,,,55.40,NAP,N,1.957288,48.759461,0.95,street,L’Agiot 78320 La Verrière,78644_afostt,G,L AGIOT,
321438582,00025,32143858200025,O,1997-03-01,NN,,,2021-05-17T07:54:01,false,4,RN 10,,,,L AGIOT,78320,LA VERRIERE,,,78644,,,,,,,,,,,,,,,,,,,2021-03-30,F,,,,,68.20B,NAFRev2,N,1.957288,48.759461,0.95,street,L’Agiot 78320 La Verrière,78644_afostt,G,L AGIOT,
321577405,00012,32157740500012,O,1900-01-01,,,,2012-02-03T10:51:05,false,2,,,,RUE,DES VIEUX PRES,78320,LA VERRIERE,,,78644,,,,,,,,,,,,,,,,,,,1984-12-25,F,,,,,60.03,NAP,N,1.956259,48.75077,0.96,street,Rue des Vieux Prés 78320 La Verrière,78644_0135,G,RUE DES VIEUX PRES,
321944431,00022,32194443100022,O,1981-10-01,NN,,,2008-11-07T00:38:16,true,5,DOMAINE AGIOT,,,RTE,NATIONALE 10,78320,LA VERRIERE,,,78644,,,,,,,,,,,,,,,,,,,2004-05-27,F,,,,,50.2Z,NAFRev1,O,1.960014,48.760958,0.84,street,Route Nationale 10 78320 La Verrière,78644_0107,G,ROUTE NATIONALE 10,
322496332,00022,32249633200022,O,,NN,,,,true,1,,15,,RES,DU BOIS DE L ETANG,78320,LA VERRIERE,,,78644,,,,,,,,,,,,,,,,,,,,F,,,,,62.41,NAP,N,1.965612,48.760147,0.91,housenumber,15 Residence du Bois de l’Etang 78320 La Verrière,78644_a001_00015,G,15 RESIDENCE DU BOIS DE L ETANG,
322948324,00031,32294832400031,O,2011-01-01,,,,2021-02-23T10:46:27,true,1,,12,,RUE,DE LA PLAINE,78320,LA VERRIERE,,,78644,,,,,,,,,,,,,,,,,,,2011-01-01,A,,,,,90.03A,NAFRev2,N,1.959027,48.749474,0.96,housenumber,12 Rue de la Plaine 78320 La Verrière,78644_0120_00012,G,12 RUE DE LA PLAINE,
323109504,00015,32310950400015,O,,NN,,,,true,1,,,,,CTRE COM BOIS DE L ETANG,78320,LA VERRIERE,,,78644,,,,,,,,,,,,,,,,,,,1996-12-31,F,,,,,52.1B,NAF1993,O,1.965627,48.759123,0.66,street,Residence du Bois de l’Etang 78320 La Verrière,78644_A001,G,RESIDENCE DU BOIS DE L ETANG,
324395425,00022,32439542500022,O,,,,,,true,1,,2,,AV,DES NOES,78320,LA VERRIERE,,,78644,,,,,,,,,,,,,,,,,,,1994-12-31,F,,,,,74.1G,NAF1993,N,1.958393,48.758462,0.81,housenumber,2 Avenue des Noés 78320 La Verrière,78644_0108_00002,G,2 AVENUE DES NOES,
324727189,00015,32472718900015,O,,,,,,true,1,,,,AV,JOSEPH ROLLO,78320,LA VERRIERE,,,78644,,,,,,,,,,,,,,,,,,,1985-12-25,F,,,,,64.49,NAP,N,1.941389,48.753223,0.84,street,Avenue Joseph Rollo 78320 La Verrière,78644_0085,G,AVENUE JOSEPH ROLLO,
324906007,00020,32490600700020,O,,,,,,true,1,,,,,L AGIOT,78320,LA VERRIERE,,,78644,,,,,,,,,,,,,,,,,,,1988-01-22,F,,,,,55.70,NAP,N,1.957288,48.759461,0.95,street,L’Agiot 78320 La Verrière,78644_afostt,G,L AGIOT,
325433084,00028,32543308400028,O,2000-06-20,,,,,false,2,,6,,RUE,DES CHAMPS,78320,LA VERRIERE,,,78644,,,,,,,,,,,,,,,,,,,2000-12-25,F,,,,,85.1C,NAF1993,N,1.955713,48.752013,0.96,housenumber,6 Rue des Champs 78320 La Verrière,78644_0030_00006,G,6 RUE DES CHAMPS,
325802114,00018,32580211400018,O,,,,,,true,1,,,,,L AGIOT,78320,LA VERRIERE,,,78644,,,,,,,,,,,,,,,,,,,1991-05-13,F,,,,,45.1A,NAF1993,N,1.957288,48.759461,0.95,street,L’Agiot 78320 La Verrière,78644_afostt,G,L AGIOT,