siren,nic,siret,statutDiffusionEtablissement,dateCreationEtablissement,trancheEffectifsEtablissement,anneeEffectifsEtablissement,activitePrincipaleRegistreMetiersEtablissement,dateDernierTraitementEtablissement,etablissementSiege,nombrePeriodesEtablissement,complementAdresseEtablissement,numeroVoieEtablissement,indiceRepetitionEtablissement,typeVoieEtablissement,libelleVoieEtablissement,codePostalEtablissement,libelleCommuneEtablissement,libelleCommuneEtrangerEtablissement,distributionSpecialeEtablissement,codeCommuneEtablissement,codeCedexEtablissement,libelleCedexEtablissement,codePaysEtrangerEtablissement,libellePaysEtrangerEtablissement,complementAdresse2Etablissement,numeroVoie2Etablissement,indiceRepetition2Etablissement,typeVoie2Etablissement,libelleVoie2Etablissement,codePostal2Etablissement,libelleCommune2Etablissement,libelleCommuneEtranger2Etablissement,distributionSpeciale2Etablissement,codeCommune2Etablissement,codeCedex2Etablissement,libelleCedex2Etablissement,codePaysEtranger2Etablissement,libellePaysEtranger2Etablissement,dateDebut,etatAdministratifEtablissement,enseigne1Etablissement,enseigne2Etablissement,enseigne3Etablissement,denominationUsuelleEtablissement,activitePrincipaleEtablissement,nomenclatureActivitePrincipaleEtablissement,caractereEmployeurEtablissement,longitude,latitude,geo_score,geo_type,geo_adresse,geo_id,geo_ligne,geo_l4,geo_l5
218901494,00011,21890149400011,O,1983-03-01,01,2018,,2020-08-25T10:19:35,true,4,,,,,,89360,DYE,,,89149,,,,,,,,,,,,,,,,,,,2008-01-01,A,MAIRIE,,,,84.11Z,NAFRev2,O,,,0,,,,,,
258900521,00018,25890052100018,O,1983-03-01,01,2018,,2020-08-25T10:20:43,true,4,,,,,,89360,DYE,,,89149,,,,,,,,,,,,,,,,,,,2019-01-01,F,,,,,84.12Z,NAFRev2,N,,,0,,,,,,
258900562,00012,25890056200012,O,1983-03-01,NN,,,,false,4,,,,,MAIRIE,89360,DYE,,,89149,,,,,,,,,,,,,,,,,,,1996-04-26,F,,,,,75.1E,NAF1993,N,3.869282,47.899416,0.91,street,Rue de la Mairie 89360 Dyé,89149_0130,G,RUE DE LA MAIRIE,
268901675,00010,26890167500010,O,1983-03-01,NN,,,2010-06-26T03:17:38,true,3,,,,,MAIRIE,89360,DYE,,,89149,,,,,,,,,,,,,,,,,,,2008-01-01,A,CCAS,,,,88.99B,NAFRev2,N,3.869282,47.899416,0.91,street,Rue de la Mairie 89360 Dyé,89149_0130,G,RUE DE LA MAIRIE,
268905312,00016,26890531200016,O,1986-01-01,NN,,,2010-06-26T03:17:47,true,3,,,,,MAIRIE,89360,DYE,,,89149,,,,,,,,,,,,,,,,,,,2008-01-01,A,CDE,,,,88.99B,NAFRev2,N,3.869282,47.899416,0.91,street,Rue de la Mairie 89360 Dyé,89149_0130,G,RUE DE LA MAIRIE,
298901497,00016,29890149700016,O,1983-08-10,NN,,,,true,1,,,,,MAIRIE,89360,DYE,,,89149,,,,,,,,,,,,,,,,,,,2000-09-05,F,,,,,70.1C,NAF1993,N,3.869282,47.899416,0.91,street,Rue de la Mairie 89360 Dyé,89149_0130,G,RUE DE LA MAIRIE,
304312119,00023,30431211900023,O,2000-12-20,NN,,,2016-03-16T03:31:41,true,7,,4,,IMP,SAINT CLAUDE,89360,DYE,,,89149,,,,,,,,,,,,,,,,,,,2012-12-31,F,,,,,47.81Z,NAFRev2,N,3.872102,47.898378,0.84,housenumber,4 Impasse Saint Claude 89360 Dyé,89149_0180_00004,G,4 IMPASSE SAINT CLAUDE,
315564377,00010,31556437700010,O,1979-01-01,NN,,,2021-02-23T10:41:18,true,4,,4,,RUE,SAINT PIERRE,89360,DYE,,,89149,,,,,,,,,,,,,,,,,,,2008-01-01,A,,,,,01.11Z,NAFRev2,N,3.869501,47.898449,0.94,housenumber,4 Rue Saint Pierre 89360 Dyé,89149_0190_00004,G,4 RUE SAINT PIERRE,
317396901,00025,31739690100025,O,,NN,,,,true,1,,,,,GRANDE RUE,89360,DYE,,,89149,,,,,,,,,,,,,,,,,,,1989-01-16,F,,,,,38.40,NAP,N,3.869275,47.899715,0.94,street,Grande Rue 89360 Dyé,89149_0070,G,GRANDE RUE,
318823440,00033,31882344000033,O,2020-06-05,,,,2021-02-23T10:43:19,true,1,,16,,,GRAND RUE,89360,DYE,,,89149,,,,,,,,,,,,,,,,,,,2020-06-05,A,,,,,56.21Z,NAFRev2,N,3.868075,47.9,0.81,housenumber,16 Grande Rue 89360 Dyé,89149_0070_00016,G,16 GRANDE RUE,
318949450,00015,31894945000015,O,,NN,,,2007-01-18T09:14:59,true,1,,,,,,89360,DYE,,,89149,,,,,,,,,,,,,,,,,,,1990-05-01,F,,,,,01.3Z,NAF1993,N,,,0,,,,,,
350242905,00015,35024290500015,O,1989-04-03,NN,,,2014-07-08T00:53:54,true,5,,1,,RUE,DES FOSSES,89360,DYE,,,89149,,,,,,,,,,,,,,,,,,,2008-01-01,F,,,,,96.02A,NAFRev2,N,3.881488,47.897034,0.5,street,Les Fosses 89360 Dyé,89149_k55zz7,G,LES FOSSES,
378597215,00011,37859721500011,O,1990-07-01,NN,,,2018-10-12T08:15:48,false,5,,23,,,GRANDE RUE,89360,DYE,,,89149,,,,,,,,,,,,,,,,,,,2018-09-30,F,,,,,01.11Z,NAFRev2,O,3.870723,47.899272,0.94,housenumber,23 Grande Rue 89360 Dyé,89149_0070_00023,G,23 GRANDE RUE,
378597215,00029,37859721500029,O,2018-09-30,,,,2021-02-23T11:07:17,true,1,,25,,,GRANDE RUE,89360,DYE,,,89149,,,,,,,,,,,,,,,,,,,2018-09-30,A,,,,,01.11Z,NAFRev2,N,3.871363,47.899154,0.94,housenumber,25 Grande Rue 89360 Dyé,89149_0070_00025,G,25 GRANDE RUE,
378679393,00017,37867939300017,O,,NN,,,,true,1,,23,,,GRANDE RUE,89360,DYE,,,89149,,,,,,,,,,,,,,,,,,,1990-07-02,F,,,,,01.00,NAP,N,3.870723,47.899272,0.94,housenumber,23 Grande Rue 89360 Dyé,89149_0070_00023,G,23 GRANDE RUE,
384685376,00020,38468537600020,O,1999-01-01,NN,,,2008-11-08T00:45:36,false,3,,13,,,GRANDE RUE,89360,DYE,,,89149,,,,,,,,,,,,,,,,,,,2004-11-17,F,,,,,45.4J,NAFRev1,O,3.868175,47.900029,0.94,housenumber,13 Grande Rue 89360 Dyé,89149_0070_00013,G,13 GRANDE RUE,
385147384,00015,38514738400015,O,1992-03-23,,,,2020-07-21T04:08:22,true,3,,,,RTE,DE BERNOUIL,89360,DYE,,,89149,,,,,,,,,,,,,,,,,,,1992-12-25,F,,,,,20.1A,NAF1993,N,3.87528,47.89795,0.82,street,Route de Bernouil 89360 Dyé,89149_0018,G,ROUTE DE BERNOUIL,
392068391,00029,39206839100029,O,2008-02-01,,,,2014-09-25T03:19:53,true,2,,8,,RUE,BOULIPOT,89360,DYE,,,89149,,,,,,,,,,,,,,,,,,,2014-09-30,F,,,,,47.79Z,NAFRev2,N,3.867726,47.899604,0.94,housenumber,8 Rue Boulipot 89360 Dyé,89149_0020_00008,G,8 RUE BOULIPOT,
393633672,00018,39363367200018,O,,,,,,true,1,,,,,,89360,DYE,,,89149,,,,,,,,,,,,,,,,,,,1997-10-30,F,,,,,01.1A,NAF1993,N,,,0,,,,,,
399758713,00016,39975871300016,O,1994-12-01,NN,,,2012-07-28T12:08:07,true,4,,,,,,89360,DYE,,,89149,,,,,,,,,,,,,,,,,,,2008-12-25,F,,,,,68.20B,NAFRev2,N,,,0,,,,,,
399917079,00010,39991707900010,O,1995-01-01,NN,,,2007-11-08T09:03:22,true,3,,,,,,89360,DYE,,,89149,,,,,,,,,,,,,,,,,,,2007-07-08,F,,,,,70.2B,NAFRev1,N,,,0,,,,,,
403891195,00022,40389119500022,O,1997-01-01,NN,,,2006-11-25T15:05:47,true,3,,31,,,GRANDE RUE,89360,DYE,,,89149,,,,,,,,,,,,,,,,,,,2003-12-31,F,,,,,92.6C,NAFRev1,N,3.872433,47.899059,0.94,housenumber,31 Grande Rue 89360 Dyé,89149_0070_00031,G,31 GRANDE RUE,
405046194,00024,40504619400024,O,2007-11-01,,,,2014-07-08T01:37:52,false,3,,31,,,GRANDE RUE,89360,DYE,,,89149,,,,,,,,,,,,,,,,,,,2010-02-27,F,,,,,43.22A,NAFRev2,N,3.872433,47.899059,0.94,housenumber,31 Grande Rue 89360 Dyé,89149_0070_00031,G,31 GRANDE RUE,
408143493,00018,40814349300018,O,1984-12-31,NN,,,2018-01-04T03:58:14,true,4,,7,,GR,RUE,89360,DYE,,,89149,,,,,,,,,,,,,,,,,,,2017-12-31,F,,,,,01.11Z,NAFRev2,N,3.867568,47.900225,0.73,housenumber,7 Grande Rue 89360 Dyé,89149_0070_00007,G,7 GRANDE RUE,
408143501,00018,40814350100018,O,1980-12-31,NN,,,2017-07-21T04:43:23,true,4,,,,,FERME DE LA BROSSE,89360,DYE,,,89149,,,,,,,,,,,,,,,,,,,2017-06-30,F,,,,,01.11Z,NAFRev2,N,3.863096,47.885258,0.93,street,Ferme de la Brosse 89360 Dyé,89149_B052,G,FERME DE LA BROSSE,
410180947,00013,41018094700013,O,1977-12-25,NN,,,2018-02-02T03:56:34,true,3,,11,,GR,RUE,89360,DYE,,,89149,,,,,,,,,,,,,,,,,,,2008-01-01,A,,,,,01.11Z,NAFRev2,N,3.867818,47.900152,0.75,housenumber,11 Grande Rue 89360 Dyé,89149_0070_00011,G,11 GRANDE RUE,
413215864,00021,41321586400021,O,2006-01-03,NN,,,2010-04-18T07:38:19,false,3,,2,,RUE,DES JEUX,89360,DYE,,,89149,,,,,,,,,,,,,,,,,,,2008-05-09,F,,,,,46.90Z,NAFRev2,O,3.870101,47.899149,0.93,housenumber,2 Rue des Jeux 89360 Dyé,89149_0100_00002,G,2 RUE DES JEUX,
417806841,00017,41780684100017,O,1998-02-06,NN,,,2010-02-04T14:23:47,false,4,,6,,RUE,ST PIERRE,89360,DYE,,,89149,,,,,,,,,,,,,,,,,,,2010-01-15,F,,,,,01.61Z,NAFRev2,N,3.869568,47.898253,0.82,housenumber,6 Rue Saint Pierre 89360 Dyé,89149_0190_00006,G,6 RUE SAINT PIERRE,
417806841,00025,41780684100025,O,2010-01-15,,,4312BA,2021-02-23T11:38:20,true,1,,4,,RUE,SAINT PIERRE,89360,DYE,,,89149,,,,,,,,,,,,,,,,,,,2010-01-15,A,,,,,01.61Z,NAFRev2,N,3.869501,47.898449,0.94,housenumber,4 Rue Saint Pierre 89360 Dyé,89149_0190_00004,G,4 RUE SAINT PIERRE,
418539243,00018,41853924300018,O,1998-05-02,,,,2012-07-12T08:34:48,false,3,,1,,RUE,DE LA FONTAINE,89360,DYE,,,89149,,,,,,,,,,,,,,,,,,,1999-12-27,F,,,,,45.4D,NAF1993,N,3.869791,47.899155,0.94,housenumber,1 Rue de la Fontaine 89360 Dyé,89149_0060_00001,G,1 RUE DE LA FONTAINE,
419533203,00016,41953320300016,O,1998-01-01,NN,,,2016-05-23T04:07:44,true,4,,2,,RUE,DE L'ABREUVOIR,89360,DYE,,,89149,,,,,,,,,,,,,,,,,,,2016-04-30,F,,,,,68.20B,NAFRev2,N,3.870153,47.900444,0.94,housenumber,2 Rue de l’Abreuvoir 89360 Dyé,89149_0010_00002,G,2 RUE DE L ABREUVOIR,
426410031,00014,42641003100014,O,,,,,,true,1,,,,,,89360,DYE,,,89149,,,,,,,,,,,,,,,,,,,1985-12-25,F,,,,,38.40,NAP,N,,,0,,,,,,
428236624,00014,42823662400014,O,1988-12-31,NN,,,2008-01-05T01:24:13,true,3,,,,,,89360,DYE,,,89149,,,,,,,,,,,,,,,,,,,2008-01-01,A,,,,,01.11Z,NAFRev2,N,,,0,,,,,,
428536015,00012,42853601500012,O,1996-05-12,NN,,,2008-01-05T20:49:54,true,3,,,,,,89360,DYE,,,89149,,,,,,,,,,,,,,,,,,,2008-01-01,A,,,,,68.20B,NAFRev2,N,,,0,,,,,,
440908903,00014,44090890300014,O,2001-12-26,NN,,,2020-09-30T03:56:47,true,4,,,,,FERME DE LA BROSSE,89360,DYE,,,89149,,,,,,,,,,,,,,,,,,,2019-06-30,F,,,,,01.21Z,NAFRev2,N,3.863096,47.885258,0.93,street,Ferme de la Brosse 89360 Dyé,89149_B052,G,FERME DE LA BROSSE,
452458359,00034,45245835900034,O,2018-03-24,,,,2018-06-01T08:34:44,false,1,,2,,RUE,BOULIPOT,89360,DYE,,,89149,,,,,,,,,,,,,,,,,,,2018-03-24,A,,,,,68.20B,NAFRev2,N,3.867766,47.899967,0.94,housenumber,2 Rue Boulipot 89360 Dyé,89149_0020_00002,G,2 RUE BOULIPOT,
477864763,00016,47786476300016,O,2004-07-19,NN,,,2008-11-08T02:41:23,true,3,,2,,CHE,DU MOULIN,89360,DYE,,,89149,,,,,,,,,,,,,,,,,,,2005-06-30,F,,,,,28.5D,NAFRev1,N,3.873273,47.898966,0.82,housenumber,2 Chemin du Moulin 89360 Dyé,89149_0135_00002,G,2 CHEMIN DU MOULIN,
499785251,00012,49978525100012,O,2007-09-03,NN,,,2016-04-26T04:45:05,false,4,,2,,RUE,SAINT PIERRE,89360,DYE,,,89149,,,,,,,,,,,,,,,,,,,2014-11-27,F,,,,,71.12B,NAFRev2,O,3.869439,47.898898,0.94,housenumber,2 Rue Saint Pierre 89360 Dyé,89149_0190_00002,G,2 RUE SAINT PIERRE,
513297622,00013,51329762200013,O,2009-06-19,,,,2014-12-04T04:44:24,true,1,,2,,RUE,SAINT PIERRE,89360,DYE,,,89149,,,,,,,,,,,,,,,,,,,2009-06-19,A,,,,,68.20B,NAFRev2,N,3.869439,47.898898,0.94,housenumber,2 Rue Saint Pierre 89360 Dyé,89149_0190_00002,G,2 RUE SAINT PIERRE,
515284032,00015,51528403200015,O,2009-11-01,02,2018,,2020-08-25T10:30:49,true,1,,4,,RUE,SAINT PIERRE,89360,DYE,,,89149,,,,,,,,,,,,,,,,,,,2009-11-01,A,,,,,78.30Z,NAFRev2,N,3.869501,47.898449,0.94,housenumber,4 Rue Saint Pierre 89360 Dyé,89149_0190_00004,G,4 RUE SAINT PIERRE,
517631313,00023,51763131300023,O,2014-06-05,,,,2018-12-11T03:46:54,true,2,,5,,RUE,DE LA FONTAINE,89360,DYE,,,89149,,,,,,,,,,,,,,,,,,,2017-07-23,F,,,,,70.21Z,NAFRev2,N,3.869038,47.898778,0.94,housenumber,5 Rue de la Fontaine 89360 Dyé,89149_0060_00005,G,5 RUE DE LA FONTAINE,
518489380,00015,51848938000015,O,2009-12-01,NN,,4331ZB,2018-09-29T12:34:01,true,7,,21,,,GRANDE RUE,89360,DYE,,,89149,,,,,,,,,,,,,,,,,,,2016-12-31,F,,,,,43.33Z,NAFRev2,O,3.870752,47.899619,0.94,housenumber,21 Grande Rue 89360 Dyé,89149_0070_00021,G,21 GRANDE RUE,
519041255,00018,51904125500018,O,2009-12-12,,,,2020-12-01T03:51:28,true,1,,1,,,BIS IMPASSE DES EAUX BUS,89360,DYE,,,89149,,,,,,,,,,,,,,,,,,,2009-12-12,A,,,,,68.20B,NAFRev2,N,3.871086,47.899105,0.69,housenumber,1b Impasse des Eaux Bues 89360 Dyé,89149_0050_00001_b,G,1B IMPASSE DES EAUX BUES,
750123440,00018,75012344000018,O,2012-03-01,,,,2019-07-27T03:48:36,true,2,,5,,RUE,DE LA FONTAINE,89360,DYE,,,89149,,,,,,,,,,,,,,,,,,,2013-12-31,F,,,,POLYMERE,70.22Z,NAFRev2,N,3.869038,47.898778,0.94,housenumber,5 Rue de la Fontaine 89360 Dyé,89149_0060_00005,G,5 RUE DE LA FONTAINE,
750546335,00019,75054633500019,O,2012-04-01,,,9602AB,2014-06-27T01:25:38,true,1,,4,,CHE,DE RONDE,89360,DYE,,,89149,,,,,,,,,,,,,,,,,,,2012-04-01,A,,,,SANDRINE COIFFURE,96.02A,NAFRev2,N,3.867106,47.897371,0.86,housenumber,4 Chemin de Ronde 89360 Dyé,89149_0065_00004,G,4 CHEMIN DE RONDE,
751669052,00019,75166905200019,O,2010-01-19,,,,2012-05-23T16:36:09,true,1,,2,,RTE,DE CARISEY,89360,DYE,,,89149,,,,,,,,,,,,,,,,,,,2010-01-19,A,,,,,94.99Z,NAFRev2,N,3.864596,47.900735,0.83,housenumber,2 Route de Carisey 89360 Dyé,89149_0025_00002,G,2 ROUTE DE CARISEY,
778663393,00016,77866339300016,O,1900-01-01,,,,,true,3,,,,,,89360,DYE,,,89149,,,,,,,,,,,,,,,,,,,1994-12-25,F,,,,,02.0D,NAF1993,N,,,0,,,,,,
778663401,00017,77866340100017,O,1900-01-01,NN,,,,true,3,,,,,,89360,DYE,,,89149,,,,,,,,,,,,,,,,,,,1991-12-25,F,,,,,48.01,NAP,N,,,0,,,,,,
778663419,00019,77866341900019,O,,,,,,true,1,,,,,,89360,DYE,,,89149,,,,,,,,,,,,,,,,,,,,F,,,,,55.71,NAP,N,,,0,,,,,,
778663468,00016,77866346800016,O,,,,,,true,1,,,,,,89360,DYE,,,89149,,,,,,,,,,,,,,,,,,,,F,,,,,90.11,NAP,N,,,0,,,,,,
778664904,00027,77866490400027,O,,,,,,true,1,,,,,,89360,DYE,,,89149,,,,,,,,,,,,,,,,,,,1984-12-25,F,,,,,55.73,NAP,N,,,0,,,,,,
788199628,00017,78819962800017,O,,NN,,,,true,1,,,,,,89360,DYE,,,89149,,,,,,,,,,,,,,,,,,,1992-06-30,F,,,,,45.3A,NAF1993,N,,,0,,,,,,
793435553,00029,79343555300029,O,2013-06-11,,,,2013-06-18T03:21:20,false,1,DL LES CHAMPS PREUX,,,,,89360,DYE,,,89149,,,,,,,,,,,,,,,,,,,2013-06-11,A,,,,,35.11Z,NAFRev2,N,3.852229,47.88725,0.81,locality,Les Champs Preux 89360 Dyé,89149_B024,D,LES CHAMPS PREUX,
795198308,00012,79519830800012,O,2013-09-09,,,,2015-06-04T03:28:44,true,2,,4,,IMP,SAINT CLAUDE,89360,DYE,,,89149,,,,,,,,,,,,,,,,,,,2013-12-31,F,,,,,47.89Z,NAFRev2,N,3.872102,47.898378,0.84,housenumber,4 Impasse Saint Claude 89360 Dyé,89149_0180_00004,G,4 IMPASSE SAINT CLAUDE,
800626590,00015,80062659000015,O,2014-03-03,,,,2019-04-30T03:55:22,true,2,,2,B,CHE,DE RONDE,89360,DYE,,,89149,,,,,,,,,,,,,,,,,,,2019-03-24,F,,,,,85.59A,NAFRev2,N,3.86668,47.897347,0.87,housenumber,2b Chemin de Ronde 89360 Dyé,89149_0065_00002_b,G,2B CHEMIN DE RONDE,
809553688,00015,80955368800015,O,2014-12-14,,,,2015-02-12T11:41:54,true,1,,2,,RUE,DU PRESBYTERE,89360,DYE,,,89149,,,,,,,,,,,,,,,,,,,2014-12-14,A,,,,,47.99A,NAFRev2,N,3.86859,47.89918,0.93,housenumber,2 Rue du Presbytère 89360 Dyé,89149_0165_00002,G,2 RUE DU PRESBYTERE,
814521555,00015,81452155500015,O,2015-10-10,,,,2020-04-08T03:39:50,false,2,,21,,,Grande Rue,89360,DYE,,,89149,,,,,,,,,,,,,,,,,,,2020-03-30,F,,,,,68.20B,NAFRev2,N,3.870752,47.899619,0.94,housenumber,21 Grande Rue 89360 Dyé,89149_0070_00021,G,21 GRANDE RUE,
817551559,00013,81755155900013,O,2016-01-06,,,,2016-01-12T04:27:44,true,1,,1,,CHE,DES OISEAUX,89360,DYE,,,89149,,,,,,,,,,,,,,,,,,,2016-01-06,A,,,,TOINOU MENUISERIE,43.32A,NAFRev2,N,3.873068,47.898691,0.83,housenumber,1 Chemin des Oiseaux 89360 Dyé,89149_0150_00001,G,1 CHEMIN DES OISEAUX,
879227718,00019,87922771800019,O,2019-10-15,,,4334ZC,2019-12-03T12:43:45,true,1,,2,,,GRANDE RUE,89360,DYE,,,89149,,,,,,,,,,,,,,,,,,,2019-10-15,A,,,,,43.34Z,NAFRev2,N,3.866407,47.900522,0.94,housenumber,2 Grande Rue 89360 Dyé,89149_0070_00002,G,2 GRANDE RUE,
898082474,00013,89808247400013,O,2021-04-01,,,,2021-04-12T08:15:47,true,1,,1,,CHE,DES OISEAUX,89360,DYE,,,89149,,,,,,,,,,,,,,,,,,,2021-04-01,A,,,,,01.49Z,NAFRev2,N,3.873068,47.898691,0.83,housenumber,1 Chemin des Oiseaux 89360 Dyé,89149_0150_00001,G,1 CHEMIN DES OISEAUX,
