siren,nic,siret,statutDiffusionEtablissement,dateCreationEtablissement,trancheEffectifsEtablissement,anneeEffectifsEtablissement,activitePrincipaleRegistreMetiersEtablissement,dateDernierTraitementEtablissement,etablissementSiege,nombrePeriodesEtablissement,complementAdresseEtablissement,numeroVoieEtablissement,indiceRepetitionEtablissement,typeVoieEtablissement,libelleVoieEtablissement,codePostalEtablissement,libelleCommuneEtablissement,libelleCommuneEtrangerEtablissement,distributionSpecialeEtablissement,codeCommuneEtablissement,codeCedexEtablissement,libelleCedexEtablissement,codePaysEtrangerEtablissement,libellePaysEtrangerEtablissement,complementAdresse2Etablissement,numeroVoie2Etablissement,indiceRepetition2Etablissement,typeVoie2Etablissement,libelleVoie2Etablissement,codePostal2Etablissement,libelleCommune2Etablissement,libelleCommuneEtranger2Etablissement,distributionSpeciale2Etablissement,codeCommune2Etablissement,codeCedex2Etablissement,libelleCedex2Etablissement,codePaysEtranger2Etablissement,libellePaysEtranger2Etablissement,dateDebut,etatAdministratifEtablissement,enseigne1Etablissement,enseigne2Etablissement,enseigne3Etablissement,denominationUsuelleEtablissement,activitePrincipaleEtablissement,nomenclatureActivitePrincipaleEtablissement,caractereEmployeurEtablissement,longitude,latitude,geo_score,geo_type,geo_adresse,geo_id,geo_ligne,geo_l4,geo_l5
210902342,00018,21090234200018,O,1983-03-01,01,2019,,2021-10-27T08:06:39,true,3,,,,,,09000,PRADIERES,,,09234,,,,,,,,,,,,,,,,,,,2008-01-01,A,MAIRIE,,,,84.11Z,NAFRev2,N,,,0,,,,,,
210902342,00026,21090234200026,O,1997-01-01,NN,,,2007-06-12T15:30:42,false,3,MAIRIE,,,,,09000,PRADIERES,,,09234,,,,,,,,,,,,,,,,,,,2005-02-16,F,SERVICE DES EAUX,,,,41.0Z,NAFRev1,N,,,0,,,,,,
260903380,00012,26090338000012,O,1984-10-01,NN,,,2010-06-26T03:04:03,true,3,,,,,MAIRIE,09000,PRADIERES,,,09234,,,,,,,,,,,,,,,,,,,2008-01-01,A,CCAS,,,,88.99B,NAFRev2,N,3.0709671,50.6304695,0.92,poi.townhall,Hôtel de Ville Lille,https://osm.org/way/40917078,G,,
318114162,00023,31811416200023,O,1997-02-10,NN,,,2009-06-27T04:12:42,true,4,,,,,LE BARRY,09000,PRADIERES,,,09234,,,,,,,,,,,,,,,,,,,2007-06-29,F,,,,,45.2V,NAFRev1,O,1.65274,42.963323,0.59,street,Barry Hameau 09000 Pradières,09234_B005,G,BARRY HAMEAU,
322518713,00019,32251871300019,O,1981-06-15,NN,,,2016-01-12T00:11:23,true,3,,,,,,09000,PRADIERES,,,09234,,,,,,,,,,,,,,,,,,,2008-01-01,A,,,,,01.50Z,NAFRev2,N,,,0,,,,,,
398313460,00022,39831346000022,O,2006-01-01,NN,,4399CZ,2017-11-17T14:56:59,true,5,,,,,AUGE,09000,PRADIERES,,,09234,,,,,,,,,,,,,,,,,,,2017-09-30,F,MACONNERIE SIRE,,,,43.99C,NAFRev2,N,1.64869,42.968314,0.94,street,Auge 09000 Pradières,09234_bf9xoi,G,AUGE,
404987075,00011,40498707500011,O,1975-01-01,NN,,,2012-01-18T04:49:27,true,4,,,,,ARENALS,09000,PRADIERES,,,09234,,,,,,,,,,,,,,,,,,,2011-10-08,F,,,,,01.45Z,NAFRev2,N,1.637354,42.968051,0.91,street,Les Arenals 09000 Pradières,09234_lqngh2,G,LES ARENALS,
404987083,00015,40498708300015,O,1986-08-13,NN,,,2016-01-20T03:37:25,true,4,,,,,BUSCA,09000,PRADIERES,,,09234,,,,,,,,,,,,,,,,,,,2015-12-14,F,,,,,01.42Z,NAFRev2,N,1.645279,42.968925,0.94,street,Busca 09000 Pradières,09234_78i1et,G,BUSCA,
410882013,00031,41088201300031,O,2012-12-27,NN,,,2016-04-26T04:00:10,true,3,,,,,CAMPS VIEUX,09000,PRADIERES,,,09234,,,,,,,,,,,,,,,,,,,2015-09-30,F,,,,,63.11Z,NAFRev2,N,1.644954,42.96985,0.69,street,Lieu Dit Camp Vieux 09000 Pradières,09234_B012,G,LIEU DIT CAMP VIEUX,
422612879,00029,42261287900029,O,2002-04-01,01,2019,5610CQ,2021-10-27T08:03:59,true,3,,,,LD,CAMP VIEUX,09000,PRADIERES,,,09234,,,,,,,,,,,,,,,,,,,2008-01-01,A,,,,,56.10A,NAFRev2,N,1.644954,42.96985,0.92,street,Lieu Dit Camp Vieux 09000 Pradières,09234_B012,G,LIEU DIT CAMP VIEUX,
424104073,00020,42410407300020,O,2012-01-01,,,,2012-01-18T04:49:27,false,1,,,,LD,LES ARENALS,09000,PRADIERES,,,09234,,,,,,,,,,,,,,,,,,,2012-01-01,A,,,,,01.42Z,NAFRev2,N,1.637354,42.968051,0.93,street,Les Arenals 09000 Pradières,09234_lqngh2,G,LES ARENALS,
424938439,00017,42493843900017,O,1999-11-02,NN,,,2014-07-08T02:03:15,true,6,,,,,COSTE BELLE,09000,PRADIERES,,,09234,,,,,,,,,,,,,,,,,,,2013-09-01,A,,,,,96.04Z,NAFRev2,O,1.642749,42.970359,0.94,street,Coste Belle 09000 Pradières,09234_B018,G,COSTE BELLE,
432125755,00012,43212575500012,O,1999-01-01,NN,,,2016-01-12T00:22:44,true,3,,,,,,09000,PRADIERES,,,09234,,,,,,,,,,,,,,,,,,,2008-01-01,A,,,,,01.11Z,NAFRev2,N,,,0,,,,,,
433439171,00011,43343917100011,O,2000-10-01,NN,,,2014-10-23T19:51:26,true,3,,,,,LE BARRY,09000,PRADIERES,,,09234,,,,,,,,,,,,,,,,,,,2008-01-01,A,,,,,68.20A,NAFRev2,N,1.65274,42.963323,0.59,street,Barry Hameau 09000 Pradières,09234_B005,G,BARRY HAMEAU,
442286431,00022,44228643100022,O,2003-09-01,NN,,,2007-10-25T08:30:24,false,3,AUGE,,,,,09000,PRADIERES,,,09234,,,,,,,,,,,,,,,,,,,2007-08-01,F,,,,,91.3E,NAFRev1,N,1.64869,42.968314,0.94,street,Auge 09000 Pradières,09234_bf9xoi,D,AUGE,
449531276,00011,44953127600011,O,2003-07-01,NN,,,2016-11-23T03:32:18,true,3,,,,,COSTEBELLE,09000,PRADIERES,,,09234,,,,,,,,,,,,,,,,,,,2008-01-01,A,,,,,68.20A,NAFRev2,N,1.642749,42.970359,0.77,street,Coste Belle 09000 Pradières,09234_B018,G,COSTE BELLE,
452388523,00071,45238852300071,O,2016-09-15,,,,2018-03-09T15:01:50,false,2,,,,,COSTE BELLE,09000,PRADIERES,,,09234,,,,,,,,,,,,,,,,,,,2018-04-01,F,,,,,86.90D,NAFRev2,N,1.642749,42.970359,0.94,street,Coste Belle 09000 Pradières,09234_B018,G,COSTE BELLE,
452532567,00016,45253256700016,O,2003-01-09,NN,,,2008-01-05T02:46:03,true,3,CHEZ MR PEYRE JEAN LOUIS,,,,COSTEBELLE,09000,PRADIERES,,,09234,,,,,,,,,,,,,,,,,,,2008-01-01,A,,,,,93.12Z,NAFRev2,N,1.642749,42.970359,0.77,street,Coste Belle 09000 Pradières,09234_B018,G,COSTE BELLE,
453473514,00017,45347351400017,O,2004-04-28,NN,,,2019-09-17T03:42:27,true,3,,,,,LIEU DIT AUGE,09000,PRADIERES,,,09234,,,,,,,,,,,,,,,,,,,2008-01-01,A,,,,,68.20A,NAFRev2,N,1.64869,42.968314,0.94,street,Auge 09000 Pradières,09234_bf9xoi,G,AUGE,
478442817,00019,47844281700019,O,2004-07-19,NN,,,2008-01-05T03:42:58,true,3,,,,,AUGE,09000,PRADIERES,,,09234,,,,,,,,,,,,,,,,,,,2008-01-01,A,,,,,94.99Z,NAFRev2,N,1.64869,42.968314,0.94,street,Auge 09000 Pradières,09234_bf9xoi,G,AUGE,
501271613,00017,50127161300017,O,2007-11-16,,,,2008-01-05T02:03:27,true,2,,,,,AUGE,09000,PRADIERES,,,09234,,,,,,,,,,,,,,,,,,,2008-01-01,A,,,,,68.20B,NAFRev2,N,1.64869,42.968314,0.94,street,Auge 09000 Pradières,09234_bf9xoi,G,AUGE,
510007859,00018,51000785900018,O,2009-01-21,,,,2009-04-15T19:58:00,true,2,,,,HAM,D AUGE,09000,PRADIERES,,,09234,,,,,,,,,,,,,,,,,,,2009-04-15,F,,,,,81.21Z,NAFRev2,N,1.64869,42.968314,0.68,street,Auge 09000 Pradières,09234_bf9xoi,G,AUGE,
530720747,00019,53072074700019,O,2010-04-23,,,,2011-03-02T16:21:06,true,1,CHEZ MME NIN,,,,LAUJOLLE,09000,PRADIERES,,,09234,,,,,,,,,,,,,,,,,,,2010-04-23,A,,,,,94.99Z,NAFRev2,N,1.640681,42.971018,0.93,street,Laujolle 09000 Pradières,09234_k3bv2j,G,LAUJOLLE,
552081317,14613,55208131714613,O,1986-07-08,,,,2007-05-22T02:17:47,false,3,,,,,,09000,PRADIERES,,,09234,,,,,,,,,,,,,,,,,,,1993-12-10,F,EDF GRPH PYRENEES,,,,40.1Z,NAF1993,N,,,0,,,,,,
798845459,00014,79884545900014,O,2013-11-08,,,,2018-12-19T04:41:00,true,2,,,,,CAMP VIEUX,09000,PRADIERES,,,09234,,,,,,,,,,,,,,,,,,,2018-12-14,F,,,,DELEEN TECH,46.51Z,NAFRev2,N,1.644954,42.96985,0.92,street,Lieu Dit Camp Vieux 09000 Pradières,09234_B012,G,LIEU DIT CAMP VIEUX,
817859994,00011,81785999400011,O,2015-12-14,,,,2016-01-20T03:37:25,true,1,,,,LD,BUSCA,09000,PRADIERES,,,09234,,,,,,,,,,,,,,,,,,,2015-12-14,A,,,,,01.42Z,NAFRev2,N,1.645279,42.968925,0.94,street,Busca 09000 Pradières,09234_78i1et,G,BUSCA,
821326261,00012,82132626100012,O,2016-07-01,,,,2016-07-11T08:42:03,true,1,,,,LD,CAMP VIEUX,09000,PRADIERES,,,09234,,,,,,,,,,,,,,,,,,,2016-07-01,A,,,,DELEENTECH,46.51Z,NAFRev2,N,1.644954,42.96985,0.92,street,Lieu Dit Camp Vieux 09000 Pradières,09234_B012,G,LIEU DIT CAMP VIEUX,
822057386,00028,82205738600028,O,2021-06-09,,,,2021-06-15T09:14:29,true,1,,,,,FOUNT GRAND,09000,PRADIERES,,,09234,,,,,,,,,,,,,,,,,,,2021-06-09,A,,,,,01.30Z,NAFRev2,N,1.656783,42.964674,0.93,street,Fount Grand 09000 Pradières,09234_B031,G,FOUNT GRAND,
829515931,00014,82951593100014,O,2017-05-09,,,8129BP,2017-05-10T10:50:33,true,1,,,,,MINJOU,09000,PRADIERES,,,09234,,,,,,,,,,,,,,,,,,,2017-05-09,A,,,,,81.29B,NAFRev2,N,1.653078,42.96589,0.94,street,Minjou 09000 Pradières,09234_u4ek2j,G,MINJOU,
842469496,00017,84246949600017,O,2018-10-01,,,,2018-09-21T03:44:21,true,1,,,,,LE MOLINA,09000,PRADIERES,,,09234,,,,,,,,,,,,,,,,,,,2018-10-01,A,,,,LES SOLUTIONS VERTES,81.30Z,NAFRev2,N,1.651259,42.967574,0.46,street,Moulina 09000 Pradières,09234_275ecm,G,MOULINA,
849495015,00018,84949501500018,O,2019-03-22,,,,2019-03-28T09:27:50,true,1,,,,LD,LE REDOULIER,09000,PRADIERES,,,09234,,,,,,,,,,,,,,,,,,,2019-03-22,A,,,,,68.20B,NAFRev2,N,,,0,,,,,,
888083417,00020,88808341700020,O,2014-01-01,,,,2020-08-14T10:54:50,false,1,,,,LD,CAMP VIEUX,09000,PRADIERES,,,09234,,,,,,,,,,,,,,,,,,,2014-01-01,A,,,,,47.91A,NAFRev2,N,1.644954,42.96985,0.92,street,Lieu Dit Camp Vieux 09000 Pradières,09234_B012,G,LIEU DIT CAMP VIEUX,
