siren,nic,siret,statutDiffusionEtablissement,dateCreationEtablissement,trancheEffectifsEtablissement,anneeEffectifsEtablissement,activitePrincipaleRegistreMetiersEtablissement,dateDernierTraitementEtablissement,etablissementSiege,nombrePeriodesEtablissement,complementAdresseEtablissement,numeroVoieEtablissement,indiceRepetitionEtablissement,typeVoieEtablissement,libelleVoieEtablissement,codePostalEtablissement,libelleCommuneEtablissement,libelleCommuneEtrangerEtablissement,distributionSpecialeEtablissement,codeCommuneEtablissement,codeCedexEtablissement,libelleCedexEtablissement,codePaysEtrangerEtablissement,libellePaysEtrangerEtablissement,complementAdresse2Etablissement,numeroVoie2Etablissement,indiceRepetition2Etablissement,typeVoie2Etablissement,libelleVoie2Etablissement,codePostal2Etablissement,libelleCommune2Etablissement,libelleCommuneEtranger2Etablissement,distributionSpeciale2Etablissement,codeCommune2Etablissement,codeCedex2Etablissement,libelleCedex2Etablissement,codePaysEtranger2Etablissement,libellePaysEtranger2Etablissement,dateDebut,etatAdministratifEtablissement,enseigne1Etablissement,enseigne2Etablissement,enseigne3Etablissement,denominationUsuelleEtablissement,activitePrincipaleEtablissement,nomenclatureActivitePrincipaleEtablissement,caractereEmployeurEtablissement,longitude,latitude,geo_score,geo_type,geo_adresse,geo_id,geo_ligne,geo_l4,geo_l5
211602735,00014,21160273500014,O,1983-03-01,02,2019,,2021-10-27T08:07:00,true,3,,,,,,16240,RAIX,,,16273,,,,,,,,,,,,,,,,,,,2008-01-01,A,MAIRIE,,,,84.11Z,NAFRev2,O,,,0,,,,,,
261603583,00012,26160358300012,O,1986-01-06,NN,,,2016-07-23T12:12:59,true,4,MAIRIE,,,,,16240,RAIX,,,16273,,,,,,,,,,,,,,,,,,,2016-01-01,F,CCAS,,,,88.99B,NAFRev2,N,0.113374,46.000405,0.9,street,Place de la Mairie 16240 Raix,16273_0036,D,PLACE DE LA MAIRIE,
291600963,00016,29160096300016,O,,,,,2006-11-25T09:10:26,true,1,,,,,MAIRIE,16240,RAIX,,,16273,,,,,,,,,,,,,,,,,,,1989-12-31,F,,,,,90.12,NAP,N,0.113374,46.000405,0.9,street,Place de la Mairie 16240 Raix,16273_0036,G,PLACE DE LA MAIRIE,
304505357,00018,30450535700018,O,1973-04-04,01,2019,,2021-10-27T08:15:13,true,4,,,,,CHEMIN DE TUSSON,16240,RAIX,,,16273,,,,,,,,,,,,,,,,,,,2008-01-01,A,,,,,01.50Z,NAFRev2,O,0.110912,45.998116,0.93,street,Chemin de Tusson 16240 Raix,16273_0060,G,CHEMIN DE TUSSON,
321416067,00031,32141606700031,O,1991-01-01,NN,,,2018-05-26T03:38:27,true,4,,20,,,LE BOURG,16240,RAIX,,,16273,,,,,,,,,,,,,,,,,,,2016-12-31,F,,,,,01.11Z,NAFRev2,N,0.110677,46.001331,0.31,street,Rue du Bois de Breuillac 16240 Raix,16273_0008,G,RUE DU BOIS DE BREUILLAC,
323193888,00027,32319388800027,O,,NN,,,,true,1,,,,,,16240,RAIX,,,16273,,,,,,,,,,,,,,,,,,,,F,,,,,67.01,NAP,N,,,0,,,,,,
325392264,00058,32539226400058,O,1999-07-16,NN,,,2014-07-08T00:29:57,true,6,,,,RTE,DE SOUVIGNE,16240,RAIX,,,16273,,,,,,,,,,,,,,,,,,,2008-07-31,F,,,,,43.22A,NAFRev2,N,0.112009,45.999929,0.83,street,Route de Souvigné 16240 Raix,16273_0050,G,ROUTE DE SOUVIGNE,
329431027,00047,32943102700047,O,2010-06-22,,,,2014-11-20T07:56:18,false,2,,,,,LA GROGE,16240,RAIX,,,16273,,,,,,,,,,,,,,,,,,,2014-10-16,F,,,,,70.22Z,NAFRev2,N,0.113653,46.004145,0.92,street,Rue de la Groge 16240 Raix,16273_0035,G,RUE DE LA GROGE,
341119063,00012,34111906300012,O,1987-01-01,NN,,,2010-03-03T08:59:21,true,4,,,,,LE BOURG,16240,RAIX,,,16273,,,,,,,,,,,,,,,,,,,2008-09-29,F,,,,,01.11Z,NAFRev2,N,0.110677,46.001331,0.31,street,Rue du Bois de Breuillac 16240 Raix,16273_0008,G,RUE DU BOIS DE BREUILLAC,
342149457,00018,34214945700018,O,1987-07-20,NN,,,2008-01-04T22:00:17,true,3,,,,,LE BOURG,16240,RAIX,,,16273,,,,,,,,,,,,,,,,,,,2008-01-01,A,,,,,68.20A,NAFRev2,N,0.110677,46.001331,0.31,street,Rue du Bois de Breuillac 16240 Raix,16273_0008,G,RUE DU BOIS DE BREUILLAC,
351229471,00013,35122947100013,O,1983-10-01,NN,,,2010-04-18T05:22:52,false,3,,,,,FONTIAUD,16240,RAIX,,,16273,,,,,,,,,,,,,,,,,,,2006-07-01,F,,,,,01.2A,NAFRev1,N,0.096622,45.987412,0.93,street,Fontiaud 16240 Raix,16273_3hncng,G,FONTIAUD,
378720155,00019,37872015500019,O,1990-07-01,NN,,,2016-08-29T08:55:50,true,4,,,,,,16240,RAIX,,,16273,,,,,,,,,,,,,,,,,,,2016-07-12,F,,,,,01.61Z,NAFRev2,N,,,0,,,,,,
388105744,00014,38810574400014,O,1991-12-31,NN,,,2007-01-18T09:31:05,true,2,,,,,,16240,RAIX,,,16273,,,,,,,,,,,,,,,,,,,1994-05-05,F,,,,,01.1A,NAF1993,N,,,0,,,,,,
388106635,00013,38810663500013,O,,NN,,,,true,1,,,,,,16240,RAIX,,,16273,,,,,,,,,,,,,,,,,,,1996-11-15,F,,,,,01.1A,NAF1993,N,,,0,,,,,,
391371952,00022,39137195200022,O,2021-03-11,,,,2021-06-19T11:45:49,true,1,,9,,RUE,DE LA ROUSSELLERIE,16240,RAIX,,,16273,,,,,,,,,,,,,,,,,,,2021-03-11,A,,,,,68.20B,NAFRev2,N,0.11108,46.003404,0.94,housenumber,9 Rue de la Roussellerie 16240 Raix,16273_0045_00009,G,9 RUE DE LA ROUSSELLERIE,
399916220,00029,39991622000029,O,1999-04-01,NN,,,,false,4,,,,,,16240,RAIX,,,16273,,,,,,,,,,,,,,,,,,,2003-05-12,F,,,,,01.1A,NAFRev1,N,,,0,,,,,,
413265455,00019,41326545500019,O,1982-12-31,NN,,,2008-01-04T22:30:59,true,4,,,,,,16240,RAIX,,,16273,,,,,,,,,,,,,,,,,,,2008-01-01,A,,,,,01.50Z,NAFRev2,N,,,0,,,,,,
414515080,00011,41451508000011,O,1997-11-17,NN,,1812ZA,2015-07-03T04:33:50,true,5,,2,,RUE,DE L'AVENIR,16240,RAIX,,,16273,,,,,,,,,,,,,,,,,,,2012-07-30,F,,,,,18.12Z,NAFRev2,O,0.11183,46.000641,0.94,housenumber,2 Rue de l’Avenir 16240 Raix,16273_0006_00002,G,2 RUE DE L AVENIR,
421130451,00048,42113045100048,O,2009-12-01,,,,2021-10-18T09:58:03,false,2,,,,,LE BOURG,16240,RAIX,,,16273,,,,,,,,,,,,,,,,,,,2013-06-30,F,,,,,85.59B,NAFRev2,N,0.110677,46.001331,0.31,street,Rue du Bois de Breuillac 16240 Raix,16273_0008,G,RUE DU BOIS DE BREUILLAC,
421130451,00055,42113045100055,O,2021-10-16,,,,2021-10-18T09:58:03,true,1,,11,,RUE,DE LA ROUSSELLERIE,16240,RAIX,,,16273,,,,,,,,,,,,,,,,,,,2021-10-16,A,,,,ARTISTIQUE,90.03A,NAFRev2,N,0.111247,46.00363,0.94,housenumber,11 Rue de la Roussellerie 16240 Raix,16273_0045_00011,G,11 RUE DE LA ROUSSELLERIE,
429752082,00017,42975208200017,O,1997-01-01,NN,,,2006-10-31T00:50:47,true,3,,,,,LE BOURG,16240,RAIX,,,16273,,,,,,,,,,,,,,,,,,,2004-08-04,F,,,,,70.2B,NAFRev1,N,0.110677,46.001331,0.31,street,Rue du Bois de Breuillac 16240 Raix,16273_0008,G,RUE DU BOIS DE BREUILLAC,
430986828,00019,43098682800019,O,1969-01-01,NN,,,2008-01-05T01:57:57,true,3,,,,,LA GROGE,16240,RAIX,,,16273,,,,,,,,,,,,,,,,,,,2008-01-01,A,,,,,01.50Z,NAFRev2,N,0.113653,46.004145,0.92,street,Rue de la Groge 16240 Raix,16273_0035,G,RUE DE LA GROGE,
430986984,00010,43098698400010,O,1985-01-01,NN,,,2008-01-05T01:57:57,true,3,,,,,LE BOURG,16240,RAIX,,,16273,,,,,,,,,,,,,,,,,,,2008-01-01,A,,,,,01.11Z,NAFRev2,N,0.110677,46.001331,0.31,street,Rue du Bois de Breuillac 16240 Raix,16273_0008,G,RUE DU BOIS DE BREUILLAC,
478776289,00017,47877628900017,O,2004-09-29,,,,2008-01-05T03:49:12,false,3,,,,,LE BOURG,16240,RAIX,,,16273,,,,,,,,,,,,,,,,,,,2008-01-01,A,,,,,01.45Z,NAFRev2,N,0.110677,46.001331,0.31,street,Rue du Bois de Breuillac 16240 Raix,16273_0008,G,RUE DU BOIS DE BREUILLAC,
478776289,00025,47877628900025,O,2006-10-23,,,,2021-02-23T13:40:53,true,2,LE BOURG,,,,,16240,RAIX,,,16273,,,,,,,,,,,,,,,,,,,2008-01-01,A,,,,,01.61Z,NAFRev2,N,0.110677,46.001331,0.31,street,Rue du Bois de Breuillac 16240 Raix,16273_0008,D,RUE DU BOIS DE BREUILLAC,
479073777,00019,47907377700019,O,2004-08-04,NN,,,2008-01-05T03:55:48,true,3,,,,CHE,DE TUSSON,16240,RAIX,,,16273,,,,,,,,,,,,,,,,,,,2008-01-01,A,,,,,68.20B,NAFRev2,N,0.110912,45.998116,0.8,street,Chemin de Tusson 16240 Raix,16273_0060,G,CHEMIN DE TUSSON,
490206778,00014,49020677800014,O,2006-06-01,01,2019,4391BZ,2021-10-27T08:27:51,true,3,,,,RTE,DE SOUVIGNE,16240,RAIX,,,16273,,,,,,,,,,,,,,,,,,,2009-01-25,A,,,,,43.22A,NAFRev2,O,0.112009,45.999929,0.83,street,Route de Souvigné 16240 Raix,16273_0050,G,ROUTE DE SOUVIGNE,
494942543,00013,49494254300013,O,2007-04-02,NN,,,2014-07-10T00:47:19,false,5,,,,RTE,DE VILLEFAGNAN,16240,RAIX,,,16273,,,,,,,,,,,,,,,,,,,2010-09-23,F,,,,,43.31Z,NAFRev2,N,0.110651,46.001773,0.84,street,Route de Villefagnan 16240 Raix,16273_0070,G,ROUTE DE VILLEFAGNAN,
511479693,00018,51147969300018,O,2009-04-20,,,,2012-11-10T00:41:41,true,2,,,,RTE,DE VILLEFAGNAN,16240,RAIX,,,16273,,,,,,,,,,,,,,,,,,,2009-11-06,F,,,,,43.99C,NAFRev2,N,0.110651,46.001773,0.84,street,Route de Villefagnan 16240 Raix,16273_0070,G,ROUTE DE VILLEFAGNAN,
512953597,00014,51295359700014,O,2009-07-01,,,,2012-11-10T00:57:34,true,1,,,,RTE,DE VILLEFAGNAN,16240,RAIX,,,16273,,,,,,,,,,,,,,,,,,,2009-07-01,A,,,,,43.31Z,NAFRev2,N,0.110651,46.001773,0.84,street,Route de Villefagnan 16240 Raix,16273_0070,G,ROUTE DE VILLEFAGNAN,
513920637,00016,51392063700016,O,2009-06-02,03,2019,,2021-10-27T08:21:26,true,3,,1,,RTE,DE SOUVIGNE,16240,RAIX,,,16273,,,,,,,,,,,,,,,,,,,2012-09-27,A,,,,FLOVIANE INVESTISSEMENT,41.10A,NAFRev2,O,0.113457,45.999715,0.84,housenumber,1 Route de Souvigné 16240 Raix,16273_0050_00001,G,1 ROUTE DE SOUVIGNE,
530453935,00013,53045393500013,O,2011-02-01,NN,,,2018-10-29T19:36:17,true,3,,,,CHE,DE TUSSON,16240,RAIX,,,16273,,,,,,,,,,,,,,,,,,,2016-12-31,F,,,,,01.61Z,NAFRev2,O,0.110912,45.998116,0.8,street,Chemin de Tusson 16240 Raix,16273_0060,G,CHEMIN DE TUSSON,
533485546,00014,53348554600014,O,2011-07-05,,,,2017-02-15T08:40:04,true,1,,,,RTE,DE SOUVIGNE,16240,RAIX,,,16273,,,,,,,,,,,,,,,,,,,2011-07-05,A,,,,,68.20B,NAFRev2,N,0.112009,45.999929,0.83,street,Route de Souvigné 16240 Raix,16273_0050,G,ROUTE DE SOUVIGNE,
750224719,00013,75022471900013,O,2012-03-01,,,,2012-12-18T11:30:22,false,2,,,,,LE BOURG,16240,RAIX,,,16273,,,,,,,,,,,,,,,,,,,2012-11-22,F,,,,HF SERVICES,43.39Z,NAFRev2,N,0.110677,46.001331,0.31,street,Rue du Bois de Breuillac 16240 Raix,16273_0008,G,RUE DU BOIS DE BREUILLAC,
750224719,00047,75022471900047,O,2017-12-04,,,4339ZZ,2018-10-30T04:25:23,true,2,CHEZ MONSIEUR HUGON LOUIS,1,,CHE,DU MOULIN,16240,RAIX,,,16273,,,,,,,,,,,,,,,,,,,2018-09-30,F,,,,HF SERVICES,43.99C,NAFRev2,N,0.112924,45.999389,0.82,housenumber,1 Chemin du Moulin 16240 Raix,16273_0037_00001,G,1 CHEMIN DU MOULIN,
752289496,00016,75228949600016,O,2012-06-20,,,,2019-02-12T19:34:22,true,1,,,,,LA GROGE,16240,RAIX,,,16273,,,,,,,,,,,,,,,,,,,2012-06-20,A,,,,,35.11Z,NAFRev2,N,0.113653,46.004145,0.92,street,Rue de la Groge 16240 Raix,16273_0035,G,RUE DE LA GROGE,
752289496,00024,75228949600024,O,2014-02-24,,,,2014-02-24T08:03:49,false,1,LE MOULIN DE LA MOTTE,,,,,16240,RAIX,,,16273,,,,,,,,,,,,,,,,,,,2014-02-24,A,,,,,35.11Z,NAFRev2,N,0.112841,45.999409,0.37,street,Chemin du Moulin 16240 Raix,16273_0037,D,CHEMIN DU MOULIN,
781233069,00017,78123306900017,O,,,,,,true,1,,,,,,16240,RAIX,,,16273,,,,,,,,,,,,,,,,,,,1987-06-30,F,,,,,55.60,NAP,N,,,0,,,,,,
788778934,00034,78877893400034,O,2020-09-09,,,,2020-10-26T08:19:10,false,1,,,,,CHAMPS DE RAIX,16240,RAIX,,,16273,,,,,,,,,,,,,,,,,,,2020-09-09,A,,,,,35.11Z,NAFRev2,N,0.110912,45.998116,0.5,street,Chemin de Tusson 16240 Raix,16273_0060,G,CHEMIN DE TUSSON,
791101397,00010,79110139700010,O,2013-02-01,,,,2020-10-15T03:49:26,true,2,,2,,RUE,DE L'EGLISE,16240,RAIX,,,16273,,,,,,,,,,,,,,,,,,,2020-02-24,F,,,,,68.20B,NAFRev2,N,0.111889,46.000391,0.94,housenumber,2 Rue de l’Eglise 16240 Raix,16273_0020_00002,G,2 RUE DE L EGLISE,
794858118,00019,79485811800019,O,2013-08-01,NN,,,2019-02-07T03:35:52,true,2,,,,,CHEMIN DE TUSSON,16240,RAIX,,,16273,,,,,,,,,,,,,,,,,,,2018-07-19,F,,,,,01.11Z,NAFRev2,O,0.110912,45.998116,0.93,street,Chemin de Tusson 16240 Raix,16273_0060,G,CHEMIN DE TUSSON,
812033843,00036,81203384300036,O,2019-06-01,,,8121ZZ,2021-02-23T17:29:35,true,1,,4,,RTE,DE LA FAYE,16240,RAIX,,,16273,,,,,,,,,,,,,,,,,,,2019-06-01,A,,,,,81.22Z,NAFRev2,N,0.113787,46.000683,0.83,housenumber,4 Route de la Faye 16240 Raix,16273_0030_00004,G,4 ROUTE DE LA FAYE,
812934982,00883,81293498200883,O,2021-09-02,,,,2021-09-06T10:11:51,false,1,,,,LD,MOULIN DE LA MOTTE PARCELLE ZN15,16240,RAIX,,,16273,,,,,,,,,,,,,,,,,,,2021-09-02,A,,,,,35.11Z,NAFRev2,N,,,0,,,,,,
813639408,00018,81363940800018,O,2015-09-17,,,,2021-09-16T03:48:18,false,2,,23,,,GRAND RUE,16240,RAIX,,,16273,,,,,,,,,,,,,,,,,,,2016-07-01,F,,,,,47.99A,NAFRev2,N,0.111315,46.001318,0.94,housenumber,23 Grand’Rue 16240 Raix,16273_0033_00023,G,23 GRAND RUE,
822201273,00015,82220127300015,O,2016-07-14,,,,2017-03-23T15:10:22,false,3,,,,,LE BOURG,16240,RAIX,,,16273,,,,,,,,,,,,,,,,,,,2017-02-01,F,,,,,68.20B,NAFRev2,N,0.110677,46.001331,0.31,street,Rue du Bois de Breuillac 16240 Raix,16273_0008,G,RUE DU BOIS DE BREUILLAC,
827831520,00016,82783152000016,O,2016-07-12,,,,2017-02-21T09:25:44,true,1,,3,,RUE,DE L'AVENIR,16240,RAIX,,,16273,,,,,,,,,,,,,,,,,,,2016-07-12,A,,,,,01.11Z,NAFRev2,N,0.111241,46.000467,0.94,housenumber,3 Rue de l’Avenir 16240 Raix,16273_0006_00003,G,3 RUE DE L AVENIR,
827838376,00289,82783837600289,O,2020-05-05,,,,2020-05-19T19:34:45,false,1,,,,CHE,DE TUSSON,16240,RAIX,,,16273,,,,,,,,,,,,,,,,,,,2020-05-05,A,,,,,35.11Z,NAFRev2,N,0.110912,45.998116,0.8,street,Chemin de Tusson 16240 Raix,16273_0060,G,CHEMIN DE TUSSON,
831742366,00014,83174236600014,O,2016-12-31,,,,2017-09-28T08:46:18,true,1,,2,,LD,FONTIAUD,16240,RAIX,,,16273,,,,,,,,,,,,,,,,,,,2016-12-31,A,,,,,35.11Z,NAFRev2,N,0.096671,45.987308,0.93,housenumber,2 Fontiaud 16240 Raix,16273_3hncng_00002,G,2 FONTIAUD,
843500208,00015,84350020800015,O,2018-10-29,,,,2018-10-31T08:46:35,true,1,,1,,RTE,DE SOUVIGNE,16240,RAIX,,,16273,,,,,,,,,,,,,,,,,,,2018-10-29,A,,,,,68.20B,NAFRev2,N,0.113457,45.999715,0.84,housenumber,1 Route de Souvigné 16240 Raix,16273_0050_00001,G,1 ROUTE DE SOUVIGNE,
848511796,00015,84851179600015,O,2019-01-18,,,8211ZP,2019-02-23T03:38:49,true,1,,2,,RUE,DE LA ROUSSELLERIE,16240,RAIX,,,16273,,,,,,,,,,,,,,,,,,,2019-01-18,A,,,,LGP PRO,82.11Z,NAFRev2,N,0.111435,46.002069,0.94,housenumber,2 Rue de la Roussellerie 16240 Raix,16273_0045_00002,G,2 RUE DE LA ROUSSELLERIE,
853453660,00013,85345366000013,O,2019-08-01,,,4322AZ,2019-08-30T03:43:21,true,1,,3,,RUE,DU REPOS,16240,RAIX,,,16273,,,,,,,,,,,,,,,,,,,2019-08-01,A,,,,,43.22A,NAFRev2,N,0.114122,46.00072,0.93,housenumber,3 Rue du Repos 16240 Raix,16273_0040_00003,G,3 RUE DU REPOS,
904223492,00011,90422349200011,O,2021-10-15,,,1813ZC,2021-10-18T08:33:51,true,1,,3,,RUE,DE L'AVENIR,16240,RAIX,,,16273,,,,,,,,,,,,,,,,,,,2021-10-15,A,,,,ISADESIGNCREATIONS,18.13Z,NAFRev2,N,0.111241,46.000467,0.94,housenumber,3 Rue de l’Avenir 16240 Raix,16273_0006_00003,G,3 RUE DE L AVENIR,
