siren,nic,siret,statutDiffusionEtablissement,dateCreationEtablissement,trancheEffectifsEtablissement,anneeEffectifsEtablissement,activitePrincipaleRegistreMetiersEtablissement,dateDernierTraitementEtablissement,etablissementSiege,nombrePeriodesEtablissement,complementAdresseEtablissement,numeroVoieEtablissement,indiceRepetitionEtablissement,typeVoieEtablissement,libelleVoieEtablissement,codePostalEtablissement,libelleCommuneEtablissement,libelleCommuneEtrangerEtablissement,distributionSpecialeEtablissement,codeCommuneEtablissement,codeCedexEtablissement,libelleCedexEtablissement,codePaysEtrangerEtablissement,libellePaysEtrangerEtablissement,complementAdresse2Etablissement,numeroVoie2Etablissement,indiceRepetition2Etablissement,typeVoie2Etablissement,libelleVoie2Etablissement,codePostal2Etablissement,libelleCommune2Etablissement,libelleCommuneEtranger2Etablissement,distributionSpeciale2Etablissement,codeCommune2Etablissement,codeCedex2Etablissement,libelleCedex2Etablissement,codePaysEtranger2Etablissement,libellePaysEtranger2Etablissement,dateDebut,etatAdministratifEtablissement,enseigne1Etablissement,enseigne2Etablissement,enseigne3Etablissement,denominationUsuelleEtablissement,activitePrincipaleEtablissement,nomenclatureActivitePrincipaleEtablissement,caractereEmployeurEtablissement,longitude,latitude,geo_score,geo_type,geo_adresse,geo_id,geo_ligne,geo_l4,geo_l5
086280278,00044,08628027800044,O,2017-12-12,,,4399CZ,2020-12-08T08:49:36,false,2,ZI DE L'AIGRON,12,,RUE,DE L'AIGRON,28220,CLOYES-LES-TROIS-RIVIERES,,,28103,,,,,,,,,,,,,,,,,,,2020-12-01,A,,,,CESARO RENOVATION,43.99C,NAFRev2,O,1.257096,47.987357,0.95,housenumber,12 Rue de l’Aigron 28220 Cloyes-les-Trois-Rivières,28103_0012_00012,G,12 RUE DE L AIGRON,
130010168,00263,13001016800263,O,2010-01-25,NN,,,2019-11-14T14:00:28,false,2,CENTRE DES FINANCES PUBLIQUES,2,,PL,GAMBETTA,28220,CLOYES-LES-TROIS-RIVIERES,,,28103,,,,,,,,,,,,,,,,,,,2017-02-02,F,TRESORERIE DE CLOYES-COURTALAIN,,,,84.11Z,NAFRev2,N,1.233658,47.997146,0.81,housenumber,2 Place Gambetta (Cloyes-sur-le-Loir) 28220 Cloyes-les-Trois-Rivières,28103_0100_00002,G,2 PLACE GAMBETTA,CLOYES SUR LE LOIR
172802118,00171,17280211800171,O,1983-04-01,,,,2019-11-14T14:00:28,false,4,,2,,PL,GAMBETTA,28220,CLOYES-LES-TROIS-RIVIERES,,,28103,,,,,,,,,,,,,,,,,,,2010-01-25,F,TRESORERIE CLOYES-COURTALAIN,,,,84.11Z,NAFRev2,N,1.233658,47.997146,0.81,housenumber,2 Place Gambetta (Cloyes-sur-le-Loir) 28220 Cloyes-les-Trois-Rivières,28103_0100_00002,G,2 PLACE GAMBETTA,CLOYES SUR LE LOIR
192808673,00011,19280867300011,O,1983-03-01,NN,,,2019-11-14T14:00:28,false,5,,30,,RUE,JEAN CHAUVEAU,28220,CLOYES-LES-TROIS-RIVIERES,,,28103,,,,,,,,,,,,,,,,,,,2011-09-01,F,,,,,85.31Z,NAFRev2,O,1.23531,47.994813,0.94,housenumber,30 Rue Jean Chauveau (Cloyes-sur-le-Loir) 28220 Cloyes-les-Trois-Rivières,28103_0133_00030,G,30 RUE JEAN CHAUVEAU,CLOYES SUR LE LOIR
192808673,00029,19280867300029,O,2011-09-01,12,2019,,2021-10-27T08:04:48,true,1,,14,,RTE,DE MONTIGNY,28220,CLOYES-LES-TROIS-RIVIERES,,,28103,,,,,,,,,,,,,,,,,,,2011-09-01,A,,,,,85.31Z,NAFRev2,O,1.237649,48.004207,0.86,housenumber,14 Route de Montigny 28220 Cloyes-les-Trois-Rivières,28103_0160_00014,G,14 ROUTE DE MONTIGNY,
200018075,00016,20001807500016,O,2009-01-01,NN,,,2019-11-14T14:00:28,false,3,,26,,RUE,DU COLONEL BOUSSA,28220,CLOYES-LES-TROIS-RIVIERES,,,28103,,,,,,,,,,,,,,,,,,,2012-01-19,F,,,,,87.10A,NAFRev2,O,1.226454,47.990355,0.96,housenumber,26 Rue du Colonel Boussa 28220 Cloyes-les-Trois-Rivières,28103_0074_00026,G,26 RUE DU COLONEL BOUSSA,
200018075,00024,20001807500024,O,2009-01-01,,,,2019-11-14T14:00:28,false,2,,31,,RUE,PORTE DUNOISE,28220,CLOYES-LES-TROIS-RIVIERES,,,28103,,,,,,,,,,,,,,,,,,,2012-01-17,F,EHPAD LA FERTE VILLENEUIL,,,,87.10A,NAFRev2,N,1.349569,47.980835,0.96,housenumber,31 Rue Porte Dunoise 28220 Cloyes-les-Trois-Rivières,28150_0060_00031,G,31 RUE PORTE DUNOISE,
200018075,00040,20001807500040,O,2012-01-19,21,2019,,2021-10-27T08:05:27,true,1,,31,,RUE,DE COURTALIN,28220,CLOYES-LES-TROIS-RIVIERES,,,28103,,,,,,,,,,,,,,,,,,,2012-01-19,A,,,,,87.10A,NAFRev2,O,1.235441,47.999162,0.55,housenumber,31 Rue de Châteaudun 28220 Cloyes-les-Trois-Rivières,28103_0058_00031,G,31 RUE DE CHATEAUDUN,
200064764,00018,20006476400018,O,2017-01-01,21,2019,,2021-10-27T08:05:57,true,1,,1,,PL,GAMBETTA,28220,CLOYES-LES-TROIS-RIVIERES,,,28103,,,,,,,,,,,,,,,,,,,2017-01-01,A,MAIRIE,,,,84.11Z,NAFRev2,O,1.233263,47.997201,0.81,housenumber,1 Place Gambetta (Cloyes-sur-le-Loir) 28220 Cloyes-les-Trois-Rivières,28103_0100_00001,G,1 PLACE GAMBETTA,CLOYES SUR LE LOIR
200064764,00026,20006476400026,O,2017-01-01,,,,2019-11-14T14:00:28,false,1,,22,,PL,DE L'EGLISE,28220,CLOYES-LES-TROIS-RIVIERES,,,28103,,,,,,,,,,,,,,,,,,,2017-01-01,A,COMMUNE DELEGUEE DE  AUTHEUIL,,,,84.11Z,NAFRev2,N,1.290351,48.007194,0.68,street,Place de l’Eglise 28220 Cloyes-les-Trois-Rivières,28017_0020,G,PLACE DE L EGLISE,
200064764,00034,20006476400034,O,2017-01-01,,,,2019-11-14T14:00:28,false,1,,7,,RUE,DE LA MAIRIE,28220,CLOYES-LES-TROIS-RIVIERES,,,28103,,,,,,,,,,,,,,,,,,,2017-01-01,A,COMMUNE DELEGUEE DE CHARRAY,,,,84.11Z,NAFRev2,N,1.325265,47.972202,0.94,housenumber,7 Rue de la Mairie (Charray) 28220 Cloyes-les-Trois-Rivières,28083_0021_00007,G,7 RUE DE LA MAIRIE,CHARRAY
200064764,00042,20006476400042,O,2017-01-01,,,,2019-11-14T14:00:28,false,1,,1,,PL,GAMBETTA,28220,CLOYES-LES-TROIS-RIVIERES,,,28103,,,,,,,,,,,,,,,,,,,2017-01-01,A,COMMUNE DELEGUEE DE CLOYES-SUR-LE-LOIR,,,,84.11Z,NAFRev2,N,1.233263,47.997201,0.81,housenumber,1 Place Gambetta (Cloyes-sur-le-Loir) 28220 Cloyes-les-Trois-Rivières,28103_0100_00001,G,1 PLACE GAMBETTA,CLOYES SUR LE LOIR
200064764,00059,20006476400059,O,2017-01-01,,,,2019-11-14T14:00:28,false,1,,31,,RUE,DE LA VALLEE,28220,CLOYES-LES-TROIS-RIVIERES,,,28103,,,,,,,,,,,,,,,,,,,2017-01-01,A,COMMUNE DELEGUEE DE DOUY,,,,84.11Z,NAFRev2,N,1.271922,48.035543,0.96,housenumber,31 Rue de la Vallée 28220 Cloyes-les-Trois-Rivières,28133_0056_00031,G,31 RUE DE LA VALLEE,
200064764,00067,20006476400067,O,2017-01-01,,,,2019-11-14T14:00:28,false,1,,7,,RUE,NATIONALE,28220,CLOYES-LES-TROIS-RIVIERES,,,28103,,,,,,,,,,,,,,,,,,,2017-01-01,A,COMMUNE DELEGUEE DE LA FERTE-VILLENEUIL,,,,84.11Z,NAFRev2,N,1.326644,47.972627,0.94,housenumber,7 Rue Nationale (Charray) 28220 Cloyes-les-Trois-Rivières,28083_0037_00007,G,7 RUE NATIONALE,CHARRAY
200064764,00075,20006476400075,O,2017-01-01,,,,2019-11-14T14:00:28,false,1,,2,,RUE,DE LA MAIRIE,28220,CLOYES-LES-TROIS-RIVIERES,,,28103,,,,,,,,,,,,,,,,,,,2017-01-01,A,COMMUNE DELEGUEE DE LE MEE,,,,84.11Z,NAFRev2,N,1.326363,47.972538,0.94,housenumber,2 Rue de la Mairie (Charray) 28220 Cloyes-les-Trois-Rivières,28083_0021_00002,G,2 RUE DE LA MAIRIE,CHARRAY
200064764,00083,20006476400083,O,2017-01-01,,,,2019-11-14T14:00:28,false,1,,14,,RUE,GRANDE,28220,CLOYES-LES-TROIS-RIVIERES,,,28103,,,,,,,,,,,,,,,,,,,2017-01-01,A,COMMUNE DELEGUEE DE MONTIGNY-LE-GANNELON,,,,84.11Z,NAFRev2,N,1.280536,47.985702,0.94,housenumber,14 Rue Grande (Romilly-sur-Aigre) 28220 Cloyes-les-Trois-Rivières,28318_0049_00014,G,14 RUE GRANDE,ROMILLY SUR AIGRE
200064764,00091,20006476400091,O,2017-01-01,,,,2019-11-14T14:00:28,false,1,,83,,,GRANDE RUE,28220,CLOYES-LES-TROIS-RIVIERES,,,28103,,,,,,,,,,,,,,,,,,,2017-01-01,A,COMMUNE DELEGUEE DE ROMILLY-SUR-AIGRE,,,,84.11Z,NAFRev2,N,1.283301,47.980427,0.87,housenumber,83 Rue Grande (Romilly-sur-Aigre) 28220 Cloyes-les-Trois-Rivières,28318_0049_00083,G,83 RUE GRANDE,ROMILLY SUR AIGRE
200064764,00109,20006476400109,O,2017-01-01,,,,2019-11-14T14:00:28,false,1,,24,,RUE,DU 11 NOVEMBRE,28220,CLOYES-LES-TROIS-RIVIERES,,,28103,,,,,,,,,,,,,,,,,,,2017-01-01,A,COMMUNE DELEGUEE DE SAINT-HILAIRE-SUR-YERRE,,,,84.11Z,NAFRev2,N,1.254707,48.024686,0.94,housenumber,24 Rue du 11 Novembre (Saint-Hilaire-sur-Yerre) 28220 Cloyes-les-Trois-Rivières,28340_0062_00024,G,24 RUE DU 11 NOVEMBRE,SAINT HILAIRE SUR YERRE
200064764,00117,20006476400117,O,2017-01-01,,,,2019-11-14T14:00:28,false,1,,6,,RUE,JACQUES PREVERT,28220,CLOYES-LES-TROIS-RIVIERES,,,28103,,,,,,,,,,,,,,,,,,,2017-01-01,A,ECOLE MATERNELLE JACQUES PREVERT,,,,85.10Z,NAFRev2,N,1.23696,47.998814,0.95,housenumber,6 Rue Jacques Prévert 28220 Cloyes-les-Trois-Rivières,28103_0193_00006,G,6 RUE JACQUES PREVERT,
200064764,00125,20006476400125,O,2017-01-01,,,,2019-11-14T14:00:28,false,1,,27,,RUE,JEAN CHAUVEAU,28220,CLOYES-LES-TROIS-RIVIERES,,,28103,,,,,,,,,,,,,,,,,,,2017-01-01,A,ECOLE ELEMENTAIRE PUBLIQUE STEPHANE PITARD,,,,85.20Z,NAFRev2,N,1.236425,47.99491,0.94,housenumber,27 Rue Jean Chauveau (Cloyes-sur-le-Loir) 28220 Cloyes-les-Trois-Rivières,28103_0133_00027,G,27 RUE JEAN CHAUVEAU,CLOYES SUR LE LOIR
200064764,00133,20006476400133,O,2017-01-01,,,,2019-11-14T14:00:28,false,1,,31,,RUE,DE LA VALLEE,28220,CLOYES-LES-TROIS-RIVIERES,,,28103,,,,,,,,,,,,,,,,,,,2017-01-01,A,ECOLE ELEMENTAIRE PUBLIQUE,,,,85.20Z,NAFRev2,N,1.271922,48.035543,0.96,housenumber,31 Rue de la Vallée 28220 Cloyes-les-Trois-Rivières,28133_0056_00031,G,31 RUE DE LA VALLEE,
200064764,00141,20006476400141,O,2017-01-01,,,,2019-11-14T14:00:28,false,1,,9,,RUE,NATIONALE,28220,CLOYES-LES-TROIS-RIVIERES,,,28103,,,,,,,,,,,,,,,,,,,2017-01-01,A,ECOLE ELEMENTAIRE PUBLIQUE,,,,85.20Z,NAFRev2,N,1.234262,47.996588,0.94,housenumber,9 Rue Nationale (Cloyes-sur-le-Loir) 28220 Cloyes-les-Trois-Rivières,28103_0165_00009,G,9 RUE NATIONALE,CLOYES SUR LE LOIR
200064764,00158,20006476400158,O,2017-01-01,,,,2019-11-14T14:00:28,false,1,,2,,RUE,DE LA MAIRIE,28220,CLOYES-LES-TROIS-RIVIERES,,,28103,,,,,,,,,,,,,,,,,,,2017-01-01,A,ECOLE MATERNELLE PUBLIQUE,,,,85.10Z,NAFRev2,N,1.326363,47.972538,0.94,housenumber,2 Rue de la Mairie (Charray) 28220 Cloyes-les-Trois-Rivières,28083_0021_00002,G,2 RUE DE LA MAIRIE,CHARRAY
200064764,00166,20006476400166,O,2017-01-01,,,,2019-11-14T14:00:28,false,1,,14,,RUE,GRANDE,28220,CLOYES-LES-TROIS-RIVIERES,,,28103,,,,,,,,,,,,,,,,,,,2017-01-01,A,ECOLE ELEMENTAIRE PUBLIQUE,,,,85.20Z,NAFRev2,N,1.280536,47.985702,0.94,housenumber,14 Rue Grande (Romilly-sur-Aigre) 28220 Cloyes-les-Trois-Rivières,28318_0049_00014,G,14 RUE GRANDE,ROMILLY SUR AIGRE
200064764,00174,20006476400174,O,2017-01-01,,,,2019-11-14T14:00:28,false,1,,81,,,GRANDE RUE,28220,CLOYES-LES-TROIS-RIVIERES,,,28103,,,,,,,,,,,,,,,,,,,2017-01-01,A,ECOLE PRIMAIRE PUBLIQUE ROGER BELLON,,,,85.20Z,NAFRev2,N,1.283158,47.980513,0.87,housenumber,81 Rue Grande (Romilly-sur-Aigre) 28220 Cloyes-les-Trois-Rivières,28318_0049_00081,G,81 RUE GRANDE,ROMILLY SUR AIGRE
200064764,00182,20006476400182,O,2017-01-01,,,,2019-11-14T14:00:28,false,1,,24,,RUE,DU 11 NOVEMBRE,28220,CLOYES-LES-TROIS-RIVIERES,,,28103,,,,,,,,,,,,,,,,,,,2017-01-01,A,ECOLE PRIMAIRE PUBLIQUE,,,,85.20Z,NAFRev2,N,1.254707,48.024686,0.94,housenumber,24 Rue du 11 Novembre (Saint-Hilaire-sur-Yerre) 28220 Cloyes-les-Trois-Rivières,28340_0062_00024,G,24 RUE DU 11 NOVEMBRE,SAINT HILAIRE SUR YERRE
200064764,00240,20006476400240,O,2017-01-01,,,,2019-11-14T14:00:28,false,2,,30,,RUE,CHAUVEAU,28220,CLOYES-LES-TROIS-RIVIERES,,,28103,,,,,,,,,,,,,,,,,,,2017-12-31,F,FOYER RESIDENCE MAURICE DOUSSET,,,,87.30A,NAFRev2,N,1.23531,47.994813,0.88,housenumber,30 Rue Jean Chauveau (Cloyes-sur-le-Loir) 28220 Cloyes-les-Trois-Rivières,28103_0133_00030,G,30 RUE JEAN CHAUVEAU,CLOYES SUR LE LOIR
200064772,00011,20006477200011,O,2017-01-01,,,,2019-11-14T14:00:28,true,1,MAIRIE,1,,PL,GAMBETTA,28220,CLOYES-LES-TROIS-RIVIERES,,,28103,,,,,,,,,,,,,,,,,,,2017-01-01,A,,,,,88.99B,NAFRev2,N,1.233263,47.997201,0.81,housenumber,1 Place Gambetta (Cloyes-sur-le-Loir) 28220 Cloyes-les-Trois-Rivières,28103_0100_00001,G,1 PLACE GAMBETTA,CLOYES SUR LE LOIR
212800171,00010,21280017100010,O,1983-03-01,NN,,,2019-11-14T14:00:28,true,5,,22,,PL,DE L EGLISE,28220,CLOYES-LES-TROIS-RIVIERES,,,28103,,,,,,,,,,,,,,,,,,,2017-01-01,F,MAIRIE,,,,84.11Z,NAFRev2,O,1.290351,48.007194,0.68,street,Place de l’Eglise 28220 Cloyes-les-Trois-Rivières,28017_0020,G,PLACE DE L EGLISE,
212800171,00028,21280017100028,O,1983-12-21,NN,,,2019-11-14T14:00:28,false,4,,36,,,GRANDE RUE,28220,CLOYES-LES-TROIS-RIVIERES,,,28103,,,,,,,,,,,,,,,,,,,2017-01-01,F,ECOLE PRIMAIRE PUBLIQUE,,,,85.20Z,NAFRev2,N,1.287332,47.995691,0.92,interpolation,36 Rue Grande (Romilly-sur-Aigre) 28220 Cloyes-les-Trois-Rivières,,G,34 RUE GRANDE,ROMILLY SUR AIGRE
212800171,00036,21280017100036,O,1997-02-01,NN,,,2019-11-14T14:00:28,false,4,MAIRIE,22,,PL,DE L EGLISE,28220,CLOYES-LES-TROIS-RIVIERES,,,28103,,,,,,,,,,,,,,,,,,,2017-01-01,F,SERVICE EAU,,,,36.00Z,NAFRev2,N,1.290351,48.007194,0.68,street,Place de l’Eglise 28220 Cloyes-les-Trois-Rivières,28017_0020,G,PLACE DE L EGLISE,
212800171,00044,21280017100044,O,1997-02-01,NN,,,2019-11-14T14:00:28,false,4,MAIRIE,22,,PL,DE L EGLISE,28220,CLOYES-LES-TROIS-RIVIERES,,,28103,,,,,,,,,,,,,,,,,,,2017-01-01,F,SERVICE TRANSPORT,,,,49.39A,NAFRev2,N,1.290351,48.007194,0.68,street,Place de l’Eglise 28220 Cloyes-les-Trois-Rivières,28017_0020,G,PLACE DE L EGLISE,
212800833,00015,21280083300015,O,1983-03-01,NN,,,2019-11-14T14:00:28,true,4,,7,,RUE,DE LA MAIRIE,28220,CLOYES-LES-TROIS-RIVIERES,,,28103,,,,,,,,,,,,,,,,,,,2017-01-01,F,MAIRIE,,,,84.11Z,NAFRev2,O,1.325265,47.972202,0.94,housenumber,7 Rue de la Mairie (Charray) 28220 Cloyes-les-Trois-Rivières,28083_0021_00007,G,7 RUE DE LA MAIRIE,CHARRAY
212800833,00023,21280083300023,O,1997-02-01,NN,,,2019-11-14T14:00:28,false,4,MAIRIE,7,,RUE,DE LA MAIRIE,28220,CLOYES-LES-TROIS-RIVIERES,,,28103,,,,,,,,,,,,,,,,,,,2017-01-01,F,SERVICE TRANSPORT,,,,49.39A,NAFRev2,N,1.325265,47.972202,0.94,housenumber,7 Rue de la Mairie (Charray) 28220 Cloyes-les-Trois-Rivières,28083_0021_00007,G,7 RUE DE LA MAIRIE,CHARRAY
212801039,00018,21280103900018,O,1983-03-01,NN,,,2019-11-14T14:00:28,true,5,,1,,PL,GAMBETTA,28220,CLOYES-LES-TROIS-RIVIERES,,,28103,,,,,,,,,,,,,,,,,,,2017-01-01,F,MAIRIE,,,,84.11Z,NAFRev2,O,1.233263,47.997201,0.81,housenumber,1 Place Gambetta (Cloyes-sur-le-Loir) 28220 Cloyes-les-Trois-Rivières,28103_0100_00001,G,1 PLACE GAMBETTA,CLOYES SUR LE LOIR
212801039,00026,21280103900026,O,1983-12-21,NN,,,2019-11-14T14:00:28,false,4,,6,,RUE,JACQUES PREVERT,28220,CLOYES-LES-TROIS-RIVIERES,,,28103,,,,,,,,,,,,,,,,,,,2017-01-01,F,ECOLE MATERNELLE PUBLIQE JACQUES PREVERT,,,,85.10Z,NAFRev2,N,1.23696,47.998814,0.95,housenumber,6 Rue Jacques Prévert 28220 Cloyes-les-Trois-Rivières,28103_0193_00006,G,6 RUE JACQUES PREVERT,
212801039,00034,21280103900034,O,1983-12-21,NN,,,2019-11-14T14:00:28,false,5,,27,,RUE,JEAN CHAUVEAU,28220,CLOYES-LES-TROIS-RIVIERES,,,28103,,,,,,,,,,,,,,,,,,,2017-01-01,F,ECOLE ELEMENTAIRE STEPHANE PITARD,,,,85.20Z,NAFRev2,N,1.236425,47.99491,0.94,housenumber,27 Rue Jean Chauveau (Cloyes-sur-le-Loir) 28220 Cloyes-les-Trois-Rivières,28103_0133_00027,G,27 RUE JEAN CHAUVEAU,CLOYES SUR LE LOIR
212801039,00042,21280103900042,O,1997-02-01,NN,,,2019-11-14T14:00:28,false,4,MAIRIE,1,,PL,GAMBETTA,28220,CLOYES-LES-TROIS-RIVIERES,,,28103,,,,,,,,,,,,,,,,,,,2016-06-01,F,SERVICE TRANSPORT SCOLAIRE,,,,49.39A,NAFRev2,N,1.233263,47.997201,0.81,housenumber,1 Place Gambetta (Cloyes-sur-le-Loir) 28220 Cloyes-les-Trois-Rivières,28103_0100_00001,G,1 PLACE GAMBETTA,CLOYES SUR LE LOIR
212801039,00059,21280103900059,O,1996-12-25,NN,,,2019-11-14T14:00:28,false,3,MAIRIE,1,,PL,GAMBETTA,28220,CLOYES-LES-TROIS-RIVIERES,,,28103,,,,,,,,,,,,,,,,,,,2012-12-25,F,SERVICE ASSAINISSEMENT,,,,37.00Z,NAFRev2,N,1.233263,47.997201,0.81,housenumber,1 Place Gambetta (Cloyes-sur-le-Loir) 28220 Cloyes-les-Trois-Rivières,28103_0100_00001,G,1 PLACE GAMBETTA,CLOYES SUR LE LOIR
212801039,00067,21280103900067,O,1996-12-25,NN,,,2019-11-14T14:00:28,false,3,MAIRIE,1,,PL,GAMBETTA,28220,CLOYES-LES-TROIS-RIVIERES,,,28103,,,,,,,,,,,,,,,,,,,2017-01-01,F,SERVICE EAU,,,,36.00Z,NAFRev2,N,1.233263,47.997201,0.81,housenumber,1 Place Gambetta (Cloyes-sur-le-Loir) 28220 Cloyes-les-Trois-Rivières,28103_0100_00001,G,1 PLACE GAMBETTA,CLOYES SUR LE LOIR
212801039,00075,21280103900075,O,1999-12-25,NN,,,2019-11-14T14:00:28,false,3,MAIRIE,1,,PL,GAMBETTA,28220,CLOYES-LES-TROIS-RIVIERES,,,28103,,,,,,,,,,,,,,,,,,,2017-01-01,F,LOTISSEMENTS,,,,42.99Z,NAFRev2,N,1.233263,47.997201,0.81,housenumber,1 Place Gambetta (Cloyes-sur-le-Loir) 28220 Cloyes-les-Trois-Rivières,28103_0100_00001,G,1 PLACE GAMBETTA,CLOYES SUR LE LOIR
212801039,00083,21280103900083,O,2003-02-10,NN,,,2019-11-14T14:00:28,false,4,MAIRIE,1,,PL,GAMBETTA,28220,CLOYES-LES-TROIS-RIVIERES,,,28103,,,,,,,,,,,,,,,,,,,2012-12-25,F,LOTISSEMENT LES SOURCES,,,,42.99Z,NAFRev2,N,1.233263,47.997201,0.81,housenumber,1 Place Gambetta (Cloyes-sur-le-Loir) 28220 Cloyes-les-Trois-Rivières,28103_0100_00001,G,1 PLACE GAMBETTA,CLOYES SUR LE LOIR
212801039,00091,21280103900091,O,2002-12-25,NN,,,2019-11-14T14:00:28,false,3,MAIRIE,1,,PL,GAMBETTA,28220,CLOYES-LES-TROIS-RIVIERES,,,28103,,,,,,,,,,,,,,,,,,,2017-01-01,F,LOTISSEMENT LES PETITS CROISES,,,,42.99Z,NAFRev2,N,1.233263,47.997201,0.81,housenumber,1 Place Gambetta (Cloyes-sur-le-Loir) 28220 Cloyes-les-Trois-Rivières,28103_0100_00001,G,1 PLACE GAMBETTA,CLOYES SUR LE LOIR
212801039,00109,21280103900109,O,2003-01-01,NN,,,2019-11-14T14:00:28,false,4,MAIRIE,1,,PL,GAMBETTA,28220,CLOYES-LES-TROIS-RIVIERES,,,28103,,,,,,,,,,,,,,,,,,,2012-12-25,F,LOTISSEMENT DES VIGNES DU VIEUX MOULIN,,,,42.99Z,NAFRev2,N,1.233263,47.997201,0.81,housenumber,1 Place Gambetta (Cloyes-sur-le-Loir) 28220 Cloyes-les-Trois-Rivières,28103_0100_00001,G,1 PLACE GAMBETTA,CLOYES SUR LE LOIR
212801039,00117,21280103900117,O,2005-03-01,,,,2019-11-14T14:00:28,false,3,MAIRIE,1,,PL,GAMBETTA,28220,CLOYES-LES-TROIS-RIVIERES,,,28103,,,,,,,,,,,,,,,,,,,2017-01-01,F,LOCATION DE SALLES,,,,68.20B,NAFRev2,N,1.233263,47.997201,0.81,housenumber,1 Place Gambetta (Cloyes-sur-le-Loir) 28220 Cloyes-les-Trois-Rivières,28103_0100_00001,G,1 PLACE GAMBETTA,CLOYES SUR LE LOIR
212801039,00125,21280103900125,O,2005-05-01,,,,2019-11-14T14:00:28,false,3,MAIRIE,1,,PL,GAMBETTA,28220,CLOYES-LES-TROIS-RIVIERES,,,28103,,,,,,,,,,,,,,,,,,,2012-12-25,F,LOTISSEMENT VIGNES VIEUX MOULIN 2EME TR,,,,42.99Z,NAFRev2,N,1.233263,47.997201,0.81,housenumber,1 Place Gambetta (Cloyes-sur-le-Loir) 28220 Cloyes-les-Trois-Rivières,28103_0100_00001,G,1 PLACE GAMBETTA,CLOYES SUR LE LOIR
212801336,00018,21280133600018,O,1983-03-01,NN,,,2019-11-14T14:00:28,true,5,,31,,RUE,DE LA VALLEE,28220,CLOYES-LES-TROIS-RIVIERES,,,28103,,,,,,,,,,,,,,,,,,,2017-01-01,F,MAIRIE,,,,84.11Z,NAFRev2,O,1.271922,48.035543,0.96,housenumber,31 Rue de la Vallée 28220 Cloyes-les-Trois-Rivières,28133_0056_00031,G,31 RUE DE LA VALLEE,
212801336,00026,21280133600026,O,1983-12-21,NN,,,2019-11-14T14:00:28,false,5,,31,,RUE,DE LA VALLEE,28220,CLOYES-LES-TROIS-RIVIERES,,,28103,,,,,,,,,,,,,,,,,,,2017-01-01,F,ECOLE ELEMENTAIRE PUBLIQUE,,,,85.20Z,NAFRev2,N,1.271922,48.035543,0.96,housenumber,31 Rue de la Vallée 28220 Cloyes-les-Trois-Rivières,28133_0056_00031,G,31 RUE DE LA VALLEE,
212801336,00034,21280133600034,O,1997-02-01,NN,,,2019-11-14T14:00:28,false,4,MAIRIE,31,,RUE,DE LA VALLEE,28220,CLOYES-LES-TROIS-RIVIERES,,,28103,,,,,,,,,,,,,,,,,,,2017-01-01,F,SERVICE TRANSPORT,,,,49.39A,NAFRev2,N,1.271922,48.035543,0.96,housenumber,31 Rue de la Vallée 28220 Cloyes-les-Trois-Rivières,28133_0056_00031,G,31 RUE DE LA VALLEE,
212801336,00042,21280133600042,O,2001-07-12,NN,,,2019-11-14T14:00:28,false,3,MAIRIE,31,,RUE,DE LA VALLEE,28220,CLOYES-LES-TROIS-RIVIERES,,,28103,,,,,,,,,,,,,,,,,,,2005-03-29,F,LOTISSEMENT,,,,70.1C,NAFRev1,N,1.271922,48.035543,0.96,housenumber,31 Rue de la Vallée 28220 Cloyes-les-Trois-Rivières,28133_0056_00031,G,31 RUE DE LA VALLEE,
212801500,00019,21280150000019,O,1983-03-01,NN,,,2019-11-14T14:00:28,true,4,,7,,RUE,NATIONALE,28220,CLOYES-LES-TROIS-RIVIERES,,,28103,,,,,,,,,,,,,,,,,,,2017-01-01,F,MAIRIE,,,,84.11Z,NAFRev2,O,1.326644,47.972627,0.94,housenumber,7 Rue Nationale (Charray) 28220 Cloyes-les-Trois-Rivières,28083_0037_00007,G,7 RUE NATIONALE,CHARRAY
212801500,00027,21280150000027,O,1983-12-21,NN,,,2019-11-14T14:00:28,false,5,,9,,RUE,NATIONALE,28220,CLOYES-LES-TROIS-RIVIERES,,,28103,,,,,,,,,,,,,,,,,,,2017-01-01,F,ECOLE ELEMENTAIRE PUBLIQUE,,,,85.20Z,NAFRev2,N,1.234262,47.996588,0.94,housenumber,9 Rue Nationale (Cloyes-sur-le-Loir) 28220 Cloyes-les-Trois-Rivières,28103_0165_00009,G,9 RUE NATIONALE,CLOYES SUR LE LOIR
212802417,00015,21280241700015,O,1983-03-01,NN,,,2019-11-14T14:00:28,true,4,,,,,,28220,CLOYES-LES-TROIS-RIVIERES,,,28103,,,,,,,,,,,,,,,,,,,2017-01-01,F,MAIRIE,,,,84.11Z,NAFRev2,O,,,0,,,,,,
212802417,00023,21280241700023,O,1983-12-21,NN,,,2019-11-14T14:00:28,false,4,,2,,RUE,DE LA MAIRIE,28220,CLOYES-LES-TROIS-RIVIERES,,,28103,,,,,,,,,,,,,,,,,,,2017-01-01,F,ECOLE PRIMAIRE PUBLIQUE,,,,85.20Z,NAFRev2,N,1.326363,47.972538,0.94,housenumber,2 Rue de la Mairie (Charray) 28220 Cloyes-les-Trois-Rivières,28083_0021_00002,G,2 RUE DE LA MAIRIE,CHARRAY
212802417,00031,21280241700031,O,1996-01-01,NN,,,2019-11-14T14:00:28,false,4,MAIRIE,,,RUE,DE LA MAIRIE,28220,CLOYES-LES-TROIS-RIVIERES,,,28103,,,,,,,,,,,,,,,,,,,2017-01-01,F,SERVICE ASSAINISSEMENT,,,,37.00Z,NAFRev2,N,1.325726,47.972346,0.94,street,Rue de la Mairie (Charray) 28220 Cloyes-les-Trois-Rivières,28083_0021,G,RUE DE LA MAIRIE,CHARRAY
212802417,00049,21280241700049,O,1996-01-01,NN,,,2019-11-14T14:00:28,false,4,MAIRIE,,,RUE,DE LA MAIRIE,28220,CLOYES-LES-TROIS-RIVIERES,,,28103,,,,,,,,,,,,,,,,,,,2017-01-01,F,SERVICE EAU,,,,36.00Z,NAFRev2,N,1.325726,47.972346,0.94,street,Rue de la Mairie (Charray) 28220 Cloyes-les-Trois-Rivières,28083_0021,G,RUE DE LA MAIRIE,CHARRAY
212802623,00018,21280262300018,O,1983-03-01,NN,,,2019-11-14T14:00:28,false,3,,,,PL,ST GILLES,28220,CLOYES-LES-TROIS-RIVIERES,,,28103,,,,,,,,,,,,,,,,,,,2004-03-01,F,MAIRIE,,,,75.1A,NAFRev1,O,1.234141,48.013493,0.67,street,Place Saint Gilles 28220 Cloyes-les-Trois-Rivières,28262_0110,G,PLACE SAINT GILLES,
212802623,00026,21280262300026,O,1983-12-21,NN,,,2019-11-14T14:00:28,false,7,,14,,RUE,GRANDE,28220,CLOYES-LES-TROIS-RIVIERES,,,28103,,,,,,,,,,,,,,,,,,,2017-01-01,F,ECOLE ELEMENTAIRE PUBLIQUE,,,,85.20Z,NAFRev2,O,1.280536,47.985702,0.94,housenumber,14 Rue Grande (Romilly-sur-Aigre) 28220 Cloyes-les-Trois-Rivières,28318_0049_00014,G,14 RUE GRANDE,ROMILLY SUR AIGRE
212802623,00034,21280262300034,O,1996-01-01,NN,,,2019-11-14T14:00:28,false,4,MAIRIE,14,,RUE,GRANDE,28220,CLOYES-LES-TROIS-RIVIERES,,,28103,,,,,,,,,,,,,,,,,,,2012-12-25,F,SERVICE ASSAINISSEMENT,,,,37.00Z,NAFRev2,N,1.280536,47.985702,0.94,housenumber,14 Rue Grande (Romilly-sur-Aigre) 28220 Cloyes-les-Trois-Rivières,28318_0049_00014,G,14 RUE GRANDE,ROMILLY SUR AIGRE
212802623,00042,21280262300042,O,2004-03-01,NN,,,2019-11-14T14:00:28,true,3,,14,,RUE,GRANDE,28220,CLOYES-LES-TROIS-RIVIERES,,,28103,,,,,,,,,,,,,,,,,,,2017-01-01,F,,,,,84.11Z,NAFRev2,O,1.280536,47.985702,0.94,housenumber,14 Rue Grande (Romilly-sur-Aigre) 28220 Cloyes-les-Trois-Rivières,28318_0049_00014,G,14 RUE GRANDE,ROMILLY SUR AIGRE
212803183,00012,21280318300012,O,1983-03-01,NN,,,2019-11-14T14:00:28,true,5,,83,,,GRANDE RUE,28220,CLOYES-LES-TROIS-RIVIERES,,,28103,,,,,,,,,,,,,,,,,,,2017-01-01,F,MAIRIE,,,,84.11Z,NAFRev2,O,1.283301,47.980427,0.87,housenumber,83 Rue Grande (Romilly-sur-Aigre) 28220 Cloyes-les-Trois-Rivières,28318_0049_00083,G,83 RUE GRANDE,ROMILLY SUR AIGRE
212803183,00020,21280318300020,O,1983-12-21,NN,,,2019-11-14T14:00:28,false,5,,81,,,GRANDE RUE,28220,CLOYES-LES-TROIS-RIVIERES,,,28103,,,,,,,,,,,,,,,,,,,2017-01-01,F,ECOLE PRIMAIRE ROGER BELLON,,,,85.20Z,NAFRev2,N,1.283158,47.980513,0.87,housenumber,81 Rue Grande (Romilly-sur-Aigre) 28220 Cloyes-les-Trois-Rivières,28318_0049_00081,G,81 RUE GRANDE,ROMILLY SUR AIGRE
212803183,00038,21280318300038,O,1996-01-01,NN,,,2019-11-14T14:00:28,false,4,MAIRIE,83,,,GRANDE RUE,28220,CLOYES-LES-TROIS-RIVIERES,,,28103,,,,,,,,,,,,,,,,,,,2012-01-01,F,SERVICE ASSAINISSEMENT,,,,37.00Z,NAFRev2,N,1.283301,47.980427,0.87,housenumber,83 Rue Grande (Romilly-sur-Aigre) 28220 Cloyes-les-Trois-Rivières,28318_0049_00083,G,83 RUE GRANDE,ROMILLY SUR AIGRE