siren,nic,siret,statutDiffusionEtablissement,dateCreationEtablissement,trancheEffectifsEtablissement,anneeEffectifsEtablissement,activitePrincipaleRegistreMetiersEtablissement,dateDernierTraitementEtablissement,etablissementSiege,nombrePeriodesEtablissement,complementAdresseEtablissement,numeroVoieEtablissement,indiceRepetitionEtablissement,typeVoieEtablissement,libelleVoieEtablissement,codePostalEtablissement,libelleCommuneEtablissement,libelleCommuneEtrangerEtablissement,distributionSpecialeEtablissement,codeCommuneEtablissement,codeCedexEtablissement,libelleCedexEtablissement,codePaysEtrangerEtablissement,libellePaysEtrangerEtablissement,complementAdresse2Etablissement,numeroVoie2Etablissement,indiceRepetition2Etablissement,typeVoie2Etablissement,libelleVoie2Etablissement,codePostal2Etablissement,libelleCommune2Etablissement,libelleCommuneEtranger2Etablissement,distributionSpeciale2Etablissement,codeCommune2Etablissement,codeCedex2Etablissement,libelleCedex2Etablissement,codePaysEtranger2Etablissement,libellePaysEtranger2Etablissement,dateDebut,etatAdministratifEtablissement,enseigne1Etablissement,enseigne2Etablissement,enseigne3Etablissement,denominationUsuelleEtablissement,activitePrincipaleEtablissement,nomenclatureActivitePrincipaleEtablissement,caractereEmployeurEtablissement,longitude,latitude,geo_score,geo_type,geo_adresse,geo_id,geo_ligne,geo_l4,geo_l5
173302118,00133,17330211800133,O,1983-11-09,,,,2006-10-26T23:39:07,false,3,,11,,AV,DU 8 MAI 1945,33420,BRANNE,,,33071,,,,,,,,,,,,,,,,,,,2005-01-01,F,TRESORERIE BRANNE,,,,75.1A,NAFRev1,N,-0.186808,44.830025,0.85,housenumber,11 Avenue du 8 Mai 1945 33420 Branne,33071_0030_00011,G,11 AVENUE DU 8 MAI 1945,
173302217,00091,17330221700091,O,1983-11-10,NN,,,,false,3,,,,RUE,DE L EGLISE,33420,BRANNE,,,33071,,,,,,,,,,,,,,,,,,,1993-02-01,F,RECETTE LOCALE C E BRANNE,,,,75.1A,NAF1993,N,-0.186332,44.830364,0.95,street,Rue de l’Eglise 33420 Branne,33071_0016,G,RUE DE L EGLISE,
173302308,00395,17330230800395,O,1993-01-01,,,,2008-01-04T18:14:59,false,3,,,,RUE,DE L EGLISE,33420,BRANNE,,,33071,,,,,,,,,,,,,,,,,,,2008-01-01,A,RECETTE LOCALE,,,,84.11Z,NAFRev2,N,-0.186332,44.830364,0.95,street,Rue de l’Eglise 33420 Branne,33071_0016,G,RUE DE L EGLISE,
193300589,00010,19330058900010,O,1983-03-01,21,2019,,2021-10-27T08:04:50,true,4,,43,,RUE,FORT BAYARD,33420,BRANNE,,BP 57,33071,,,,,,,,,,,,,,,,,,,2010-01-10,A,,,,,85.31Z,NAFRev2,O,-0.184135,44.824405,0.9,housenumber,43 Rue du Fort Bayard 33420 Branne,33071_0020_00043,G,43 RUE DU FORT BAYARD,
200000446,00019,20000044600019,O,2005-12-16,NN,,,2014-06-13T23:20:50,true,4,MAIRIE,2,,PL,DU 11 NOVEMBRE,33420,BRANNE,,,33071,,,,,,,,,,,,,,,,,,,2013-01-01,F,,,,,84.11Z,NAFRev2,O,-0.187086,44.829925,0.75,street,Place du 11 Novembre 33420 Branne,33071_auzwzu,G,PLACE DU 11 NOVEMBRE,
200000446,00027,20000044600027,O,2007-01-01,,,,2013-04-26T13:40:17,false,3,MAIRIE,2,,PL,DU 11 NOVEMBRE,33420,BRANNE,,,33071,,,,,,,,,,,,,,,,,,,2013-01-01,F,REGIE DE TRANSPORTS,,,,49.39A,NAFRev2,N,-0.187086,44.829925,0.75,street,Place du 11 Novembre 33420 Branne,33071_auzwzu,G,PLACE DU 11 NOVEMBRE,
200033520,00012,20003352000012,O,2013-01-01,NN,,,2018-09-29T12:03:27,true,2,MAIRIE,2,,PL,DU 11 NOVEMBRE,33420,BRANNE,,,33071,,,,,,,,,,,,,,,,,,,2016-12-31,F,,,,,84.11Z,NAFRev2,O,-0.187086,44.829925,0.75,street,Place du 11 Novembre 33420 Branne,33071_auzwzu,G,PLACE DU 11 NOVEMBRE,
200033520,00020,20003352000020,O,2013-01-01,NN,,,2018-09-29T12:03:27,false,2,,2,,PL,DU 11 NOVEMBRE,33420,BRANNE,,,33071,,,,,,,,,,,,,,,,,,,2016-12-31,F,SERVICE AIDE A LA PERSONNE,,,,84.12Z,NAFRev2,O,-0.187086,44.829925,0.75,street,Place du 11 Novembre 33420 Branne,33071_auzwzu,G,PLACE DU 11 NOVEMBRE,
200033793,00015,20003379300015,O,2013-01-01,,,,2012-10-11T15:53:03,true,1,MAIRIE,2,,PL,DU 11 NOVEMBRE,33420,BRANNE,,,33071,,,,,,,,,,,,,,,,,,,2013-01-01,F,,,,,84.11Z,NAFRev2,O,-0.187086,44.829925,0.75,street,Place du 11 Novembre 33420 Branne,33071_auzwzu,G,PLACE DU 11 NOVEMBRE,
200072155,00019,20007215500019,O,2016-12-30,NN,,,2019-06-24T13:08:57,true,2,MAIRIE DE BRANNE,11,,PL,DU  NOVEMBRE,33420,BRANNE,,,33071,,,,,,,,,,,,,,,,,,,2018-12-31,F,,,,,84.12Z,NAFRev2,O,-0.187086,44.829925,0.75,street,Place du 11 Novembre 33420 Branne,33071_auzwzu,G,PLACE DU 11 NOVEMBRE,
213300718,00011,21330071800011,O,1983-03-01,11,2019,,2021-10-27T08:07:52,true,4,,2,,PL,11 NOVEMBRE,33420,BRANNE,,,33071,,,,,,,,,,,,,,,,,,,2008-01-01,A,MAIRIE,,,,84.11Z,NAFRev2,O,-0.187086,44.829925,0.81,street,Place du 11 Novembre 33420 Branne,33071_auzwzu,G,PLACE DU 11 NOVEMBRE,
213300718,00029,21330071800029,O,1983-12-21,11,2019,,2021-10-27T08:07:52,false,3,,,,,PLACE DE LA MAIRIE,33420,BRANNE,,,33071,,,,,,,,,,,,,,,,,,,2008-01-01,A,ECOLE PRIMAIRE PUBLIQUE,,,,85.20Z,NAFRev2,N,-0.185742,44.830597,0.51,street,Place de l’Eglise 33420 Branne,33071_0015,G,PLACE DE L EGLISE,
213300718,00037,21330071800037,O,1996-12-25,NN,,,2008-01-04T18:31:05,false,2,MAIRIE,,,,,33420,BRANNE,,,33071,,,,,,,,,,,,,,,,,,,2008-01-01,A,SERVICE DE L EAU,,,,36.00Z,NAFRev2,N,-0.182243,44.825541,0.4,street,Chemin de la Tannerie 33420 Branne,33071_2y19o7,D,CHEMIN DE LA TANNERIE,
213300718,00045,21330071800045,O,2003-10-01,NN,,,2008-06-05T16:45:36,false,4,,2,,PL,11 NOVEMBRE,33420,BRANNE,,,33071,,,,,,,,,,,,,,,,,,,2008-06-04,F,DESSERTE DE MARCHE,,,,49.39A,NAFRev2,N,-0.187086,44.829925,0.81,street,Place du 11 Novembre 33420 Branne,33071_auzwzu,G,PLACE DU 11 NOVEMBRE,
243300886,00013,24330088600013,O,1996-07-18,NN,,,,true,1,,,,,MAIRIE,33420,BRANNE,,,33071,,,,,,,,,,,,,,,,,,,2001-12-31,F,,,,,75.1A,NAF1993,N,-0.182243,44.825541,0.4,street,Chemin de la Tannerie 33420 Branne,33071_2y19o7,G,CHEMIN DE LA TANNERIE,
253300206,00013,25330020600013,O,1983-03-01,01,2019,,2021-10-27T08:12:07,true,4,,,,,MAIRIE,33420,BRANNE,,,33071,,,,,,,,,,,,,,,,,,,2008-01-01,A,,,,,84.12Z,NAFRev2,O,-0.182243,44.825541,0.4,street,Chemin de la Tannerie 33420 Branne,33071_2y19o7,G,CHEMIN DE LA TANNERIE,
253300552,00010,25330055200010,O,1983-03-01,NN,,,,true,1,,,,,MAIRIE,33420,BRANNE,,,33071,,,,,,,,,,,,,,,,,,,2002-12-31,F,,,,,90.0B,NAF1993,N,-0.182243,44.825541,0.4,street,Chemin de la Tannerie 33420 Branne,33071_2y19o7,G,CHEMIN DE LA TANNERIE,
253302558,00015,25330255800015,O,1983-03-01,NN,,,,false,4,,,,,MAIRIE,33420,BRANNE,,,33071,,,,,,,,,,,,,,,,,,,1996-12-25,F,DEUX MERS,,,,75.1E,NAF1993,N,-0.182243,44.825541,0.4,street,Chemin de la Tannerie 33420 Branne,33071_2y19o7,G,CHEMIN DE LA TANNERIE,
253302871,00012,25330287100012,O,1983-03-01,NN,,,2014-06-13T23:42:57,true,5,MAIRIE,2,,PL,DU 11 NOVEMBRE,33420,BRANNE,,,33071,,,,,,,,,,,,,,,,,,,2013-06-21,F,,,,,84.12Z,NAFRev2,O,-0.187086,44.829925,0.75,street,Place du 11 Novembre 33420 Branne,33071_auzwzu,G,PLACE DU 11 NOVEMBRE,
253302871,00020,25330287100020,O,2003-06-24,NN,,,2014-06-13T23:42:57,false,4,MAIRIE,2,,PL,DU 11 NOVEMBRE,33420,BRANNE,,,33071,,,,,,,,,,,,,,,,,,,2013-06-21,F,CONTRAT TEMPS LIBRE JEUNES,,,,84.12Z,NAFRev2,N,-0.187086,44.829925,0.75,street,Place du 11 Novembre 33420 Branne,33071_auzwzu,G,PLACE DU 11 NOVEMBRE,
253302871,00038,25330287100038,O,2003-06-24,NN,,,2013-06-27T08:59:56,false,4,MAIRIE,2,,PL,DU 11 NOVEMBRE,33420,BRANNE,,,33071,,,,,,,,,,,,,,,,,,,2013-06-21,F,CENTRE DE VACANCES,,,,55.20Z,NAFRev2,N,-0.187086,44.829925,0.75,street,Place du 11 Novembre 33420 Branne,33071_auzwzu,G,PLACE DU 11 NOVEMBRE,
253302871,00046,25330287100046,O,2003-01-01,NN,,,2013-06-27T08:59:56,false,4,MAIRIE,2,,PL,DU 11 NOVEMBRE,33420,BRANNE,,,33071,,,,,,,,,,,,,,,,,,,2013-06-21,F,GESTION DU BATIMENT,,,,84.12Z,NAFRev2,N,-0.187086,44.829925,0.75,street,Place du 11 Novembre 33420 Branne,33071_auzwzu,G,PLACE DU 11 NOVEMBRE,
253302871,00053,25330287100053,O,2005-06-01,NN,,,2014-06-13T23:42:57,false,4,MAIRIE,2,,PL,DU 11 NOVEMBRE,33420,BRANNE,,,33071,,,,,,,,,,,,,,,,,,,2013-06-21,F,RELAIS D'ASSISTANTES MATERNELLES,,,,88.91A,NAFRev2,O,-0.187086,44.829925,0.75,street,Place du 11 Novembre 33420 Branne,33071_auzwzu,G,PLACE DU 11 NOVEMBRE,
253303325,00018,25330332500018,O,1984-02-15,NN,,,2014-06-13T23:42:57,true,6,MAIRIE,2,,PL,DU 11 NOVEMBRE,33420,BRANNE,,,33071,,,,,,,,,,,,,,,,,,,2013-06-21,F,,,,,88.10A,NAFRev2,O,-0.187086,44.829925,0.75,street,Place du 11 Novembre 33420 Branne,33071_auzwzu,G,PLACE DU 11 NOVEMBRE,
253303325,00026,25330332500026,O,2011-01-01,NN,,,2013-06-26T20:02:23,false,2,MAIRIE,2,,PL,DU 11 NOVEMBRE,33420,BRANNE,,,33071,,,,,,,,,,,,,,,,,,,2013-06-21,F,SERVICE D'AIDE A DOMICILE,,,,88.10A,NAFRev2,N,-0.187086,44.829925,0.75,street,Place du 11 Novembre 33420 Branne,33071_auzwzu,G,PLACE DU 11 NOVEMBRE,
253304141,00018,25330414100018,O,1988-09-14,NN,,,,true,1,,,,,CASERNE,33420,BRANNE,,,33071,,,,,,,,,,,,,,,,,,,2002-01-11,F,,,,,75.1G,NAF1993,N,-0.180606,44.832063,0.35,street,Route de Cabara 33420 Branne,33071_0005,G,ROUTE DE CABARA,
253306070,00017,25330607000017,O,1998-08-12,02,2019,,2021-10-27T08:12:07,true,3,,,,,MAIRIE,33420,BRANNE,,,33071,,,,,,,,,,,,,,,,,,,2008-01-01,A,,,,,37.00Z,NAFRev2,N,-0.182243,44.825541,0.4,street,Chemin de la Tannerie 33420 Branne,33071_2y19o7,G,CHEMIN DE LA TANNERIE,
263300709,00015,26330070900015,O,,,,,,true,1,,,,,,33420,BRANNE,,,33071,,,,,,,,,,,,,,,,,,,,F,,,,,95.11,NAP,N,,,0,,,,,,
263306110,00010,26330611000010,O,1983-03-01,NN,,,2010-06-26T03:08:41,true,3,,,,,MAIRIE,33420,BRANNE,,,33071,,,,,,,,,,,,,,,,,,,2008-01-01,A,CCAS,,,,88.99B,NAFRev2,N,-0.182243,44.825541,0.4,street,Chemin de la Tannerie 33420 Branne,33071_2y19o7,G,CHEMIN DE LA TANNERIE,
300856903,00012,30085690300012,O,1980-01-01,NN,,,2009-10-06T09:33:18,false,6,MOULIN DE LISSANDRE,,,,MOULIN DE LISSANDRE,33420,BRANNE,,,33071,,,,,,,,,,,,,,,,,,,2009-06-30,F,,,,,68.20B,NAFRev2,N,-0.189014,44.827059,0.95,street,Moulin de Lissandre 33420 Branne,33071_B028,G,MOULIN DE LISSANDRE,
300856903,00020,30085690300020,O,2009-07-01,,,,2016-08-19T03:23:56,true,2,,4,,,MOULIN DE LISSANDRE,33420,BRANNE,,,33071,,,,,,,,,,,,,,,,,,,2016-07-31,F,,,,,43.34Z,NAFRev2,N,-0.188844,44.826267,0.95,housenumber,4 Moulin de Lissandre 33420 Branne,33071_b028_00004,G,4 MOULIN DE LISSANDRE,
301344339,00017,30134433900017,O,1974-01-01,NN,,,,true,1,,38,,RUE,EMMANUEL ROY,33420,BRANNE,,,33071,,,,,,,,,,,,,,,,,,,2000-09-30,F,,,,,45.3E,NAF1993,O,-0.186141,44.829231,0.96,housenumber,38 Rue Emmanuel Roy 33420 Branne,33071_0018_00038,G,38 RUE EMMANUEL ROY,
301793352,00016,30179335200016,O,,NN,,,,true,1,,75,,RUE,EMMANUEL ROY,33420,BRANNE,,,33071,,,,,,,,,,,,,,,,,,,,F,,,,,64.11,NAP,N,-0.186701,44.829297,0.96,housenumber,75 Rue Emmanuel Roy 33420 Branne,33071_0018_00075,G,75 RUE EMMANUEL ROY,
302141635,00029,30214163500029,O,1990-06-01,NN,,,2008-01-04T19:18:48,true,3,,66,,RUE,EMMANUEL ROY,33420,BRANNE,,,33071,,,,,,,,,,,,,,,,,,,2008-01-01,A,,,,,68.20B,NAFRev2,N,-0.187604,44.829113,0.96,housenumber,66 Rue Emmanuel Roy 33420 Branne,33071_0018_00066,G,66 RUE EMMANUEL ROY,
302298468,00018,30229846800018,O,,NN,,,,true,1,,21,,RUE,MATEAU,33420,BRANNE,,,33071,,,,,,,,,,,,,,,,,,,1990-12-17,F,,,,,81.21,NAP,N,-0.187949,44.831455,0.95,housenumber,21 Rue Mateau 33420 Branne,33071_0047_00021,G,21 RUE MATEAU,
303518690,00035,30351869000035,O,1987-12-31,NN,,,2013-05-27T03:03:55,true,3,,38,,RUE,DU FORT BAYARD,33420,BRANNE,,,33071,,,,,,,,,,,,,,,,,,,2008-01-01,A,,,,,01.21Z,NAFRev2,N,-0.184089,44.825553,0.95,housenumber,38 Rue du Fort Bayard 33420 Branne,33071_0020_00038,G,38 RUE DU FORT BAYARD,
303666184,00013,30366618400013,O,1975-01-01,NN,,,2009-06-27T03:39:57,true,5,,13,,RTE,DE CABARA,33420,BRANNE,,,33071,,,,,,,,,,,,,,,,,,,2008-01-01,F,,,,,16.23Z,NAFRev2,O,-0.182414,44.832303,0.85,housenumber,13 Route de Cabara 33420 Branne,33071_0005_00013,G,13 ROUTE DE CABARA,
303864193,00055,30386419300055,O,2014-09-10,,,,2016-03-14T08:57:32,false,2,,36,,RUE,FORT BAYARD,33420,BRANNE,,,33071,,,,,,,,,,,,,,,,,,,2016-03-11,F,,,,,56.10C,NAFRev2,N,-0.184139,44.827243,0.9,housenumber,36 Rue du Fort Bayard 33420 Branne,33071_0020_00036,G,36 RUE DU FORT BAYARD,
304749484,00016,30474948400016,O,,NN,,,,true,1,,,,,MOULIN DE LIREL,33420,BRANNE,,,33071,,,,,,,,,,,,,,,,,,,,F,,,,,03.30,NAP,N,-0.192421,44.824907,0.83,street,Moulin de Liret 33420 Branne,33071_B027,G,MOULIN DE LIRET,
304850985,00017,30485098500017,O,1900-01-01,NN,,,2008-01-04T19:32:39,true,3,,,,,MAIRIE,33420,BRANNE,,,33071,,,,,,,,,,,,,,,,,,,2008-01-01,A,,,,,55.20Z,NAFRev2,N,-0.182243,44.825541,0.4,street,Chemin de la Tannerie 33420 Branne,33071_2y19o7,G,CHEMIN DE LA TANNERIE,
304927742,00151,30492774200151,O,2007-01-01,,,,2008-01-04T19:33:04,false,2,,54,T,RUE,EMMANUEL ROY,33420,BRANNE,,,33071,,,,,,,,,,,,,,,,,,,2007-01-01,F,,,,,74.1C,NAFRev1,N,-0.187098,44.829153,0.87,housenumber,54ter Rue Emmanuel Roy 33420 Branne,33071_0018_00054_ter,G,54TER RUE EMMANUEL ROY,
305312472,00023,30531247200023,O,1983-06-30,NN,,,2008-11-07T00:21:04,true,4,,54,,RUE,EMMANUEL ROY,33420,BRANNE,,,33071,,,,,,,,,,,,,,,,,,,2007-12-31,F,,,,,52.7F,NAFRev1,N,-0.187098,44.829153,0.96,housenumber,54 Rue Emmanuel Roy 33420 Branne,33071_0018_00054,G,54 RUE EMMANUEL ROY,
305456295,00016,30545629500016,O,,NN,,,,true,1,,6,,RUE,EMMANUEL ROY,33420,BRANNE,,,33071,,,,,,,,,,,,,,,,,,,1989-12-31,F,,,,,55.40,NAP,N,-0.186004,44.831082,0.96,housenumber,6 Rue Emmanuel Roy 33420 Branne,33071_0018_00006,G,6 RUE EMMANUEL ROY,
305496515,00027,30549651500027,O,1988-10-01,NN,,,,true,1,,,,LD,LES RACES,33420,BRANNE,,,33071,,,,,,,,,,,,,,,,,,,2002-03-31,F,,,,,51.1R,NAF1993,N,-0.182714,44.824552,0.63,street,Les Places 33420 Branne,33071_invzkt,G,LES PLACES,
306048125,00059,30604812500059,O,,NN,,,,true,1,,14,,AV,DES ANCIENS COMBATTANTS AF,33420,BRANNE,,,33071,,,,,,,,,,,,,,,,,,,1995-06-30,F,,,,,93.0D,NAF1993,O,-0.187226,44.829782,0.78,housenumber,14 Rue des Anciens Combattants 33420 Branne,33071_2eyhso_00014,G,14 RUE DES ANCIENS COMBATTANTS,
306560228,00059,30656022800059,O,1995-11-28,NN,,,2008-11-07T00:22:16,false,4,,2,,RTE,DE GUILLAC,33420,BRANNE,,,33071,,,,,,,,,,,,,,,,,,,1996-12-31,F,BRANNE AGRICOLE,,,,29.3D,NAF1993,O,-0.188266,44.828924,0.84,housenumber,2 Route de Guillac 33420 Branne,33071_0027_00002,G,2 ROUTE DE GUILLAC,
307288639,00023,30728863900023,O,2013-02-22,,,,2020-10-02T03:38:56,true,2,,21,,RUE,MATEAU,33420,BRANNE,,,33071,,,,,,,,,,,,,,,,,,,2018-07-18,F,,,,,68.20B,NAFRev2,N,-0.187949,44.831455,0.95,housenumber,21 Rue Mateau 33420 Branne,33071_0047_00021,G,21 RUE MATEAU,
308630805,00031,30863080500031,O,,NN,,,,true,1,,89,,RUE,EMMANUEL ROY,33420,BRANNE,,,33071,,,,,,,,,,,,,,,,,,,1991-09-30,F,,,,,64.43,NAP,N,-0.188179,44.829181,0.96,housenumber,89 Rue Emmanuel Roy 33420 Branne,33071_0018_00089,G,89 RUE EMMANUEL ROY,
309395507,00010,30939550700010,O,,,,,,true,1,,9,,RUE,DUBOIS,33420,BRANNE,,,33071,,,,,,,,,,,,,,,,,,,1984-12-25,F,,,,,55.60,NAP,N,-0.187765,44.829751,0.95,housenumber,9 Rue Dubois 33420 Branne,33071_0010_00009,G,9 RUE DUBOIS,
309693216,00025,30969321600025,O,1900-01-01,NN,,,2013-03-22T04:31:14,true,4,,6,,RUE,DU PUITS ARTESIEN,33420,BRANNE,,,33071,,,,,,,,,,,,,,,,,,,2013-03-31,F,,,,,86.21Z,NAFRev2,N,-0.186269,44.828894,0.95,housenumber,6 Rue du Puits Artésien 33420 Branne,33071_0056_00006,G,6 RUE DU PUITS ARTESIEN,
309922243,00014,30992224300014,O,,NN,,,,true,1,,,,,QUIGNAN,33420,BRANNE,,,33071,,,,,,,,,,,,,,,,,,,1991-02-05,F,,,,,55.71,NAP,N,-0.183704,44.8273,0.7,street,Guignan 33420 Branne,33071_8nn0tz,G,GUIGNAN,
310176060,00047,31017606000047,O,1990-01-29,01,2019,,2021-10-27T08:17:07,true,5,,46,,RUE,EMMANUEL ROY,33420,BRANNE,,,33071,,,,,,,,,,,,,,,,,,,2021-06-30,F,,,,,66.22Z,NAFRev2,O,-0.186622,44.829191,0.96,housenumber,46 Rue Emmanuel Roy 33420 Branne,33071_0018_00046,G,46 RUE EMMANUEL ROY,
311173199,00010,31117319900010,O,,,,,,true,1,,,,,RTE DE CABARA VI BICHTA ED,33420,BRANNE,,,33071,,,,,,,,,,,,,,,,,,,1984-12-25,F,,,,,84.10,NAP,N,,,0,,,,,,
312195050,00017,31219505000017,O,,,,,,true,1,,,,,,33420,BRANNE,,,33071,,,,,,,,,,,,,,,,,,,1984-12-25,F,,,,,58.12,NAP,N,,,0,,,,,,
312488398,00016,31248839800016,O,1978-01-01,NN,,,2017-09-26T07:22:09,true,5,,38,,RUE,DU FORT BAYARD,33420,BRANNE,,,33071,,,,,,,,,,,,,,,,,,,2017-01-01,A,,,,,01.21Z,NAFRev2,N,-0.184089,44.825553,0.95,housenumber,38 Rue du Fort Bayard 33420 Branne,33071_0020_00038,G,38 RUE DU FORT BAYARD,
312509797,00030,31250979700030,O,,NN,,,,true,1,,,,,LE GUSPIT,33420,BRANNE,,,33071,,,,,,,,,,,,,,,,,,,,F,,,,,77.10,NAP,N,-0.180595,44.829158,0.93,street,Lieu Dit le Guspit 33420 Branne,33071_g75lpd,G,LIEU DIT LE GUSPIT,
312630759,00016,31263075900016,O,,,,,,true,1,,21,,RUE,MATEAU,33420,BRANNE,,,33071,,,,,,,,,,,,,,,,,,,1990-06-11,F,,,,,57.08,NAP,N,-0.187949,44.831455,0.95,housenumber,21 Rue Mateau 33420 Branne,33071_0047_00021,G,21 RUE MATEAU,
312633605,00018,31263360500018,O,,,,,,true,1,,,,RUE,FORT BAYARD,33420,BRANNE,,,33071,,,,,,,,,,,,,,,,,,,1984-12-25,F,,,,,65.02,NAP,N,-0.184377,44.826644,0.89,street,Rue du Fort Bayard 33420 Branne,33071_0020,G,RUE DU FORT BAYARD,
313356917,00044,31335691700044,O,1991-07-03,NN,,,2006-10-27T00:38:12,false,3,,3,,RTE,DE CABARRA,33420,BRANNE,,,33071,,,,,,,,,,,,,,,,,,,2006-06-01,F,,,,,85.1G,NAFRev1,N,-0.185462,44.831617,0.74,housenumber,3 Route de Cabara 33420 Branne,33071_0005_00003,G,3 ROUTE DE CABARA,
313356917,00051,31335691700051,O,2006-06-01,,,,2016-07-27T08:21:36,true,3,,3,B,RUE,DU 8 MAI 1945,33420,BRANNE,,,33071,,,,,,,,,,,,,,,,,,,2016-03-31,F,,,,,86.90D,NAFRev2,N,-0.186981,44.829271,0.77,housenumber,3bis Avenue du 8 Mai 1945 33420 Branne,33071_0030_00003_bis,G,3BIS AVENUE DU 8 MAI 1945,
313388076,00017,31338807600017,O,1978-01-01,00,2019,,2021-10-27T08:18:27,true,4,,6,,RUE,DU PUITS ARTESIEN,33420,BRANNE,,,33071,,,,,,,,,,,,,,,,,,,2008-01-01,A,,,,,82.19Z,NAFRev2,O,-0.186269,44.828894,0.95,housenumber,6 Rue du Puits Artésien 33420 Branne,33071_0056_00006,G,6 RUE DU PUITS ARTESIEN,
313981771,00014,31398177100014,O,1991-10-22,,,,2008-11-07T00:29:14,true,4,,,,LD,LAGUT,33420,BRANNE,,,33071,,,,,,,,,,,,,,,,,,,2005-06-30,F,,,,,45.2J,NAFRev1,N,-0.17688,44.827992,0.92,street,Lieu Dit Lagut 33420 Branne,33071_trcf4e,G,LIEU DIT LAGUT,
315371641,00012,31537164100012,O,1979-01-01,NN,,,2006-11-25T09:36:27,true,3,,4,,RUE,DE L HOTEL DE VILLE,33420,BRANNE,,,33071,,,,,,,,,,,,,,,,,,,2004-07-08,F,,,,,85.1E,NAFRev1,N,-0.186212,44.830355,0.48,housenumber,4 Rue de l’Eglise 33420 Branne,33071_0016_00004,G,4 RUE DE L EGLISE,
316191956,00036,31619195600036,O,1987-04-01,NN,,,2008-11-07T00:31:44,false,4,,,,DOM,DE L'EVANGILE,33420,BRANNE,,,33071,,,,,,,,,,,,,,,,,,,1998-01-01,F,,,,,45.4A,NAF1993,N,-0.184056,44.82182,0.75,street,Chemin de l’Evangile 33420 Branne,33071_0019,G,CHEMIN DE L EVANGILE,
316272830,00019,31627283000019,O,1979-01-01,NN,,4932ZA,2015-11-03T05:31:37,true,6,,31,,RTE,DE CABARA,33420,BRANNE,,,33071,,,,,,,,,,,,,,,,,,,2008-01-01,F,,,,,49.32Z,NAFRev2,N,-0.178978,44.832234,0.85,housenumber,31 Route de Cabara 33420 Branne,33071_0005_00031,G,31 ROUTE DE CABARA,
316514702,00018,31651470200018,O,,NN,,,,true,1,,,,LD,LA TUILIERE,33420,BRANNE,,,33071,,,,,,,,,,,,,,,,,,,,F,,,,,55.73,NAP,N,-0.182243,44.825541,0.35,street,Chemin de la Tannerie 33420 Branne,33071_2y19o7,G,CHEMIN DE LA TANNERIE,
316850411,00018,31685041100018,O,,,,,,true,1,,,,,,33420,BRANNE,,,33071,,,,,,,,,,,,,,,,,,,1985-12-25,F,,,,,64.12,NAP,N,,,0,,,,,,
317103950,00018,31710395000018,O,,NN,,,,true,1,,,,,,33420,BRANNE,,,33071,,,,,,,,,,,,,,,,,,,1987-07-15,F,,,,,82.05,NAP,N,,,0,,,,,,
317337145,00039,31733714500039,O,1990-12-01,NN,,,2008-11-07T00:32:56,false,4,,17,,RUE,FORT BAYARD,33420,BRANNE,,,33071,,,,,,,,,,,,,,,,,,,2003-07-10,F,,,,,52.4L,NAFRev1,N,-0.184804,44.827657,0.9,housenumber,17 Rue du Fort Bayard 33420 Branne,33071_0020_00017,G,17 RUE DU FORT BAYARD,
317337145,00047,31733714500047,O,2003-07-10,NN,,,2014-07-08T00:21:02,true,4,,14,,CHE,DE LAGUT,33420,BRANNE,,,33071,,,,,,,,,,,,,,,,,,,2009-07-31,F,,,,,47.54Z,NAFRev2,N,-0.180571,44.827414,0.83,housenumber,14 Chemin de la Lagut 33420 Branne,33071_93u2pu_00014,G,14 CHEMIN DE LA LAGUT,
317828028,00017,31782802800017,O,1980-01-01,,,,,true,1,,,,RUE,FORT BAYARD,33420,BRANNE,,,33071,,,,,,,,,,,,,,,,,,,2000-12-31,F,,,,,50.5Z,NAF1993,N,-0.184377,44.826644,0.89,street,Rue du Fort Bayard 33420 Branne,33071_0020,G,RUE DU FORT BAYARD,
318171774,00017,31817177400017,O,,NN,,,,true,1,,14,,RUE,MATEAU,33420,BRANNE,,,33071,,,,,,,,,,,,,,,,,,,1987-12-25,F,,,,,77.09,NAP,N,-0.187742,44.831367,0.95,housenumber,14 Rue Mateau 33420 Branne,33071_0047_00014,G,14 RUE MATEAU,
318187028,00010,31818702800010,O,,NN,,,,true,1,,9,,RUE,DUBOIS,33420,BRANNE,,,33071,,,,,,,,,,,,,,,,,,,,F,,,,,55.10,NAP,N,-0.187765,44.829751,0.95,housenumber,9 Rue Dubois 33420 Branne,33071_0010_00009,G,9 RUE DUBOIS,
318315660,00023,31831566000023,O,1984-02-23,NN,,,2008-01-04T20:59:29,true,3,,,,LD,LA TANNERIE,33420,BRANNE,,,33071,,,,,,,,,,,,,,,,,,,2008-01-01,A,,,,,73.11Z,NAFRev2,N,-0.18019,44.82212,0.95,street,La Tannerie 33420 Branne,33071_hovcdz,G,LA TANNERIE,
319348660,00014,31934866000014,O,,NN,,,,true,1,,,,LD,LA TUILIERE,33420,BRANNE,,,33071,,,,,,,,,,,,,,,,,,,,F,,,,,00.10,NAP,N,-0.182243,44.825541,0.35,street,Chemin de la Tannerie 33420 Branne,33071_2y19o7,G,CHEMIN DE LA TANNERIE,
319511242,00038,31951124200038,O,1990-12-21,NN,,,2014-11-27T08:35:27,true,4,,3,,CHE,DE L EEVANGILE,33420,BRANNE,,,33071,,,,,,,,,,,,,,,,,,,2014-12-31,F,,,,,86.90D,NAFRev2,N,-0.185859,44.827646,0.78,housenumber,3 Chemin de l’Evangile 33420 Branne,33071_0019_00003,G,3 CHEMIN DE L EVANGILE,
319914222,00017,31991422200017,O,1980-09-29,NN,,,,true,4,,16,,RUE,MATEAU,33420,BRANNE,,,33071,,,,,,,,,,,,,,,,,,,1992-05-08,F,,,,,51.3J,NAF1993,N,-0.187955,44.831412,0.95,housenumber,16 Rue Mateau 33420 Branne,33071_0047_00016,G,16 RUE MATEAU,
320035181,00058,32003518100058,O,2011-09-01,,,,2020-10-10T08:31:51,true,2,,8,,PL,DE L'EGLISE,33420,BRANNE,,,33071,,,,,,,,,,,,,,,,,,,2020-09-30,F,,,,,47.91B,NAFRev2,N,-0.18565,44.830594,0.84,housenumber,8 Place de l’Eglise 33420 Branne,33071_0015_00008,G,8 PLACE DE L EGLISE,
321191355,00031,32119135500031,O,1984-10-29,11,2019,,2021-10-27T08:22:10,true,4,,2,,RUE,EMMANUEL ROY,33420,BRANNE,,BP45,33071,,,,,,,,,,,,,,,,,,,2008-01-01,A,,,,,69.20Z,NAFRev2,O,-0.18602,44.83132,0.96,housenumber,2 Rue Emmanuel Roy 33420 Branne,33071_0018_00002,G,2 RUE EMMANUEL ROY,
322577529,00017,32257752900017,O,,NN,,,,true,1,,,,,TOUR MINVIELLE,33420,BRANNE,,,33071,,,,,,,,,,,,,,,,,,,,F,,,,,41.09,NAP,N,,,0,,,,,,
322577537,00010,32257753700010,O,,,,,,true,1,,21,,RUE,MATEAU,33420,BRANNE,,,33071,,,,,,,,,,,,,,,,,,,1990-12-17,F,,,,,57.08,NAP,N,-0.187949,44.831455,0.95,housenumber,21 Rue Mateau 33420 Branne,33071_0047_00021,G,21 RUE MATEAU,
322680844,00022,32268084400022,O,1985-01-01,NN,,,2014-07-08T00:27:10,true,6,,,,LD,GARON,33420,BRANNE,,,33071,,,,,,,,,,,,,,,,,,,2011-08-31,F,,,,,43.99C,NAFRev2,O,-0.176262,44.831441,0.95,street,Garon 33420 Branne,33071_7lnkpq,G,GARON,
322818873,00018,32281887300018,O,,,,,,true,1,,,,,LES PLACES,33420,BRANNE,,,33071,,,,,,,,,,,,,,,,,,,1984-12-25,F,,,,,55.60,NAP,N,-0.182714,44.824552,0.95,street,Les Places 33420 Branne,33071_invzkt,G,LES PLACES,
323315572,00012,32331557200012,O,,NN,,,,true,1,,10,,RUE,DU FORT BAYARD,33420,BRANNE,,,33071,,,,,,,,,,,,,,,,,,,1994-12-31,F,,,,,70.2B,NAF1993,N,-0.185151,44.828641,0.95,housenumber,10 Rue du Fort Bayard 33420 Branne,33071_0020_00010,G,10 RUE DU FORT BAYARD,
323361683,00010,32336168300010,O,,NN,,,,true,1,,,,,LE GUSPIT,33420,BRANNE,,,33071,,,,,,,,,,,,,,,,,,,,F,,,,,77.02,NAP,N,-0.180595,44.829158,0.93,street,Lieu Dit le Guspit 33420 Branne,33071_g75lpd,G,LIEU DIT LE GUSPIT,
323725960,00013,32372596000013,O,,,,,,true,1,,74,,RUE,EMMANUEL ROY,33420,BRANNE,,,33071,,,,,,,,,,,,,,,,,,,1984-12-25,F,,,,,59.09,NAP,N,-0.188033,44.829078,0.96,housenumber,74 Rue Emmanuel Roy 33420 Branne,33071_0018_00074,G,74 RUE EMMANUEL ROY,
324054253,00046,32405425300046,O,1996-10-01,NN,,,2008-01-04T18:52:54,true,3,,2,,RUE,EMMANUEL ROY,33420,BRANNE,,,33071,,,,,,,,,,,,,,,,,,,2008-01-01,A,,,,,69.20Z,NAFRev2,N,-0.18602,44.83132,0.96,housenumber,2 Rue Emmanuel Roy 33420 Branne,33071_0018_00002,G,2 RUE EMMANUEL ROY,