siren,nic,siret,statutDiffusionEtablissement,dateCreationEtablissement,trancheEffectifsEtablissement,anneeEffectifsEtablissement,activitePrincipaleRegistreMetiersEtablissement,dateDernierTraitementEtablissement,etablissementSiege,nombrePeriodesEtablissement,complementAdresseEtablissement,numeroVoieEtablissement,indiceRepetitionEtablissement,typeVoieEtablissement,libelleVoieEtablissement,codePostalEtablissement,libelleCommuneEtablissement,libelleCommuneEtrangerEtablissement,distributionSpecialeEtablissement,codeCommuneEtablissement,codeCedexEtablissement,libelleCedexEtablissement,codePaysEtrangerEtablissement,libellePaysEtrangerEtablissement,complementAdresse2Etablissement,numeroVoie2Etablissement,indiceRepetition2Etablissement,typeVoie2Etablissement,libelleVoie2Etablissement,codePostal2Etablissement,libelleCommune2Etablissement,libelleCommuneEtranger2Etablissement,distributionSpeciale2Etablissement,codeCommune2Etablissement,codeCedex2Etablissement,libelleCedex2Etablissement,codePaysEtranger2Etablissement,libellePaysEtranger2Etablissement,dateDebut,etatAdministratifEtablissement,enseigne1Etablissement,enseigne2Etablissement,enseigne3Etablissement,denominationUsuelleEtablissement,activitePrincipaleEtablissement,nomenclatureActivitePrincipaleEtablissement,caractereEmployeurEtablissement,longitude,latitude,geo_score,geo_type,geo_adresse,geo_id,geo_ligne,geo_l4,geo_l5
200024651,00016,20002465100016,O,2010-03-10,,,,2021-02-02T03:43:27,true,2,MAIRIE,232,,PL,DES PLATANES,40110,ONESSE-LAHARIE,,,40210,,,,,,,,,,,,,,,,,,,2021-02-01,F,,,,,36.00Z,NAFRev2,N,-1.070244,44.062487,0.85,housenumber,232 Place des Platanes 40110 Onesse-Laharie,40210_0235_00232,G,232 PLACE DES PLATANES,
214002107,00016,21400210700016,O,1983-03-01,11,2019,,2021-10-27T08:08:18,true,4,,232,,PL,DES PLATANES,40110,ONESSE-LAHARIE,,,40210,,,,,,,,,,,,,,,,,,,2008-01-01,A,MAIRIE,,,,84.11Z,NAFRev2,O,-1.070244,44.062487,0.85,housenumber,232 Place des Platanes 40110 Onesse-Laharie,40210_0235_00232,G,232 PLACE DES PLATANES,
214002107,00024,21400210700024,O,1983-12-21,01,2019,,2021-10-27T08:08:18,false,4,,160,,RUE,LOUS TUCS,40110,ONESSE-LAHARIE,,,40210,,,,,,,,,,,,,,,,,,,2009-09-01,A,ECOLE PRIMAIRE PUBLIQUE,,,,85.20Z,NAFRev2,N,-1.071642,44.064973,0.94,housenumber,160 Rue Lous Tucs 40110 Onesse-Laharie,40210_0190_00160,G,160 RUE LOUS TUCS,
214002107,00057,21400210700057,O,1990-09-01,01,2019,,2021-10-27T08:08:18,false,3,,22,,ALL,DU MEUNIER,40110,ONESSE-LAHARIE,,,40210,,,,,,,,,,,,,,,,,,,2008-01-01,A,ECOLE ELEMENTAIRE PUBLIQUE,,,,85.20Z,NAFRev2,N,-1.068532,44.063404,0.85,housenumber,22 Allée du Meunier 40110 Onesse-Laharie,40210_0200_00022,G,22 ALLEE DU MEUNIER,
214002107,00065,21400210700065,O,1997-01-01,NN,,,2021-01-26T08:39:34,false,4,MAIRIE,232,,PL,DES PLATANES,40110,ONESSE-LAHARIE,,,40210,,,,,,,,,,,,,,,,,,,2020-12-31,F,SERVICE DES EAUX,,,,36.00Z,NAFRev2,N,-1.070244,44.062487,0.85,housenumber,232 Place des Platanes 40110 Onesse-Laharie,40210_0235_00232,G,232 PLACE DES PLATANES,
214002107,00073,21400210700073,O,1967-05-01,NN,,,2008-01-04T18:33:18,false,3,AU BOURG,259,,RTE,DE MIMIZAN,40110,ONESSE-LAHARIE,,,40210,,,,,,,,,,,,,,,,,,,2008-01-01,A,CAMPING MUNICIPAL BIENVENU,,,,55.30Z,NAFRev2,N,-1.071536,44.062572,0.86,housenumber,259 Route de Mimizan 40110 Onesse-Laharie,40210_0040_00259,G,259 ROUTE DE MIMIZAN,
214002107,00081,21400210700081,O,2004-03-26,NN,,,2008-01-04T18:33:18,false,3,,232,,PL,DES PLATANES,40110,ONESSE-LAHARIE,,,40210,,,,,,,,,,,,,,,,,,,2008-01-01,A,LOTISSEMENT LES VIOLETTES,,,,42.99Z,NAFRev2,N,-1.070244,44.062487,0.85,housenumber,232 Place des Platanes 40110 Onesse-Laharie,40210_0235_00232,G,232 PLACE DES PLATANES,
214002107,00115,21400210700115,O,2015-09-01,01,2019,,2021-10-27T08:08:18,false,2,,130,,RUE,LOUS TUCS,40110,ONESSE-LAHARIE,,,40210,,,,,,,,,,,,,,,,,,,2017-01-15,A,RESTAURATION SCOLAIRE,,,,56.29B,NAFRev2,O,-1.071812,44.064875,0.76,street,Rue Lous Tucs 40110 Onesse-Laharie,40210_0190,G,RUE LOUS TUCS,
264002072,00017,26400207200017,O,1983-03-01,NN,,,2010-06-26T03:09:31,true,3,,,,,,40110,ONESSE-LAHARIE,,,40210,,,,,,,,,,,,,,,,,,,2008-01-01,A,CCAS,,,,88.99B,NAFRev2,N,,,0,,,,,,
264002072,00025,26400207200025,O,1985-03-20,NN,,,2010-06-26T03:09:31,false,4,,,,,MAIRIE ADMR,40110,ONESSE-LAHARIE,,,40210,,,,,,,,,,,,,,,,,,,2003-09-19,F,SERV AIDE A DOMI PERS AGEES,,,,85.3K,NAFRev1,O,-1.00227,44.047808,0.33,street,Route de Mont de Marsan 40110 Onesse-Laharie,40210_0215,G,ROUTE DE MONT DE MARSAN,
294001409,00019,29400140900019,O,1995-12-25,,,,2008-01-04T19:06:41,true,2,,,,,MAIRIE,40110,ONESSE-LAHARIE,,,40210,,,,,,,,,,,,,,,,,,,2008-01-01,A,,,,,42.99Z,NAFRev2,N,-1.00227,44.047808,0.51,street,Route de Mont de Marsan 40110 Onesse-Laharie,40210_0215,G,ROUTE DE MONT DE MARSAN,
300908407,00012,30090840700012,O,,NN,,,,true,1,,37,,LOT,COMMUNAL,40110,ONESSE-LAHARIE,,,40210,,,,,,,,,,,,,,,,,,,1990-06-30,F,,,,,69.12,NAP,N,0.5200385,44.378885,0.82,poi.community_centre,(Salle des fêtes) Le Temple-sur-Lot,https://osm.org/way/319529214,G,,
305148546,00016,30514854600016,O,1976-01-01,02,2019,4321AB,2021-10-27T08:15:28,true,4,,834,,RTE,DE MIMIZAN,40110,ONESSE-LAHARIE,,,40210,,,,,,,,,,,,,,,,,,,2008-01-01,A,,,,,43.21A,NAFRev2,O,-1.07573,44.067711,0.86,housenumber,834 Route de Mimizan 40110 Onesse-Laharie,40210_0040_00834,G,834 ROUTE DE MIMIZAN,
305364622,00020,30536462200020,O,1980-08-01,NN,,,2021-09-21T03:40:03,true,4,,2809,,RTE,DE LAHARIE,40110,ONESSE-LAHARIE,,,40210,,,,,,,,,,,,,,,,,,,2002-12-31,F,,,,,14.3Z,NAF1993,O,-1.036934,44.056409,0.86,housenumber,2809 Route de Laharie 40110 Onesse-Laharie,40210_0160_02809,G,2809 ROUTE DE LAHARIE,
305775603,00031,30577560300031,O,1993-01-01,NN,,,,false,4,,17,,LOT,LAVIOLE,40110,ONESSE-LAHARIE,,,40210,,,,,,,,,,,,,,,,,,,1998-06-30,F,,,,,74.1C,NAF1993,N,-1.067036,44.068637,0.45,street,Rue Laviolle 40110 Onesse-Laharie,40210_0170,G,RUE LAVIOLLE,
306109695,00024,30610969500024,O,2017-06-01,,,,2017-06-21T07:23:43,true,1,,,,LD,VILLEFRANQUE,40110,ONESSE-LAHARIE,,,40210,,,,,,,,,,,,,,,,,,,2017-06-01,A,,,,,02.10Z,NAFRev2,N,-1.4541651,43.4360419,0.9,poi.park,(Parc) Villefranque,https://osm.org/way/476042859,G,,
306354325,00012,30635432500012,O,,NN,,,,true,1,,,,,,40110,ONESSE-LAHARIE,,,40210,,,,,,,,,,,,,,,,,,,1996-06-30,F,,,,,45.2L,NAF1993,O,,,0,,,,,,
308072974,00014,30807297400014,O,1900-01-01,NN,,,2008-11-07T00:23:17,false,4,,3,,RUE,DE LA GARE,40110,ONESSE-LAHARIE,,,40210,,,,,,,,,,,,,,,,,,,1999-12-31,F,,,,,93.0D,NAF1993,O,-1.070185,44.060283,0.85,street,Rue de la Gare 40110 Onesse-Laharie,40210_0130,G,RUE DE LA GARE,
308530435,00012,30853043500012,O,1976-01-01,NN,,,2008-06-13T04:59:22,true,4,,,,,,40110,ONESSE-LAHARIE,,,40210,,,,,,,,,,,,,,,,,,,2003-12-31,F,,,,,52.1B,NAFRev1,O,,,0,,,,,,
308825835,00025,30882583500025,O,1987-01-15,NN,,,2018-09-29T12:12:17,false,4,,178,,RTE,DE LAS YAOUGUES,40110,ONESSE-LAHARIE,,,40210,,,,,,,,,,,,,,,,,,,2017-10-01,F,,,,,86.90E,NAFRev2,O,-1.06712,44.06529,0.74,housenumber,178 Rue Las Yaougues 40110 Onesse-Laharie,40210_0165_00178,G,178 RUE LAS YAOUGUES,
308825835,00033,30882583500033,O,2017-10-01,,,,2018-02-09T12:06:40,true,2,,366,,RTE,DU CAILLAOU,40110,ONESSE-LAHARIE,,,40210,,,,,,,,,,,,,,,,,,,2017-11-20,F,,,,,86.90E,NAFRev2,O,-1.071792,44.055234,0.86,housenumber,366 Route du Caillaou 40110 Onesse-Laharie,40210_0075_00366,G,366 ROUTE DU CAILLAOU,
310270194,00015,31027019400015,O,,NN,,,,true,1,,,,,CHEZ MME VVE GABRIEL,40110,ONESSE-LAHARIE,,,40210,,,,,,,,,,,,,,,,,,,1988-05-18,F,,,,,65.02,NAP,N,,,0,,,,,,
311020705,00019,31102070500019,O,1977-01-01,02,2019,,2021-10-27T08:17:27,true,5,,,,,,40110,ONESSE-LAHARIE,,,40210,,,,,,,,,,,,,,,,,,,2012-12-31,A,,,,,01.11Z,NAFRev2,O,,,0,,,,,,
311020705,00027,31102070500027,O,2010-12-01,,,,2013-05-30T16:19:59,false,1,,6970,,RTE,DE L ESTATJAOU,40110,ONESSE-LAHARIE,,,40210,,,,,,,,,,,,,,,,,,,2010-12-01,A,,,,,52.10B,NAFRev2,N,,,0,,,,,,
311352900,00014,31135290000014,O,1900-01-01,NN,,,2015-06-18T10:48:14,true,4,,,,,,40110,ONESSE-LAHARIE,,,40210,,,,,,,,,,,,,,,,,,,2015-06-16,A,,,,,02.10Z,NAFRev2,N,,,0,,,,,,
311352900,00022,31135290000022,O,1991-01-01,NN,,,2008-01-04T20:07:09,false,3,,,,,CHANTE CAILLE,40110,ONESSE-LAHARIE,,,40210,,,,,,,,,,,,,,,,,,,2008-01-01,A,,,,,68.20B,NAFRev2,N,4.6849063,45.2762483,0.89,poi,Chemin de Chante-Caille (Pont) Saint-Clair,https://osm.org/way/40803112,G,,
311455497,00017,31145549700017,O,1900-01-01,01,2018,,2020-08-25T10:24:57,true,5,,181,,RTE,DE LA POSTE,40110,ONESSE-LAHARIE,,,40210,,,,,,,,,,,,,,,,,,,2016-12-31,A,,,,,71.11Z,NAFRev2,N,-1.069049,44.057403,0.86,housenumber,181 Route de la Poste 40110 Onesse-Laharie,40210_0245_00181,G,181 ROUTE DE LA POSTE,
312356082,00015,31235608200015,O,1965-01-01,01,2019,4399CZ,2021-10-27T08:18:03,true,4,,353,,RTE,DE MIMIZAN,40110,ONESSE-LAHARIE,,,40210,,,,,,,,,,,,,,,,,,,2008-01-01,A,,,,,43.99C,NAFRev2,O,-1.072903,44.063735,0.86,housenumber,353 Route de Mimizan 40110 Onesse-Laharie,40210_0040_00353,G,353 ROUTE DE MIMIZAN,
314274473,00011,31427447300011,O,,,,,,true,1,,,,,SAUBADON,40110,ONESSE-LAHARIE,,,40210,,,,,,,,,,,,,,,,,,,1985-12-25,F,,,,,57.08,NAP,N,-1.015286,44.087857,0.92,street,Chemin de Saubadon 40110 Onesse-Laharie,40210_0260,G,CHEMIN DE SAUBADON,
315182071,00011,31518207100011,O,1979-01-01,,,,2014-07-08T00:19:10,false,5,,,,RTE,D ESCOURCE,40110,ONESSE-LAHARIE,,,40210,,,,,,,,,,,,,,,,,,,2010-04-21,F,,,,,96.02A,NAFRev2,N,-1.0947543,44.2321019,0.78,poi,Route d'Escource (Pont) Pontenx-les-Forges,https://osm.org/way/300425854,G,,
315182071,00029,31518207100029,O,2010-04-21,,,9602AA,2020-12-09T08:46:22,true,2,,20,,RTE,DE LESBORDES,40110,ONESSE-LAHARIE,,,40210,,,,,,,,,,,,,,,,,,,2020-12-31,F,,,,,96.02A,NAFRev2,N,-1.064286,44.068207,0.86,housenumber,20 Route de Lesbordes 40110 Onesse-Laharie,40210_0180_00020,G,20 ROUTE DE LESBORDES,
315254656,00079,31525465600079,O,1988-01-25,,,,2009-09-30T20:03:03,false,4,,,,,,40110,ONESSE-LAHARIE,,,40210,,,,,,,,,,,,,,,,,,,2003-05-27,F,,,,,52.2C,NAFRev1,N,,,0,,,,,,
315569095,00013,31556909500013,O,,,,,,true,1,,,,,,40110,ONESSE-LAHARIE,,,40210,,,,,,,,,,,,,,,,,,,1991-10-30,F,,,,,55.73,NAP,N,,,0,,,,,,
315850826,00027,31585082600027,O,1994-01-01,NN,,,2008-12-11T10:44:01,false,4,,,,,LA GARE,40110,ONESSE-LAHARIE,,,40210,,,,,,,,,,,,,,,,,,,2008-12-31,F,,,,,68.20B,NAFRev2,N,-1.070422,44.057624,0.94,street,La Gare 40110 Onesse-Laharie,40210_7dksj0,G,LA GARE,
315850826,00035,31585082600035,O,2008-01-01,,,,2021-02-23T10:41:28,true,1,,5693,,RTE,DE LESTATGEOU,40110,ONESSE-LAHARIE,,,40210,,,,,,,,,,,,,,,,,,,2008-01-01,A,,,,,02.20Z,NAFRev2,N,-1.069283,44.068107,0.59,street,Route de Lestatgeaou 40110 Onesse-Laharie,40210_0185,G,ROUTE DE LESTATGEAOU,
316069152,00015,31606915200015,O,1979-01-01,,,,2016-01-12T00:11:06,true,3,,,,LD,LA SEBKRA,40110,ONESSE-LAHARIE,,,40210,,,,,,,,,,,,,,,,,,,2008-01-01,A,,,,,01.46Z,NAFRev2,N,-1.066994,44.055874,0.3,street,Route de la Poste 40110 Onesse-Laharie,40210_0245,G,ROUTE DE LA POSTE,
316157791,00013,31615779100013,O,,NN,,,,true,1,,,,,,40110,ONESSE-LAHARIE,,,40210,,,,,,,,,,,,,,,,,,,1988-12-25,F,,,,,69.12,NAP,N,,,0,,,,,,
316637909,00037,31663790900037,O,1992-10-01,NN,,,,false,4,,,,,LA GARE,40110,ONESSE-LAHARIE,,,40210,,,,,,,,,,,,,,,,,,,1997-12-31,F,,,,,60.2P,NAF1993,O,-1.070422,44.057624,0.94,street,La Gare 40110 Onesse-Laharie,40210_7dksj0,G,LA GARE,
316637909,00045,31663790900045,O,1997-01-01,NN,,,,false,4,,,,,PINAOUT,40110,ONESSE-LAHARIE,,,40210,,,,,,,,,,,,,,,,,,,1999-05-31,F,DOLHATS MACHINE,,,,60.2P,NAF1993,O,-1.071318,44.056717,0.35,street,Route du Caillaou 40110 Onesse-Laharie,40210_0075,G,ROUTE DU CAILLAOU,
317238145,00013,31723814500013,O,1970-01-01,NN,,,2008-11-07T00:32:46,true,4,,965,,CHE,CAPCOS,40110,ONESSE-LAHARIE,,,40210,,,,,,,,,,,,,,,,,,,2001-06-30,F,,,,,50.5Z,NAF1993,O,-1.01735,44.022092,0.81,housenumber,965 Chemin du Capcos 40110 Onesse-Laharie,40210_0085_00965,G,965 CHEMIN DU CAPCOS,
317570190,00015,31757019000015,O,1979-01-01,NN,,,,true,1,,600,,CHE,DE JUPON,40110,ONESSE-LAHARIE,,,40210,,,,,,,,,,,,,,,,,,,1999-12-31,F,,,,,02.0B,NAF1993,N,-1.08067,44.063892,0.84,housenumber,600 Chemin de Jupon 40110 Onesse-Laharie,40210_0155_00600,G,600 CHEMIN DE JUPON,
317714418,00041,31771441800041,O,1995-05-16,,,,2008-01-04T20:54:59,true,4,,,,RES,ATLANTIC VILLAGE,40110,ONESSE-LAHARIE,,,40210,,,,,,,,,,,,,,,,,,,2008-01-01,A,,,,,68.31Z,NAFRev2,N,,,0,,,,,,
318686417,00011,31868641700011,O,1980-01-01,NN,,,2018-04-05T14:01:45,true,3,,,,,MALAGA,40110,ONESSE-LAHARIE,,,40210,,,,,,,,,,,,,,,,,,,2008-01-01,A,,,,,68.20B,NAFRev2,N,-0.998623,44.089468,0.94,street,Malaga 40110 Onesse-Laharie,40210_nw6n8j,G,MALAGA,
318964400,00077,31896440000077,O,2006-05-01,NN,,,2009-06-27T04:15:15,false,4,,680,,RTE,DE MONT DE MARSAN,40110,ONESSE-LAHARIE,,,40210,,,,,,,,,,,,,,,,,,,2008-01-01,F,,,,,16.23Z,NAFRev2,N,-0.998831,44.046557,0.87,housenumber,680 Route de Mont de Marsan 40110 Onesse-Laharie,40210_0215_00680,G,680 ROUTE DE MONT DE MARSAN,
319260964,00030,31926096400030,O,2014-03-17,,,,2021-02-23T10:43:37,true,3,,79,,RUE,DES GRIVES,40110,ONESSE-LAHARIE,,,40210,,,,,,,,,,,,,,,,,,,2016-04-27,A,,,,,47.82Z,NAFRev2,N,-1.064563,44.069104,0.94,housenumber,79 Rue des Grives 40110 Onesse-Laharie,40210_0140_00079,G,79 RUE DES GRIVES,
320751530,00017,32075153000017,O,1981-01-05,NN,,,,false,4,QUARTIER MONTAUT,1599,,RTE,DE LA POSTE,40110,ONESSE-LAHARIE,,,40210,,,,,,,,,,,,,,,,,,,2002-12-31,F,,,,,55.2C,NAF1993,O,-1.052815,44.054955,0.86,housenumber,1599 Route de la Poste 40110 Onesse-Laharie,40210_0245_01599,G,1599 ROUTE DE LA POSTE,
321177206,00018,32117720600018,O,1981-01-01,02,2019,,2021-10-27T08:22:09,true,5,,6964,,RTE,DE LESTAJAOU,40110,ONESSE-LAHARIE,,,40210,,,,,,,,,,,,,,,,,,,2016-01-01,A,,,,,01.13Z,NAFRev2,O,-1.069604,44.068387,0.58,street,Route de Lestatjaou 40110 Onesse-Laharie,40210_idqg9w,G,ROUTE DE LESTATJAOU,
322577990,00011,32257799000011,O,1981-07-01,NN,,,2009-05-27T05:12:30,true,5,,87,,RTE,DE MIMIZAN,40110,ONESSE-LAHARIE,,,40210,,,,,,,,,,,,,,,,,,,2005-09-30,F,,,,,15.1E,NAFRev1,N,-1.070677,44.061901,0.85,housenumber,87 Route de Mimizan 40110 Onesse-Laharie,40210_0040_00087,G,87 ROUTE DE MIMIZAN,
322764242,00010,32276424200010,O,,NN,,,,true,1,,,,,AU BOURG,40110,ONESSE-LAHARIE,,,40210,,,,,,,,,,,,,,,,,,,1987-09-01,F,,,,,64.43,NAP,N,-1.069104,44.06171,0.66,street,Bourg 40110 Onesse-Laharie,40210_r1vjgv,G,BOURG,
324232164,00016,32423216400016,O,1982-01-05,NN,,,,true,3,,,,,,40110,ONESSE-LAHARIE,,,40210,,,,,,,,,,,,,,,,,,,1995-12-25,F,,,,,51.1G,NAF1993,N,,,0,,,,,,
324350487,00017,32435048700017,O,,NN,,,,true,1,,,,,CPG MUNICIPAL BIENVENUE,40110,ONESSE-LAHARIE,,,40210,,,,,,,,,,,,,,,,,,,1995-12-25,F,,,,,52.2C,NAF1993,N,,,0,,,,,,
324397512,00017,32439751200017,O,1982-04-20,NN,,,2020-01-24T09:06:32,true,3,,,,,LAHARIE,40110,ONESSE-LAHARIE,,,40210,,,,,,,,,,,,,,,,,,,2008-01-01,A,,,,,68.20A,NAFRev2,N,-1.068186,44.061061,0.93,street,Route de Laharie 40110 Onesse-Laharie,40210_0160,G,ROUTE DE LAHARIE,
325135291,00053,32513529100053,O,2013-04-01,NN,,,2021-02-23T10:47:46,true,1,,4963,,RTE,DE LA POSTE,40110,ONESSE-LAHARIE,,,40210,,,,,,,,,,,,,,,,,,,2013-04-01,A,,,,,47.81Z,NAFRev2,O,-1.018553,44.036693,0.86,housenumber,4963 Route de la Poste 40110 Onesse-Laharie,40210_0245_04963,G,4963 ROUTE DE LA POSTE,
325329787,00015,32532978700015,O,,NN,,,,true,1,,,,,LA GARE,40110,ONESSE-LAHARIE,,,40210,,,,,,,,,,,,,,,,,,,1988-12-31,F,,,,,55.50,NAP,N,-1.070422,44.057624,0.94,street,La Gare 40110 Onesse-Laharie,40210_7dksj0,G,LA GARE,
325449833,00012,32544983300012,O,1982-09-01,NN,,,,true,1,,,,,,40110,ONESSE-LAHARIE,,,40210,,,,,,,,,,,,,,,,,,,1998-01-31,F,,,,,55.1A,NAF1993,N,,,0,,,,,,
325915627,00013,32591562700013,O,,,,,,true,1,,,,,,40110,ONESSE-LAHARIE,,,40210,,,,,,,,,,,,,,,,,,,1984-12-25,F,,,,,37.04,NAP,N,,,0,,,,,,
325915635,00016,32591563500016,O,,,,,,true,1,,,,,,40110,ONESSE-LAHARIE,,,40210,,,,,,,,,,,,,,,,,,,1984-12-25,F,,,,,37.04,NAP,N,,,0,,,,,,
326187465,00017,32618746500017,O,,NN,,,,true,1,,,,,L HERMITAGE,40110,ONESSE-LAHARIE,,,40210,,,,,,,,,,,,,,,,,,,1989-12-25,F,,,,,77.03,NAP,N,6.0682888,45.0937183,0.9,poi.hotel,Hôtel L'Hermitage Huez,https://osm.org/way/30749427,G,,
326354974,00015,32635497400015,O,,,,,,true,1,,,,RTE,DU STADE,40110,ONESSE-LAHARIE,,,40210,,,,,,,,,,,,,,,,,,,1987-12-25,F,,,,,24.09,NAP,N,-1.071318,44.056717,0.39,street,Route du Caillaou 40110 Onesse-Laharie,40210_0075,G,ROUTE DU CAILLAOU,
326396520,00016,32639652000016,O,1982-07-01,NN,,,2008-11-07T00:43:46,true,4,,,,RTE,DE MIMIZAN,40110,ONESSE-LAHARIE,,,40210,,,,,,,,,,,,,,,,,,,2000-06-01,F,,,,,50.1Z,NAF1993,O,-1.070676,44.061901,0.83,street,Route de Mimizan 40110 Onesse-Laharie,40210_0040,G,ROUTE DE MIMIZAN,
328840202,00035,32884020200035,O,2002-07-08,NN,,,2019-09-11T11:41:08,false,4,,644,,CHE,DE COULIN,40110,ONESSE-LAHARIE,,,40210,,,,,,,,,,,,,,,,,,,2019-09-30,F,,,,,02.20Z,NAFRev2,N,-1.063743,44.039536,0.85,housenumber,644 Chemin de Coulin 40110 Onesse-Laharie,40210_0100_00644,G,644 CHEMIN DE COULIN,
328840202,00043,32884020200043,O,2012-08-24,,,,2016-01-22T09:06:46,false,2,,395,,RTE,DE BORDEAUX,40110,ONESSE-LAHARIE,,,40210,,,,,,,,,,,,,,,,,,,2016-01-01,F,,,,,02.20Z,NAFRev2,N,-1.004038,44.052239,0.86,housenumber,395 Route de Bordeaux 40110 Onesse-Laharie,40210_0065_00395,G,395 ROUTE DE BORDEAUX,
328840202,00050,32884020200050,O,2016-01-01,,,,2019-09-11T11:41:07,true,2,,341,,RTE,YEAN,40110,ONESSE-LAHARIE,,,40210,,,,,,,,,,,,,,,,,,,2019-09-30,F,,,,,02.40Z,NAFRev2,N,-1.061248,44.062768,0.8,housenumber,341 Route de Yean 40110 Onesse-Laharie,40210_0280_00341,G,341 ROUTE DE YEAN,
328973060,00010,32897306000010,O,1983-12-30,03,2019,4332AA,2021-10-27T08:26:57,true,4,,265,,RTE,DE CAILLAOU,40110,ONESSE-LAHARIE,,,40210,,,,,,,,,,,,,,,,,,,2008-01-01,A,,,,,43.32A,NAFRev2,O,-1.07154,44.056099,0.73,housenumber,265 Route du Caillaou 40110 Onesse-Laharie,40210_0075_00265,G,265 ROUTE DU CAILLAOU,
329570303,00019,32957030300019,O,1984-01-01,,,,,true,3,,,,,,40110,ONESSE-LAHARIE,,,40210,,,,,,,,,,,,,,,,,,,1992-12-25,F,,,,,45.4J,NAF1993,N,,,0,,,,,,
330259953,00033,33025995300033,O,1992-07-08,NN,,,,true,1,,,,,LOTISSEMENT LA GARE,40110,ONESSE-LAHARIE,,,40210,,,,,,,,,,,,,,,,,,,2002-09-30,F,,,,,02.0B,NAF1993,N,-1.070422,44.057624,0.45,street,La Gare 40110 Onesse-Laharie,40210_7dksj0,G,LA GARE,
331116228,00031,33111622800031,O,2013-06-01,,,,2016-05-09T14:22:50,true,1,,,,LD,PIGNON,40110,ONESSE-LAHARIE,,,40210,,,,,,,,,,,,,,,,,,,2013-06-01,A,,,,,02.10Z,NAFRev2,N,2.3170505,48.8884473,0.89,poi.pub,Pignon (Pub) Paris,https://osm.org/node/5118123275,G,,
331456137,00016,33145613700016,O,,,,,,true,1,,,,RTE,DE LESPERON,40110,ONESSE-LAHARIE,,,40210,,,,,,,,,,,,,,,,,,,1988-03-19,F,,,,,49.01,NAP,N,-1.063989,44.068663,0.5,street,Route de Lesbordes 40110 Onesse-Laharie,40210_0180,G,ROUTE DE LESBORDES,
331611285,00023,33161128500023,O,1999-12-02,,,,,true,3,,325,,RTE,DE LA POSTE,40110,ONESSE-LAHARIE,,,40210,,,,,,,,,,,,,,,,,,,2003-05-01,F,,,,,85.2Z,NAFRev1,N,-1.068151,44.056408,0.86,housenumber,325 Route de la Poste 40110 Onesse-Laharie,40210_0245_00325,G,325 ROUTE DE LA POSTE,
331965764,00011,33196576400011,O,1985-02-01,NN,,,2008-01-04T20:19:50,true,3,,,,,LE BOURDON,40110,ONESSE-LAHARIE,,,40210,,,,,,,,,,,,,,,,,,,2008-01-01,A,,,,,02.40Z,NAFRev2,N,-1.069104,44.06171,0.38,street,Bourg 40110 Onesse-Laharie,40210_r1vjgv,G,BOURG,
332044619,00010,33204461900010,O,1984-07-27,NN,,,2006-12-15T00:26:08,false,4,,35,,RTE,DE MIMIZAN,40110,ONESSE-LAHARIE,,,40210,,,,,,,,,,,,,,,,,,,1999-07-01,F,,,,,55.1A,NAF1993,N,-1.069893,44.061505,0.85,housenumber,35 Route de Mimizan 40110 Onesse-Laharie,40210_0040_00035,G,35 ROUTE DE MIMIZAN,
332044619,00044,33204461900044,O,2008-01-01,,,,2009-06-19T10:50:52,false,1,,37,,RTE,DE MIMIZAN,40110,ONESSE-LAHARIE,,,40210,,,,,,,,,,,,,,,,,,,2008-01-01,A,,,,,02.10Z,NAFRev2,N,-1.070676,44.061901,0.7,street,Route de Mimizan 40110 Onesse-Laharie,40210_0040,G,ROUTE DE MIMIZAN,
332326834,00014,33232683400014,O,,NN,,,,true,1,,,,,LOT COMMUNAL,40110,ONESSE-LAHARIE,,,40210,,,,,,,,,,,,,,,,,,,1989-04-13,F,,,,,02.20,NAP,N,0.5200385,44.378885,0.82,poi.community_centre,(Salle des fêtes) Le Temple-sur-Lot,https://osm.org/way/319529214,G,,
333289833,00019,33328983300019,O,1985-08-08,NN,,,,true,1,,,,LD,BEL AIR,40110,ONESSE-LAHARIE,,,40210,,,,,,,,,,,,,,,,,,,2002-09-01,F,,,,,02.0D,NAF1993,N,0.0764865,43.2227045,0.9,poi.park,Parc Bel-Air Tarbes,https://osm.org/way/240265561,G,,
333549012,00024,33354901200024,O,1997-01-01,NN,,,2016-01-12T00:12:08,true,3,ABEILLE,,,,,40110,ONESSE-LAHARIE,,,40210,,,,,,,,,,,,,,,,,,,2008-01-01,A,,,,,02.10Z,NAFRev2,N,-0.950653,44.113664,0.45,street,Route de Chantecaille 40110 Onesse-Laharie,40210_0090,D,ROUTE DE CHANTECAILLE,
335224630,00012,33522463000012,O,1985-01-01,NN,,,,true,1,,,,,LA ROSERAIE,40110,ONESSE-LAHARIE,,,40210,,,,,,,,,,,,,,,,,,,1999-08-31,F,,,,,02.0B,NAF1993,N,-1.066994,44.055874,0.42,street,Route de la Poste 40110 Onesse-Laharie,40210_0245,G,ROUTE DE LA POSTE,
335224648,00014,33522464800014,O,1986-01-01,NN,,,,true,1,,,,,LE BOURDON,40110,ONESSE-LAHARIE,,,40210,,,,,,,,,,,,,,,,,,,1989-04-30,F,,,,,02.0B,NAF1993,N,-1.069104,44.06171,0.38,street,Bourg 40110 Onesse-Laharie,40210_r1vjgv,G,BOURG,
337666390,00022,33766639000022,O,2004-02-21,NN,,,2018-01-09T12:07:50,true,4,,648,,RTE,DE LESTATJAOU,40110,ONESSE-LAHARIE,,,40210,,,,,,,,,,,,,,,,,,,2017-04-01,F,,,,,47.63Z,NAFRev2,N,-1.069741,44.069797,0.87,housenumber,648 Route de Lestatjaou 40110 Onesse-Laharie,40210_idqg9w_00648,G,648 ROUTE DE LESTATJAOU,
338253081,24321,33825308124321,O,2010-09-01,02,2019,,2021-10-27T08:31:50,false,1,EHPAD A NOSTE,52,,CHE,DU LAVOIR,40110,ONESSE-LAHARIE,,,40210,,,,,,,,,,,,,,,,,,,2010-09-01,A,,,,,56.29B,NAFRev2,O,-1.068288,44.061947,0.84,housenumber,52 Chemin du Lavoir 40110 Onesse-Laharie,40210_0175_00052,G,52 CHEMIN DU LAVOIR,
338915010,00023,33891501000023,O,2002-07-01,NN,,,,true,3,CAMPING MUNICIPAL,,,RTE,DE MIMIZAN,40110,ONESSE-LAHARIE,,,40210,,,,,,,,,,,,,,,,,,,2003-12-25,F,,,,,55.3B,NAFRev1,N,-1.070676,44.061901,0.83,street,Route de Mimizan 40110 Onesse-Laharie,40210_0040,G,ROUTE DE MIMIZAN,
339239386,00016,33923938600016,O,1983-07-07,NN,,,,true,1,,,,,,40110,ONESSE-LAHARIE,,,40210,,,,,,,,,,,,,,,,,,,1999-11-24,F,,,,,02.0D,NAF1993,N,,,0,,,,,,
339239501,00010,33923950100010,O,1983-07-01,NN,,,,true,1,,,,,,40110,ONESSE-LAHARIE,,,40210,,,,,,,,,,,,,,,,,,,2002-07-15,F,,,,,02.0D,NAF1993,N,,,0,,,,,,
339455222,00044,33945522200044,O,2011-07-18,,,,2021-02-23T10:55:42,true,1,,2674,,,ROUTE DE LA POSTE,40110,ONESSE-LAHARIE,,,40210,,,,,,,,,,,,,,,,,,,2011-07-18,A,,,,,46.19B,NAFRev2,N,-1.043611,44.046019,0.95,housenumber,2674 Route de la Poste 40110 Onesse-Laharie,40210_0245_02674,G,2674 ROUTE DE LA POSTE,
339522526,00021,33952252600021,O,,NN,,,,true,1,,7,,RTE,DE LEVIGNACQ,40110,ONESSE-LAHARIE,,,40210,,,,,,,,,,,,,,,,,,,1990-11-30,F,,,,,77.03,NAP,N,-1.069242,44.061451,0.43,housenumber,7 Route de Laharie 40110 Onesse-Laharie,40210_0160_00007,G,7 ROUTE DE LAHARIE,
340113737,00019,34011373700019,O,1900-01-01,NN,,,2011-04-28T00:32:17,false,3,,,,,,40110,ONESSE-LAHARIE,,,40210,,,,,,,,,,,,,,,,,,,1996-12-31,F,,,,,60.2E,NAF1993,N,,,0,,,,,,
340902840,00016,34090284000016,O,,NN,,,,true,1,,,,,MALLAGA,40110,ONESSE-LAHARIE,,,40210,,,,,,,,,,,,,,,,,,,1989-06-30,F,,,,,01.00,NAP,N,-0.998623,44.089468,0.71,street,Malaga 40110 Onesse-Laharie,40210_nw6n8j,G,MALAGA,
341194140,00016,34119414000016,O,,,,,,true,1,,,,RTE,DU STADE LA GARE,40110,ONESSE-LAHARIE,,,40210,,,,,,,,,,,,,,,,,,,1988-06-10,F,,,,,55.70,NAP,N,-1.070185,44.060283,0.54,street,Rue de la Gare 40110 Onesse-Laharie,40210_0130,G,RUE DE LA GARE,
342220548,00016,34222054800016,O,1987-01-01,NN,,,2016-01-12T00:12:43,true,3,,,,,,40110,ONESSE-LAHARIE,,,40210,,,,,,,,,,,,,,,,,,,2008-01-01,A,,,,,02.40Z,NAFRev2,N,,,0,,,,,,
342392172,00017,34239217200017,O,1987-09-01,NN,,,2015-08-20T09:44:05,false,10,,24,,RUE,DES ECOLES,40110,ONESSE-LAHARIE,,,40210,,,,,,,,,,,,,,,,,,,2015-06-30,F,,,,,47.26Z,NAFRev2,O,-1.069395,44.061638,0.95,housenumber,24 Rue des Ecoles 40110 Onesse-Laharie,40210_0105_00024,G,24 RUE DES ECOLES,