siren,nic,siret,statutDiffusionEtablissement,dateCreationEtablissement,trancheEffectifsEtablissement,anneeEffectifsEtablissement,activitePrincipaleRegistreMetiersEtablissement,dateDernierTraitementEtablissement,etablissementSiege,nombrePeriodesEtablissement,complementAdresseEtablissement,numeroVoieEtablissement,indiceRepetitionEtablissement,typeVoieEtablissement,libelleVoieEtablissement,codePostalEtablissement,libelleCommuneEtablissement,libelleCommuneEtrangerEtablissement,distributionSpecialeEtablissement,codeCommuneEtablissement,codeCedexEtablissement,libelleCedexEtablissement,codePaysEtrangerEtablissement,libellePaysEtrangerEtablissement,complementAdresse2Etablissement,numeroVoie2Etablissement,indiceRepetition2Etablissement,typeVoie2Etablissement,libelleVoie2Etablissement,codePostal2Etablissement,libelleCommune2Etablissement,libelleCommuneEtranger2Etablissement,distributionSpeciale2Etablissement,codeCommune2Etablissement,codeCedex2Etablissement,libelleCedex2Etablissement,codePaysEtranger2Etablissement,libellePaysEtranger2Etablissement,dateDebut,etatAdministratifEtablissement,enseigne1Etablissement,enseigne2Etablissement,enseigne3Etablissement,denominationUsuelleEtablissement,activitePrincipaleEtablissement,nomenclatureActivitePrincipaleEtablissement,caractereEmployeurEtablissement,longitude,latitude,geo_score,geo_type,geo_adresse,geo_id,geo_ligne,geo_l4,geo_l5
214101743,00018,21410174300018,O,1983-03-01,02,2019,,2021-10-27T08:08:20,true,4,,1,,RUE,COUDRAY,41100,PERIGNY,,,41174,,,,,,,,,,,,,,,,,,,2008-01-01,A,MAIRIE,,,,84.11Z,NAFRev2,O,1.147887,47.741913,0.87,housenumber,1 Rue du Coudray 41100 Périgny,41174_0040_00001,G,1 RUE DU COUDRAY,
214101743,00026,21410174300026,O,1983-12-21,01,2019,,2021-10-27T08:08:20,false,3,,,,RUE,DE COUDRAY,41100,PERIGNY,,,41174,,,,,,,,,,,,,,,,,,,2008-01-01,A,ECOLE MATERNELLE PUBLIQUE,,,,85.10Z,NAFRev2,N,1.147785,47.741952,0.76,street,Rue du Coudray 41100 Périgny,41174_0040,G,RUE DU COUDRAY,
264102138,00015,26410213800015,O,1992-11-02,NN,,,2017-08-06T14:11:33,true,4,MAIRIE,,,,,41100,PERIGNY,,,41174,,,,,,,,,,,,,,,,,,,2017-08-01,F,CCAS,,,,88.99B,NAFRev2,N,1.154333,47.740639,0.38,street,Rue de la Dionnerie 41100 Périgny,41174_0055,D,RUE DE LA DIONNERIE,
294100953,00016,29410095300016,O,1983-09-27,NN,,,2018-09-29T12:08:56,true,3,,,,,,41100,PERIGNY,,,41174,,,,,,,,,,,,,,,,,,,2008-01-01,A,,,,,42.99Z,NAFRev2,N,,,0,,,,,,
318212115,00063,31821211500063,O,2015-04-08,,,4321AB,2016-01-06T05:02:26,true,2,,,,LD,MOULIN DE BEZARD,41100,PERIGNY,,,41174,,,,,,,,,,,,,,,,,,,2015-12-31,F,,,,,43.21A,NAFRev2,N,1.158381,47.760141,0.93,street,Moulin de Bezard 41100 Périgny,41174_B046,G,MOULIN DE BEZARD,
322101726,00014,32210172600014,O,1900-01-01,NN,,,2011-04-28T00:19:29,false,4,,5,,IMP,DU VIVIER,41100,PERIGNY,,,41174,,,,,,,,,,,,,,,,,,,1992-07-01,F,,,,,45.2V,NAF1993,N,1.149519,47.74197,0.82,housenumber,5 Impasse du Vivier 41100 Périgny,41174_0135_00005,G,5 IMPASSE DU VIVIER,
325006880,00018,32500688000018,O,,NN,,,,true,1,,,,LD,MESIERES,41100,PERIGNY,,,41174,,,,,,,,,,,,,,,,,,,,F,,,,,01.00,NAP,N,1.152974,47.766009,0.62,street,Mezieres 41100 Périgny,41174_3i2b7s,G,MEZIERES,
327149308,00014,32714930800014,O,1983-04-05,NN,,,2016-04-26T02:52:10,true,7,,35,,RUE,PRINCIPALE,41100,PERIGNY,,,41174,,,,,,,,,,,,,,,,,,,2016-01-31,F,,,,,43.99B,NAFRev2,N,1.152299,47.741901,0.94,housenumber,35 Rue Principale 41100 Périgny,41174_0110_00035,G,35 RUE PRINCIPALE,
329213383,00014,32921338300014,O,,NN,,,,true,1,,,,RUE,PRINCIPALE,41100,PERIGNY,,,41174,,,,,,,,,,,,,,,,,,,1994-12-31,F,,,,,74.8K,NAF1993,N,1.149207,47.740597,0.94,street,Rue Principale 41100 Périgny,41174_0110,G,RUE PRINCIPALE,
330585886,00014,33058588600014,O,,NN,,,,true,1,,,,LD,LA POTERNE,41100,PERIGNY,,,41174,,,,,,,,,,,,,,,,,,,1989-02-28,F,,,,,01.07,NAP,N,1.151617,47.746286,0.83,street,La Grande Poterne 41100 Périgny,41174_B032,G,LA GRANDE POTERNE,
331767897,00019,33176789700019,O,1985-01-21,NN,,,2008-01-04T20:17:20,true,5,,,,LD,LE COUDRAY,41100,PERIGNY,,,41174,,,,,,,,,,,,,,,,,,,2008-01-01,A,,,,,68.20B,NAFRev2,N,1.139787,47.755013,0.93,street,Le Coudray 41100 Périgny,41174_sd3otk,G,LE COUDRAY,
332236561,00012,33223656100012,O,1984-12-26,NN,,,2011-02-02T05:00:23,true,4,,,,RUE,PRINCIPALE,41100,PERIGNY,,,41174,,,,,,,,,,,,,,,,,,,2009-08-31,F,,,,,01.11Z,NAFRev2,N,1.149207,47.740597,0.94,street,Rue Principale 41100 Périgny,41174_0110,G,RUE PRINCIPALE,
332395219,00014,33239521900014,O,,NN,,,,true,1,,,,,FONTAINE LYON,41100,PERIGNY,,,41174,,,,,,,,,,,,,,,,,,,,F,,,,,59.08,NAP,N,1.170406,47.75722,0.59,street,La Fontaine des Prasles 41100 Périgny,41174_B022,G,LA FONTAINE DES PRASLES,
334268893,00016,33426889300016,O,1985-12-13,NN,,,,true,3,,,,RUE,DE BEAUVOIR,41100,PERIGNY,,,41174,,,,,,,,,,,,,,,,,,,1993-11-30,F,,,,,01.1A,NAF1993,N,1.152033,47.739335,0.94,street,Rue de Beauvoir 41100 Périgny,41174_0015,G,RUE DE BEAUVOIR,
337494652,00015,33749465200015,O,1986-04-04,NN,,,2016-04-26T03:23:37,true,3,,,,,,41100,PERIGNY,,,41174,,,,,,,,,,,,,,,,,,,2008-01-01,A,,,,,01.11Z,NAFRev2,N,,,0,,,,,,
337987333,00016,33798733300016,O,,NN,,,,true,1,,,,LD,MEZIERES,41100,PERIGNY,,,41174,,,,,,,,,,,,,,,,,,,1990-09-01,F,,,,,01.00,NAP,N,1.152974,47.766009,0.94,street,Mezieres 41100 Périgny,41174_3i2b7s,G,MEZIERES,
337987481,00013,33798748100013,O,,NN,,,,true,1,,,,,,41100,PERIGNY,,,41174,,,,,,,,,,,,,,,,,,,1990-08-31,F,,,,,01.00,NAP,N,,,0,,,,,,
338080401,00015,33808040100015,O,1969-01-01,NN,,,2008-01-04T21:16:52,true,3,,,,LD,ESNAULT,41100,PERIGNY,,,41174,,,,,,,,,,,,,,,,,,,2008-01-01,A,,,,,01.50Z,NAFRev2,N,1.16246,47.754087,0.59,street,Enault 41100 Périgny,41174_ipb34s,G,ENAULT,
338082134,00028,33808213400028,O,1999-02-01,NN,,,2021-02-02T09:41:09,true,3,,,,,LA CHATAIGNIERE,41100,PERIGNY,,,41174,,,,,,,,,,,,,,,,,,,2008-01-01,A,,,,,01.11Z,NAFRev2,N,1.157162,47.738637,0.93,street,La Chataigniere 41100 Périgny,41174_hrzr29,G,LA CHATAIGNIERE,
338133457,00014,33813345700014,O,,NN,,,,true,1,,13,,RUE,PRINCIPALE,41100,PERIGNY,,,41174,,,,,,,,,,,,,,,,,,,1992-08-31,F,,,,,01.1A,NAF1993,N,1.148089,47.740603,0.94,housenumber,13 Rue Principale 41100 Périgny,41174_0110_00013,G,13 RUE PRINCIPALE,
338365562,00010,33836556200010,O,,NN,,,,true,1,,,,,,41100,PERIGNY,,,41174,,,,,,,,,,,,,,,,,,,1988-11-30,F,,,,,01.00,NAP,N,,,0,,,,,,
340898030,00010,34089803000010,O,,,,,,true,1,,5,,,IMPASSE DU VIVIER,41100,PERIGNY,,,41174,,,,,,,,,,,,,,,,,,,1992-07-01,F,,,,,45.2V,NAF1993,N,1.149519,47.74197,0.94,housenumber,5 Impasse du Vivier 41100 Périgny,41174_0135_00005,G,5 IMPASSE DU VIVIER,
344568084,00018,34456808400018,O,1988-03-01,01,2019,,2021-10-27T08:37:02,true,4,,,,RUE,PRINCIPALE,41100,PERIGNY,,,41174,,,,,,,,,,,,,,,,,,,2012-12-31,A,,,,,01.11Z,NAFRev2,O,1.149207,47.740597,0.94,street,Rue Principale 41100 Périgny,41174_0110,G,RUE PRINCIPALE,
344568084,00026,34456808400026,O,2020-12-15,,,,2021-04-02T16:06:53,false,1,,,,RUE,PRINCIPALE,41100,PERIGNY,,,41174,,,,,,,,,,,,,,,,,,,2020-12-15,A,,,,,68.20B,NAFRev2,N,1.149207,47.740597,0.94,street,Rue Principale 41100 Périgny,41174_0110,G,RUE PRINCIPALE,
345299044,00023,34529904400023,O,2020-09-01,,,,2021-02-23T11:00:11,true,1,,13,,RUE,DE LA CHATAIGNIERE,41100,PERIGNY,,,41174,,,,,,,,,,,,,,,,,,,2020-09-01,A,,,,,01.11Z,NAFRev2,N,1.156183,47.739175,0.94,housenumber,13 Rue de la Chataignière 41100 Périgny,41174_0030_00013,G,13 RUE DE LA CHATAIGNIERE,
349841742,00019,34984174200019,O,1989-02-16,NN,,,,true,1,,,,,LA POTERNE,41100,PERIGNY,,,41174,,,,,,,,,,,,,,,,,,,1999-01-31,F,,,,,01.1A,NAF1993,N,1.151617,47.746286,0.83,street,La Grande Poterne 41100 Périgny,41174_B032,G,LA GRANDE POTERNE,
349871038,00015,34987103800015,O,1989-02-25,01,2019,,2021-10-27T08:39:55,true,3,,2,,RUE,BEAUVOIR,41100,PERIGNY,,,41174,,,,,,,,,,,,,,,,,,,2008-01-01,A,,,,,01.11Z,NAFRev2,N,1.152049,47.739716,0.93,housenumber,2 Rue de Beauvoir 41100 Périgny,41174_0015_00002,G,2 RUE DE BEAUVOIR,
350952990,00017,35095299000017,O,,NN,,,,true,1,,,,,LE BOURG,41100,PERIGNY,,,41174,,,,,,,,,,,,,,,,,,,1990-11-01,F,,,,,01.00,NAP,N,1.149198,47.740427,0.93,street,Le Bourg 41100 Périgny,41174_ke5olc,G,LE BOURG,
379671373,00015,37967137300015,O,,NN,,,,true,1,,,,RUE,PRINCIPALE,41100,PERIGNY,,,41174,,,,,,,,,,,,,,,,,,,1991-05-15,F,,,,,77.12,NAP,N,1.149207,47.740597,0.94,street,Rue Principale 41100 Périgny,41174_0110,G,RUE PRINCIPALE,
380540575,00020,38054057500020,O,2014-07-01,,,,2021-02-23T11:09:01,true,3,MEZIERES,,,RTE,DE COULOMMIERS,41100,PERIGNY,,,41174,,,,,,,,,,,,,,,,,,,2017-05-01,A,,,,,46.19B,NAFRev2,N,1.173568,47.755172,0.31,street,Moulin de Cornevache 41100 Périgny,41174_d1snh9,G,MOULIN DE CORNEVACHE,
382012003,00010,38201200300010,O,1991-01-01,NN,,,2008-01-04T22:03:36,true,3,,,,LD,LE BOURG,41100,PERIGNY,,,41174,,,,,,,,,,,,,,,,,,,2008-01-01,A,,,,,01.50Z,NAFRev2,N,1.149198,47.740427,0.93,street,Le Bourg 41100 Périgny,41174_ke5olc,G,LE BOURG,
388918179,00010,38891817900010,O,1992-06-28,NN,,,,false,3,,18,,RUE,PRINCIPALE,41100,PERIGNY,,,41174,,,,,,,,,,,,,,,,,,,1994-06-01,F,,,,,85.1G,NAF1993,N,1.147831,47.740529,0.94,housenumber,18 Rue Principale 41100 Périgny,41174_0110_00018,G,18 RUE PRINCIPALE,
414596965,00015,41459696500015,O,1997-11-01,NN,,,2019-04-29T09:47:07,true,4,ESNAULT,,,,ESNAULT,41100,PERIGNY,,,41174,,,,,,,,,,,,,,,,,,,2018-12-31,F,,,,,01.47Z,NAFRev2,N,1.16246,47.754087,0.59,street,Enault 41100 Périgny,41174_ipb34s,G,ENAULT,
419380381,00022,41938038100022,O,2012-01-25,,,,2012-12-20T08:35:17,true,2,,5,,RUE,DU COUDRAY,41100,PERIGNY,,,41174,,,,,,,,,,,,,,,,,,,2012-12-31,F,,,,,85.59A,NAFRev2,N,1.148101,47.741409,0.94,housenumber,5 Rue du Coudray 41100 Périgny,41174_0040_00005,G,5 RUE DU COUDRAY,
420017436,00015,42001743600015,O,1998-09-02,NN,,,2008-01-05T20:38:37,true,3,,,,,LE COUDRAY,41100,PERIGNY,,,41174,,,,,,,,,,,,,,,,,,,2008-01-01,A,,,,,68.20B,NAFRev2,N,1.139787,47.755013,0.93,street,Le Coudray 41100 Périgny,41174_sd3otk,G,LE COUDRAY,
420017501,00016,42001750100016,O,1958-01-01,NN,,,2008-01-04T23:45:35,true,3,,,,,LE COUDRAY,41100,PERIGNY,,,41174,,,,,,,,,,,,,,,,,,,2008-01-01,A,,,,,68.20B,NAFRev2,N,1.139787,47.755013,0.93,street,Le Coudray 41100 Périgny,41174_sd3otk,G,LE COUDRAY,
423638147,00029,42363814700029,O,2002-02-01,NN,,,2011-05-03T00:39:04,false,3,,5,,RUE,DU COUDRAY,41100,PERIGNY,,,41174,,,,,,,,,,,,,,,,,,,2002-12-25,F,,,,,51.1T,NAF1993,N,1.148101,47.741409,0.94,housenumber,5 Rue du Coudray 41100 Périgny,41174_0040_00005,G,5 RUE DU COUDRAY,
434967709,00016,43496770900016,O,1999-01-01,NN,,,2013-05-26T04:07:51,true,3,,,,RUE,PRINCIPALE,41100,PERIGNY,,,41174,,,,,,,,,,,,,,,,,,,2008-01-01,A,,,,,01.11Z,NAFRev2,N,1.149207,47.740597,0.94,street,Rue Principale 41100 Périgny,41174_0110,G,RUE PRINCIPALE,
441109543,00013,44110954300013,O,2002-03-04,NN,,,,true,3,,,,,LE COUDRAY,41100,PERIGNY,,,41174,,,,,,,,,,,,,,,,,,,2002-12-25,F,,,,,74.1G,NAF1993,N,1.139787,47.755013,0.93,street,Le Coudray 41100 Périgny,41174_sd3otk,G,LE COUDRAY,
444709513,00022,44470951300022,O,2007-01-01,,,,2011-06-16T15:22:52,false,2,,,,RUE,PRINCIPALE,41100,PERIGNY,,,41174,,,,,,,,,,,,,,,,,,,2008-10-01,A,CMCR/G,,,,43.91B,NAFRev2,N,1.149207,47.740597,0.94,street,Rue Principale 41100 Périgny,41174_0110,G,RUE PRINCIPALE,
452325764,00028,45232576400028,O,2009-01-01,,,,2021-02-23T13:36:09,true,1,,,,,LE COUDRAY,41100,PERIGNY,,,41174,,,,,,,,,,,,,,,,,,,2009-01-01,A,LIBRAIRIE L'ANGE BLEU,,,,47.61Z,NAFRev2,N,1.139787,47.755013,0.93,street,Le Coudray 41100 Périgny,41174_sd3otk,G,LE COUDRAY,
478074354,00018,47807435400018,O,2004-06-01,,,,2021-04-07T10:01:27,true,3,LE COUDRAY,,,,,41100,PERIGNY,,,41174,,,,,,,,,,,,,,,,,,,2008-01-01,A,,,,,01.11Z,NAFRev2,N,1.139787,47.755013,0.93,street,Le Coudray 41100 Périgny,41174_sd3otk,D,LE COUDRAY,
478329550,00014,47832955000014,O,2004-06-01,NN,,,2008-01-05T03:40:42,true,3,,,,,LE CONDRAY,41100,PERIGNY,,,41174,,,,,,,,,,,,,,,,,,,2008-01-01,A,,,,,68.20B,NAFRev2,N,1.139787,47.755013,0.68,street,Le Coudray 41100 Périgny,41174_sd3otk,G,LE COUDRAY,
479731119,00018,47973111900018,O,2004-12-01,NN,,,2011-06-24T14:15:46,false,4,,15,,RUE,PRINCIPALE,41100,PERIGNY,,,41174,,,,,,,,,,,,,,,,,,,2010-08-31,F,,,,,01.61Z,NAFRev2,N,1.149207,47.740597,0.94,housenumber,15 Rue Principale 41100 Périgny,41174_0110_00015,G,15 RUE PRINCIPALE,
479731119,00026,47973111900026,O,2009-09-01,,,,2020-02-04T13:16:48,true,2,,15,,RUE,PRINCIPALE,41100,PERIGNY,,,41174,,,,,,,,,,,,,,,,,,,2019-12-31,F,,,,,01.11Z,NAFRev2,N,1.149207,47.740597,0.94,housenumber,15 Rue Principale 41100 Périgny,41174_0110_00015,G,15 RUE PRINCIPALE,
481606804,00013,48160680400013,O,2000-08-07,NN,,,2008-01-05T00:31:40,true,3,CHEZ MR LABBE MICHEL,35,,RUE,PRINCIPALE,41100,PERIGNY,,,41174,,,,,,,,,,,,,,,,,,,2008-01-01,A,,,,,90.01Z,NAFRev2,N,1.152299,47.741901,0.94,housenumber,35 Rue Principale 41100 Périgny,41174_0110_00035,G,35 RUE PRINCIPALE,
498245414,00012,49824541400012,O,2007-06-01,,,,2008-01-05T00:50:51,true,2,,7,,RUE,DE COUDRAY,41100,PERIGNY,,,41174,,,,,,,,,,,,,,,,,,,2007-12-31,F,,,,,51.1T,NAFRev1,N,1.147987,47.741635,0.78,housenumber,7 Rue du Coudray 41100 Périgny,41174_0040_00007,G,7 RUE DU COUDRAY,
502410707,00017,50241070700017,O,2008-02-01,,,,2008-02-06T07:55:56,true,1,,18,,RUE,PRINCIPALE,41100,PERIGNY,,,41174,,,,,,,,,,,,,,,,,,,2008-02-01,A,,,,,68.20B,NAFRev2,N,1.147831,47.740529,0.94,housenumber,18 Rue Principale 41100 Périgny,41174_0110_00018,G,18 RUE PRINCIPALE,
503431058,00018,50343105800018,O,2004-10-15,,,,2009-09-04T10:50:48,false,3,CHEZ  DENIS WILLY,,,,MOULIN DE BEZARD,41100,PERIGNY,,,41174,,,,,,,,,,,,,,,,,,,2009-08-01,F,,,,,94.99Z,NAFRev2,O,1.158381,47.760141,0.93,street,Moulin de Bezard 41100 Périgny,41174_B046,G,MOULIN DE BEZARD,
521986570,00013,52198657000013,O,2010-04-01,,,,2010-04-26T15:07:12,true,1,,,,,LA POTERNE,41100,PERIGNY,,,41174,,,,,,,,,,,,,,,,,,,2010-04-01,A,,,,,01.11Z,NAFRev2,N,1.151617,47.746286,0.83,street,La Grande Poterne 41100 Périgny,41174_B032,G,LA GRANDE POTERNE,
522640895,00028,52264089500028,O,2013-01-01,,,4932ZA,2019-07-30T03:42:09,true,2,,13,,RUE,PRINCIPALE,41100,PERIGNY,,,41174,,,,,,,,,,,,,,,,,,,2019-07-01,F,DOMINIC TAXI,,,DOMINIC TAXI,49.32Z,NAFRev2,N,1.148089,47.740603,0.94,housenumber,13 Rue Principale 41100 Périgny,41174_0110_00013,G,13 RUE PRINCIPALE,
524136611,00018,52413661100018,O,2010-07-19,,,,2011-10-21T19:43:27,true,2,,,,,LA POTERNE,41100,PERIGNY,,,41174,,,,,,,,,,,,,,,,,,,2011-07-15,F,,,,,35.11Z,NAFRev2,N,1.151617,47.746286,0.83,street,La Grande Poterne 41100 Périgny,41174_B032,G,LA GRANDE POTERNE,
527699276,00020,52769927600020,O,2014-02-13,,,,2016-02-11T08:37:12,true,2,,,,,LE COUDRAY,41100,PERIGNY,,,41174,,,,,,,,,,,,,,,,,,,2015-12-01,F,,,,,62.09Z,NAFRev2,N,1.139787,47.755013,0.93,street,Le Coudray 41100 Périgny,41174_sd3otk,G,LE COUDRAY,
528432750,00016,52843275000016,O,2010-12-01,,,,2021-05-04T19:42:52,true,1,,,,,CORNEVACHE,41100,PERIGNY,,,41174,,,,,,,,,,,,,,,,,,,2010-12-01,A,,,,,68.20B,NAFRev2,N,1.173568,47.755172,0.91,street,Moulin de Cornevache 41100 Périgny,41174_d1snh9,G,MOULIN DE CORNEVACHE,
529823569,00015,52982356900015,O,2011-04-04,01,2019,,2021-10-27T08:36:54,true,1,,,,,CORNE VACHE,41100,PERIGNY,,,41174,,,,,,,,,,,,,,,,,,,2011-04-04,A,ECURIES LE LOGIS DE LEGENDE,,,,01.62Z,NAFRev2,N,1.9630673,48.8244849,0.81,poi.footway,Chemin de la Vache Corne (Chemin piéton) Plaisir,https://osm.org/way/28030458,G,,
530703149,00019,53070314900019,O,2011-03-01,NN,,4332AA,2017-05-04T07:29:54,true,4,,33,T,RUE,PRINCIPALE,41100,PERIGNY,,,41174,,,,,,,,,,,,,,,,,,,2015-03-20,F,,,,,43.32A,NAFRev2,N,1.152002,47.741105,0.85,housenumber,33ter Rue Principale 41100 Périgny,41174_0110_00033_ter,G,33TER RUE PRINCIPALE,
530718444,00017,53071844400017,O,2011-02-15,00,2019,,2021-10-27T08:38:04,true,1,,2,,RUE,BEAUVOIR,41100,PERIGNY,,,41174,,,,,,,,,,,,,,,,,,,2011-02-15,A,,,,,01.61Z,NAFRev2,N,1.152049,47.739716,0.93,housenumber,2 Rue de Beauvoir 41100 Périgny,41174_0015_00002,G,2 RUE DE BEAUVOIR,
535139331,00016,53513933100016,O,2011-09-07,,,4334ZC,2020-11-03T03:56:59,true,2,,8,,RUE,CHAAIGNIERE,41100,PERIGNY,,,41174,,,,,,,,,,,,,,,,,,,2018-01-01,F,,,,,43.34Z,NAFRev2,N,1.154602,47.740045,0.78,housenumber,8 Rue de la Chataignière 41100 Périgny,41174_0030_00008,G,8 RUE DE LA CHATAIGNIERE,
538160524,03198,53816052403198,O,2021-06-22,,,,2021-07-28T09:43:58,false,1,CHEZ MME SIONNEAU MAY,,,,CORNEVACHE,41100,PERIGNY,,,41174,,,,,,,,,,,,,,,,,,,2021-06-22,A,,,,,35.11Z,NAFRev2,N,1.173568,47.755172,0.91,street,Moulin de Cornevache 41100 Périgny,41174_d1snh9,G,MOULIN DE CORNEVACHE,
538160615,02584,53816061502584,O,2021-06-22,,,,2021-07-28T10:10:44,false,1,CHEZ SIONNEAU MAYLIS,,,,CORNEVACHE,41100,PERIGNY,,,41174,,,,,,,,,,,,,,,,,,,2021-06-22,A,,,,,35.11Z,NAFRev2,N,1.173568,47.755172,0.91,street,Moulin de Cornevache 41100 Périgny,41174_d1snh9,G,MOULIN DE CORNEVACHE,
538160656,02828,53816065602828,O,2021-06-24,,,,2021-10-26T15:38:49,false,2,CHEZ MME SIONNEAU MA,,,,CORNEVACHE,41100,PERIGNY,,,41174,,,,,,,,,,,,,,,,,,,2021-09-30,F,,,,,35.11Z,NAFRev2,N,1.173568,47.755172,0.91,street,Moulin de Cornevache 41100 Périgny,41174_d1snh9,G,MOULIN DE CORNEVACHE,
596018986,00015,59601898600015,O,,,,,,true,1,,,,,,41100,PERIGNY,,,41174,,,,,,,,,,,,,,,,,,,1984-12-25,F,,,,,55.71,NAP,N,,,0,,,,,,
753356963,00011,75335696300011,O,2012-07-01,,,,2016-10-27T08:28:59,true,2,,,,,LE COUDRAY,41100,PERIGNY,,,41174,,,,,,,,,,,,,,,,,,,2013-12-24,F,,,,,74.10Z,NAFRev2,N,1.139787,47.755013,0.93,street,Le Coudray 41100 Périgny,41174_sd3otk,G,LE COUDRAY,
775380371,00028,77538037100028,O,2003-12-16,NN,,,2018-09-29T13:18:13,false,4,,3,,RUE,PRINCIPALE,41100,PERIGNY,,,41174,,,,,,,,,,,,,,,,,,,2016-12-01,F,,,,,01.11Z,NAFRev2,N,1.145892,47.738924,0.94,housenumber,3 Rue Principale 41100 Périgny,41174_0110_00003,G,3 RUE PRINCIPALE,
775402381,00013,77540238100013,O,,NN,,,,true,1,,,,,,41100,PERIGNY,,,41174,,,,,,,,,,,,,,,,,,,,F,,,,,01.80,NAP,N,,,0,,,,,,
775402399,00015,77540239900015,O,1900-01-01,NN,,,2007-01-18T09:45:14,true,3,,,,,LES PORTES ROUGES,41100,PERIGNY,,,41174,,,,,,,,,,,,,,,,,,,1993-11-30,F,,,,,01.4A,NAF1993,N,1.156404,47.762001,0.31,street,Maison Rouge 41100 Périgny,41174_B086,G,MAISON ROUGE,
775402415,00019,77540241500019,O,,,,,,true,1,,,,,,41100,PERIGNY,,,41174,,,,,,,,,,,,,,,,,,,1984-12-25,F,,,,,48.01,NAP,N,,,0,,,,,,
791051204,00018,79105120400018,O,2013-02-07,,,,2014-12-30T08:33:00,true,2,,31,,RUE,PRINCIPALE,41100,PERIGNY,,,41174,,,,,,,,,,,,,,,,,,,2014-12-31,F,,,,,39.00Z,NAFRev2,N,1.150488,47.740236,0.94,housenumber,31 Rue Principale 41100 Périgny,41174_0110_00031,G,31 RUE PRINCIPALE,
803646793,00015,80364679300015,O,2014-07-10,,,,2014-07-23T09:30:02,true,1,,,,LD,LE COUDRAY,41100,PERIGNY,,,41174,,,,,,,,,,,,,,,,,,,2014-07-10,A,,,,,68.20B,NAFRev2,N,1.139787,47.755013,0.93,street,Le Coudray 41100 Périgny,41174_sd3otk,G,LE COUDRAY,
811468388,00012,81146838800012,O,2014-05-01,,,,2015-05-20T08:23:33,true,1,,7,,RUE,PRINCIPALE,41100,PERIGNY,,,41174,,,,,,,,,,,,,,,,,,,2014-05-01,A,,,,,47.99A,NAFRev2,N,1.146346,47.739293,0.94,housenumber,7 Rue Principale 41100 Périgny,41174_0110_00007,G,7 RUE PRINCIPALE,
817404205,00012,81740420500012,O,2016-01-04,,,,2016-12-08T08:49:17,true,2,,30,,RUE,PRINCIPALE,41100,PERIGNY,,,41174,,,,,,,,,,,,,,,,,,,2016-11-30,F,,,,,62.09Z,NAFRev2,N,1.149889,47.740474,0.94,housenumber,30 Rue Principale 41100 Périgny,41174_0110_00030,G,30 RUE PRINCIPALE,
828390112,00013,82839011200013,O,2016-10-10,,,,2017-03-17T03:55:04,true,1,,,,,CORNEVACHE,41100,PERIGNY,,,41174,,,,,,,,,,,,,,,,,,,2016-10-10,A,,,,,68.20A,NAFRev2,N,1.173568,47.755172,0.91,street,Moulin de Cornevache 41100 Périgny,41174_d1snh9,G,MOULIN DE CORNEVACHE,
841975642,00023,84197564200023,O,2020-10-14,,,,2021-06-21T10:03:51,true,1,,25,,RUE,PRINCIPALE,41100,PERIGNY,,,41174,,,,,,,,,,,,,,,,,,,2020-10-14,A,AU BONHEUR DES ABEILLES,,,,01.49Z,NAFRev2,N,1.150046,47.740376,0.94,housenumber,25 Rue Principale 41100 Périgny,41174_0110_00025,G,25 RUE PRINCIPALE,
843182965,00015,84318296500015,O,2018-10-15,,,,2018-10-18T04:57:04,true,1,,9,,RUE,PRINCIPALE,41100,PERIGNY,,,41174,,,,,,,,,,,,,,,,,,,2018-10-15,A,,,,,68.20A,NAFRev2,N,1.146721,47.739599,0.94,housenumber,9 Rue Principale 41100 Périgny,41174_0110_00009,G,9 RUE PRINCIPALE,
850023425,00018,85002342500018,O,2019-04-15,,,4932ZA,2019-09-23T13:04:47,true,2,,13,,RUE,PRINCIPALE,41100,PERIGNY,,,41174,,,,,,,,,,,,,,,,,,,2019-07-01,A,,,,,49.32Z,NAFRev2,N,1.148089,47.740603,0.94,housenumber,13 Rue Principale 41100 Périgny,41174_0110_00013,G,13 RUE PRINCIPALE,
850402447,00013,85040244700013,O,2019-05-01,,,,2020-02-04T03:39:49,false,2,,15,,RUE,PRINCIPALE,41100,PERIGNY,,,41174,,,,,,,,,,,,,,,,,,,2019-12-31,F,,,,,01.11Z,NAFRev2,N,1.149207,47.740597,0.94,housenumber,15 Rue Principale 41100 Périgny,41174_0110_00015,G,15 RUE PRINCIPALE,
852601301,00017,85260130100017,O,2019-07-01,,,,2020-03-19T08:32:58,false,2,,,,LD,MEZIERES,41100,PERIGNY,,,41174,,,,,,,,,,,,,,,,,,,2020-02-03,F,,,,,86.90E,NAFRev2,N,1.152974,47.766009,0.94,street,Mezieres 41100 Périgny,41174_3i2b7s,G,MEZIERES,
878013192,00017,87801319200017,O,2019-10-01,,,,2019-10-11T09:38:39,true,1,,9,,RUE,PRINCIPALE,41100,PERIGNY,,,41174,,,,,,,,,,,,,,,,,,,2019-10-01,A,,,,,01.11Z,NAFRev2,N,1.146721,47.739599,0.94,housenumber,9 Rue Principale 41100 Périgny,41174_0110_00009,G,9 RUE PRINCIPALE,
878441724,00019,87844172400019,O,2019-10-16,,,,2019-10-26T03:36:06,true,1,,9,,RUE,PRINCIPALE,41100,PERIGNY,,,41174,,,,,,,,,,,,,,,,,,,2019-10-16,A,,,,,68.20B,NAFRev2,N,1.146721,47.739599,0.94,housenumber,9 Rue Principale 41100 Périgny,41174_0110_00009,G,9 RUE PRINCIPALE,
884432758,00016,88443275800016,O,2020-06-01,,,,2020-07-30T06:44:53,true,1,,9,,RUE,PRINCIPALE,41100,PERIGNY,,,41174,,,,,,,,,,,,,,,,,,,2020-06-01,A,,,,,01.61Z,NAFRev2,N,1.146721,47.739599,0.94,housenumber,9 Rue Principale 41100 Périgny,41174_0110_00009,G,9 RUE PRINCIPALE,
888098548,00017,88809854800017,O,2020-07-01,,,,2020-08-17T07:23:00,true,1,,9,,RUE,PRINCIPALE,41100,PERIGNY,,,41174,,,,,,,,,,,,,,,,,,,2020-07-01,A,,,,,01.11Z,NAFRev2,N,1.146721,47.739599,0.94,housenumber,9 Rue Principale 41100 Périgny,41174_0110_00009,G,9 RUE PRINCIPALE,
890286461,00011,89028646100011,O,2021-01-01,,,,2020-10-24T03:41:59,true,1,,1,B,RUE,DE LA CHATAIGNIERE,41100,PERIGNY,,,41174,,,,,,,,,,,,,,,,,,,2021-01-01,A,,,,,01.11Z,NAFRev2,N,1.153244,47.740125,0.87,housenumber,1bis Rue de la Chataignière 41100 Périgny,41174_0030_00001_bis,G,1BIS RUE DE LA CHATAIGNIERE,
