siren,nic,siret,statutDiffusionEtablissement,dateCreationEtablissement,trancheEffectifsEtablissement,anneeEffectifsEtablissement,activitePrincipaleRegistreMetiersEtablissement,dateDernierTraitementEtablissement,etablissementSiege,nombrePeriodesEtablissement,complementAdresseEtablissement,numeroVoieEtablissement,indiceRepetitionEtablissement,typeVoieEtablissement,libelleVoieEtablissement,codePostalEtablissement,libelleCommuneEtablissement,libelleCommuneEtrangerEtablissement,distributionSpecialeEtablissement,codeCommuneEtablissement,codeCedexEtablissement,libelleCedexEtablissement,codePaysEtrangerEtablissement,libellePaysEtrangerEtablissement,complementAdresse2Etablissement,numeroVoie2Etablissement,indiceRepetition2Etablissement,typeVoie2Etablissement,libelleVoie2Etablissement,codePostal2Etablissement,libelleCommune2Etablissement,libelleCommuneEtranger2Etablissement,distributionSpeciale2Etablissement,codeCommune2Etablissement,codeCedex2Etablissement,libelleCedex2Etablissement,codePaysEtranger2Etablissement,libellePaysEtranger2Etablissement,dateDebut,etatAdministratifEtablissement,enseigne1Etablissement,enseigne2Etablissement,enseigne3Etablissement,denominationUsuelleEtablissement,activitePrincipaleEtablissement,nomenclatureActivitePrincipaleEtablissement,caractereEmployeurEtablissement,longitude,latitude,geo_score,geo_type,geo_adresse,geo_id,geo_ligne,geo_l4,geo_l5
214201410,00013,21420141000013,O,1983-03-01,03,2019,,2021-10-27T08:08:22,true,4,,,,,LE BOURG,42750,MARS,,,42141,,,,,,,,,,,,,,,,,,,2008-01-01,A,MAIRIE,,,,84.11Z,NAFRev2,O,4.240244,46.153621,0.31,locality,Les Fours à Chaux 42750 Mars,42141_B015,G,LES FOURS A CHAUX,
214201410,00021,21420141000021,O,1983-12-21,02,2019,,2021-10-27T08:08:22,false,3,,,,,LE BOURG,42750,MARS,,,42141,,,,,,,,,,,,,,,,,,,2008-01-01,A,ECOLE PRIMAIRE PUBLIQUE,,,,85.20Z,NAFRev2,N,4.240244,46.153621,0.31,locality,Les Fours à Chaux 42750 Mars,42141_B015,G,LES FOURS A CHAUX,
214201410,00039,21420141000039,O,2001-01-01,NN,,,2008-01-04T18:33:42,false,3,,,,,HOTEL DE VILLE,42750,MARS,,,42141,,,,,,,,,,,,,,,,,,,2008-01-01,A,SERVICE ASSAINISSEMENT,,,,37.00Z,NAFRev2,N,4.262596,46.151865,0.51,street,Chemin de Villeret 42750 Mars,42141_0117,G,CHEMIN DE VILLERET,
264210303,00014,26421030300014,O,1983-08-10,NN,,,2019-11-15T13:51:21,true,4,,,,LD,HOTEL DE VILLE,42750,MARS,,,42141,,,,,,,,,,,,,,,,,,,2019-12-31,F,CCAS,,,,88.99B,NAFRev2,N,4.262596,46.151865,0.51,street,Chemin de Villeret 42750 Mars,42141_0117,G,CHEMIN DE VILLERET,
302707518,00049,30270751800049,O,,NN,,,,true,1,,,,,LE PILON,42750,MARS,,,42141,,,,,,,,,,,,,,,,,,,,F,,,,,65.03,NAP,N,4.247642,46.140308,0.62,street,Chemin du Pilon 42750 Mars,42141_0085,G,CHEMIN DU PILON,
302842166,00019,30284216600019,O,1900-01-01,01,2019,,2021-10-27T08:14:30,true,4,,,,,MAIRIE,42750,MARS,,,42141,,,,,,,,,,,,,,,,,,,2008-01-01,A,,,,,56.29B,NAFRev2,O,4.254547,46.143503,0.51,street,Chemin de la Scierie 42750 Mars,42141_0107,G,CHEMIN DE LA SCIERIE,
306209248,00013,30620924800013,O,,,,,,true,1,,,,,AU BOURG,42750,MARS,,,42141,,,,,,,,,,,,,,,,,,,1984-12-25,F,,,,,67.04,NAP,N,-1.9115621,47.1089349,0.88,poi.track,Chemin du Breil au Bourg Chaumes-en-Retz,https://osm.org/way/283246644,G,,
306357344,00010,30635734400010,O,1996-04-01,NN,,,2008-01-04T19:41:34,true,3,,,,,BOURG,42750,MARS,,,42141,,,,,,,,,,,,,,,,,,,2008-01-01,A,,,,,68.20B,NAFRev2,N,-1.229143,44.2011043,0.89,poi.school,École du bourg Mimizan,https://osm.org/way/35215942,G,,
308031061,00010,30803106100010,O,,NN,,,,true,1,,,,,LA COTE,42750,MARS,,,42141,,,,,,,,,,,,,,,,,,,,F,,,,,01.80,NAP,N,4.227378,46.153035,0.91,street,Allée de la Côte 42750 Mars,42141_0037,G,ALLEE DE LA COTE,
311329957,00014,31132995700014,O,,NN,,,,true,1,,,,,LE BOURG,42750,MARS,,,42141,,,,,,,,,,,,,,,,,,,1988-09-30,F,,,,,67.01,NAP,N,4.240244,46.153621,0.31,locality,Les Fours à Chaux 42750 Mars,42141_B015,G,LES FOURS A CHAUX,
318688868,00021,31868886800021,O,,NN,,,,true,1,,,,LD,LE BOURG,42750,MARS,,,42141,,,,,,,,,,,,,,,,,,,,F,,,,,55.40,NAP,N,4.240244,46.153621,0.31,locality,Les Fours à Chaux 42750 Mars,42141_B015,G,LES FOURS A CHAUX,
320951221,00037,32095122100037,O,2010-06-01,,,,2015-02-04T10:06:40,false,4,LES PIGEONNIERS,,,,VILLERET,42750,MARS,,,42141,,,,,,,,,,,,,,,,,,,2013-03-31,F,,,,,70.22Z,NAFRev2,N,4.262596,46.151865,0.92,street,Chemin de Villeret 42750 Mars,42141_0117,G,CHEMIN DE VILLERET,
321789034,00014,32178903400014,O,1981-04-01,NN,,,,true,3,,,,,PONT DE MARS,42750,MARS,,,42141,,,,,,,,,,,,,,,,,,,1992-10-02,F,,,,,55.4B,NAF1993,N,4.247753,46.1526,0.85,street,Route du Pont de Fer 42750 Mars,42141_0091,G,ROUTE DU PONT DE FER,
322782897,00019,32278289700019,O,,,,,,true,1,,,,,LE PONT,42750,MARS,,,42141,,,,,,,,,,,,,,,,,,,1984-12-25,F,,,,,67.04,NAP,N,4.247753,46.1526,0.57,street,Route du Pont de Fer 42750 Mars,42141_0091,G,ROUTE DU PONT DE FER,
323009605,00011,32300960500011,O,1981-10-10,NN,,,,true,1,,,,,LE BOURG,42750,MARS,,,42141,,,,,,,,,,,,,,,,,,,2001-09-30,F,,,,,55.4B,NAF1993,N,4.240244,46.153621,0.31,locality,Les Fours à Chaux 42750 Mars,42141_B015,G,LES FOURS A CHAUX,
325456101,00014,32545610100014,O,1982-09-15,NN,,,2007-05-19T09:19:34,true,3,,,,LD,LE BOURG,42750,MARS,,,42141,,,,,,,,,,,,,,,,,,,2005-06-30,F,,,,,80.1Z,NAFRev1,N,4.240244,46.153621,0.31,locality,Les Fours à Chaux 42750 Mars,42141_B015,G,LES FOURS A CHAUX,
326893757,00053,32689375700053,O,2016-04-01,,,,2021-02-23T10:48:44,true,1,,,,LD,LES BRUYERES,42750,MARS,,,42141,,,,,,,,,,,,,,,,,,,2016-04-01,A,,,,,01.49Z,NAFRev2,N,4.25241,46.141583,0.77,street,Chemin des Bruyères 42750 Mars,42141_0015,G,CHEMIN DES BRUYERES,
329672869,00016,32967286900016,O,,NN,,,,true,1,,,,LD,LE PONT DE MARS,42750,MARS,,,42141,,,,,,,,,,,,,,,,,,,1995-12-15,F,,,,,55.3A,NAF1993,N,4.247753,46.1526,0.71,street,Route du Pont de Fer 42750 Mars,42141_0091,G,ROUTE DU PONT DE FER,
330013012,00019,33001301200019,O,1984-04-01,02,2019,2341ZZ,2021-10-27T08:27:38,true,4,,205,,RTE,DE LA GONNE,42750,MARS,,,42141,,,,,,,,,,,,,,,,,,,2008-01-01,A,,,,,23.41Z,NAFRev2,O,4.246434,46.154472,0.86,housenumber,205 Route de la Gonne 42750 Mars,42141_0063_00205,G,205 ROUTE DE LA GONNE,
330956400,00015,33095640000015,O,1984-11-01,NN,,,2019-06-14T11:15:01,true,3,,243,,CHE,DE L ETANG,42750,MARS,,,42141,,,,,,,,,,,,,,,,,,,2008-01-01,A,,,,,01.42Z,NAFRev2,N,4.23975,46.158642,0.84,housenumber,243 Chemin de l’Étang 42750 Mars,42141_0057_00243,G,243 CHEMIN DE L ETANG,
332005503,00021,33200550300021,O,2011-01-10,,,8121ZZ,2021-02-23T10:51:55,true,1,,,,,FOUR A CHAUX,42750,MARS,,,42141,,,,,,,,,,,,,,,,,,,2011-01-10,A,,,,,81.22Z,NAFRev2,N,4.240799,46.153467,0.92,street,Chemin du Four à Chaux 42750 Mars,42141_0061,G,CHEMIN DU FOUR A CHAUX,
332144021,00018,33214402100018,O,1985-04-01,NN,,4322BA,2021-01-26T14:12:03,true,6,,,,LD,LE FOUR A CHAUX,42750,MARS,,,42141,,,,,,,,,,,,,,,,,,,2021-02-28,F,,,,,43.22B,NAFRev2,N,4.240799,46.153467,0.76,street,Chemin du Four à Chaux 42750 Mars,42141_0061,G,CHEMIN DU FOUR A CHAUX,
332187285,00033,33218728500033,O,1999-01-06,NN,,,,true,1,,,,,LE MEPLIE,42750,MARS,,,42141,,,,,,,,,,,,,,,,,,,2001-12-31,F,,,,,70.3A,NAF1993,N,4.266421,46.147263,0.74,street,Chemin du Meplié 42750 Mars,42141_0079,G,CHEMIN DU MEPLIE,
333132165,00015,33313216500015,O,1985-07-10,01,2018,4321AB,2020-08-25T10:35:58,true,5,,,,LD,LE BOURG,42750,MARS,,,42141,,,,,,,,,,,,,,,,,,,2019-04-10,F,,,,,43.21A,NAFRev2,O,4.240244,46.153621,0.31,locality,Les Fours à Chaux 42750 Mars,42141_B015,G,LES FOURS A CHAUX,
335249157,00017,33524915700017,O,1984-05-01,NN,,,2007-01-18T09:21:48,true,3,,,,LD,AUX COMBES,42750,MARS,,,42141,,,,,,,,,,,,,,,,,,,2001-12-31,F,,,,,01.2A,NAF1993,N,4.240244,46.153621,0.34,locality,Les Fours à Chaux 42750 Mars,42141_B015,G,LES FOURS A CHAUX,
337909436,00012,33790943600012,O,,,,,,true,1,,,,LD,LES FOURS A CHAUX,42750,MARS,,,42141,,,,,,,,,,,,,,,,,,,1989-10-01,F,,,,,80.08,NAP,N,4.240244,46.153621,0.94,locality,Les Fours à Chaux 42750 Mars,42141_B015,G,LES FOURS A CHAUX,
338339351,00029,33833935100029,O,1986-12-15,NN,,,2018-02-28T04:09:41,true,9,,,,,LE BOURG,42750,MARS,,,42141,,,,,,,,,,,,,,,,,,,2018-03-25,F,EPICERIE DE MARS,,,,47.11B,NAFRev2,O,4.240244,46.153621,0.31,locality,Les Fours à Chaux 42750 Mars,42141_B015,G,LES FOURS A CHAUX,
339192049,00015,33919204900015,O,,NN,,,,true,1,,,,LD,LES CHEZOS,42750,MARS,,,42141,,,,,,,,,,,,,,,,,,,1992-12-31,F,,,,,51.6L,NAF1993,N,4.279402,46.151156,0.76,street,Allée des Chézos 42750 Mars,42141_0031,G,ALLEE DES CHEZOS,
340262062,00045,34026206200045,O,2011-04-01,,,,2015-09-20T03:37:06,true,2,,,,,LE BOURG,42750,MARS,,,42141,,,,,,,,,,,,,,,,,,,2014-07-01,F,,,,,45.11Z,NAFRev2,N,4.240244,46.153621,0.31,locality,Les Fours à Chaux 42750 Mars,42141_B015,G,LES FOURS A CHAUX,
341337046,00013,34133704600013,O,1987-01-01,NN,,,,true,3,,,,,MONTARRE,42750,MARS,,,42141,,,,,,,,,,,,,,,,,,,2003-12-31,F,,,,,01.1A,NAFRev1,N,4.269392,46.141025,0.42,street,Chemin de Montée des Roches 42750 Mars,42141_yjw7v0,G,CHEMIN DE MONTEE DES ROCHES,
341337491,00011,34133749100011,O,1987-01-01,NN,,,2007-01-18T09:23:56,true,3,,,,,A LA COTE,42750,MARS,,,42141,,,,,,,,,,,,,,,,,,,1995-12-25,F,,,,,01.1C,NAF1993,N,5.9329165,46.7635005,0.89,poi.information,A la Cote (Informations) Équevillon,https://osm.org/node/4583601458,G,,
342830478,00018,34283047800018,O,1987-08-01,NN,,,2007-01-18T09:24:33,true,3,,,,,LA GAURE,42750,MARS,,,42141,,,,,,,,,,,,,,,,,,,1995-12-25,F,,,,,01.2J,NAF1993,N,4.246949,46.157113,0.42,street,Route de la Gonne 42750 Mars,42141_0063,G,ROUTE DE LA GONNE,
345281711,00019,34528171100019,O,1988-05-18,NN,,,2017-12-30T03:51:35,false,4,,,,,LE BOURG,42750,MARS,,,42141,,,,,,,,,,,,,,,,,,,2017-12-19,F,,,,,68.20B,NAFRev2,N,4.240244,46.153621,0.31,locality,Les Fours à Chaux 42750 Mars,42141_B015,G,LES FOURS A CHAUX,
350777116,00012,35077711600012,O,1989-03-01,NN,,,2008-01-04T23:20:36,true,3,,,,,CARTELIER,42750,MARS,,,42141,,,,,,,,,,,,,,,,,,,2008-01-01,A,,,,,01.42Z,NAFRev2,N,4.252376,46.154267,0.92,street,Chemin de Cartelier 42750 Mars,42141_0023,G,CHEMIN DE CARTELIER,
351706825,00020,35170682500020,O,1998-03-28,NN,,,2008-08-29T05:25:16,true,4,,,,,LE MEPLIE,42750,MARS,,,42141,,,,,,,,,,,,,,,,,,,2008-01-01,F,,,,,68.20B,NAFRev2,N,4.266421,46.147263,0.74,street,Chemin du Meplié 42750 Mars,42141_0079,G,CHEMIN DU MEPLIE,
378798573,00036,37879857300036,O,2002-07-16,NN,,,2008-02-13T09:18:02,true,5,,,,LD,LE PONT DE MARS,42750,MARS,,,42141,,,,,,,,,,,,,,,,,,,2008-01-01,A,,,,,56.10A,NAFRev2,N,4.247753,46.1526,0.71,street,Route du Pont de Fer 42750 Mars,42141_0091,G,ROUTE DU PONT DE FER,
378987358,00066,37898735800066,O,2012-08-18,,,3230ZZ,2018-01-17T03:56:36,true,2,,,,,LE MEPLIE,42750,MARS,,,42141,,,,,,,,,,,,,,,,,,,2017-12-31,F,PLEIN AIR DESIGN LA FABRIQUE DU MEPLIE,,,PLEIN AIR DESIGN - LA FABRIQUE DU MEPLIE,32.30Z,NAFRev2,N,4.266421,46.147263,0.74,street,Chemin du Meplié 42750 Mars,42141_0079,G,CHEMIN DU MEPLIE,
381259902,00017,38125990200017,O,1991-04-01,,,,2008-01-04T21:53:30,true,4,,,,,MAIRIE,42750,MARS,,,42141,,,,,,,,,,,,,,,,,,,2008-01-01,A,,,,,88.91A,NAFRev2,N,4.254547,46.143503,0.51,street,Chemin de la Scierie 42750 Mars,42141_0107,G,CHEMIN DE LA SCIERIE,
391461944,00012,39146194400012,O,1987-12-14,NN,,,2008-01-04T23:53:01,true,3,CHEZ MR TOURNARE ALAIN,,,,LA CROIX DES CROS,42750,MARS,,,42141,,,,,,,,,,,,,,,,,,,2008-01-01,A,,,,,93.11Z,NAFRev2,N,4.246321,46.165386,0.94,locality,La Croix des Cros 42750 Mars,42141_B011,G,LA CROIX DES CROS,
394600381,00047,39460038100047,O,2016-04-21,,,,2021-04-19T11:59:19,false,2,,9,,BD,DU BARON DU MARAIS,42750,MARS,,,42141,,,,,,,,,,,,,,,,,,,2021-04-09,F,,,,,68.31Z,NAFRev2,N,4.0643001,46.041358,0.72,poi.park,Parc Baron du Marais Roanne,https://osm.org/way/551952196,G,,
394806871,00015,39480687100015,O,1994-04-20,NN,,,,true,1,,,,,LA CROIX DES CROS,42750,MARS,,,42141,,,,,,,,,,,,,,,,,,,2002-03-31,F,,,,,52.6E,NAF1993,N,4.246321,46.165386,0.94,locality,La Croix des Cros 42750 Mars,42141_B011,G,LA CROIX DES CROS,
399194083,00016,39919408300016,O,1981-01-01,NN,,,2017-12-22T07:57:54,true,4,LES CHEZOS,,,,LA GAUNE,42750,MARS,,,42141,,,,,,,,,,,,,,,,,,,2017-12-31,F,,,,,01.42Z,NAFRev2,N,4.246949,46.157113,0.52,street,Route de la Gonne 42750 Mars,42141_0063,G,ROUTE DE LA GONNE,
399242791,00016,39924279100016,O,1965-01-01,NN,,,,true,1,,,,,MONTADRE,42750,MARS,,,42141,,,,,,,,,,,,,,,,,,,1998-06-30,F,,,,,01.2A,NAF1993,N,,,0,,,,,,
399249499,00019,39924949900019,O,1989-01-01,NN,,,2019-01-03T03:52:13,true,5,,,,,LES BRUYERES,42750,MARS,,,42141,,,,,,,,,,,,,,,,,,,2018-12-31,A,,,,,68.20B,NAFRev2,N,4.25241,46.141583,0.77,street,Chemin des Bruyères 42750 Mars,42141_0015,G,CHEMIN DES BRUYERES,
400275590,00018,40027559000018,O,1995-01-01,NN,,,,true,1,,,,,VARLOGE,42750,MARS,,,42141,,,,,,,,,,,,,,,,,,,2002-07-31,F,,,,,01.2A,NAF1993,N,,,0,,,,,,
402110233,00010,40211023300010,O,,NN,,,,true,1,,,,,LE BOURG,42750,MARS,,,42141,,,,,,,,,,,,,,,,,,,1995-09-01,F,,,,,02.0B,NAF1993,N,4.240244,46.153621,0.31,locality,Les Fours à Chaux 42750 Mars,42141_B015,G,LES FOURS A CHAUX,
402578462,00010,40257846200010,O,1990-01-01,NN,,,2006-10-28T03:07:10,true,3,,,,,,42750,MARS,,,42141,,,,,,,,,,,,,,,,,,,2005-12-31,F,,,,,01.3Z,NAFRev1,N,,,0,,,,,,
403427875,00014,40342787500014,O,1996-01-02,NN,,,,true,1,,,,LD,LE PONT DE MARS,42750,MARS,,,42141,,,,,,,,,,,,,,,,,,,2002-06-30,F,,,,,55.3A,NAF1993,N,4.247753,46.1526,0.71,street,Route du Pont de Fer 42750 Mars,42141_0091,G,ROUTE DU PONT DE FER,
403629702,00016,40362970200016,O,1966-01-01,NN,,,,true,1,,,,,AUX ROCHES,42750,MARS,,,42141,,,,,,,,,,,,,,,,,,,2000-12-31,F,,,,,01.2A,NAF1993,N,4.269392,46.141025,0.59,street,Chemin de Montée des Roches 42750 Mars,42141_yjw7v0,G,CHEMIN DE MONTEE DES ROCHES,
403678956,00026,40367895600026,O,2000-12-31,NN,,,2008-01-04T20:27:04,true,3,,,,,LES CHEZOS,42750,MARS,,,42141,,,,,,,,,,,,,,,,,,,2008-01-01,A,,,,,68.20B,NAFRev2,N,4.279402,46.151156,0.76,street,Allée des Chézos 42750 Mars,42141_0031,G,ALLEE DES CHEZOS,
405471442,00013,40547144200013,O,,,,,,true,1,,,,LD,AU BOURG,42750,MARS,,,42141,,,,,,,,,,,,,,,,,,,1984-12-25,F,,,,,67.01,NAP,N,-1.9115621,47.1089349,0.88,poi.track,Chemin du Breil au Bourg Chaumes-en-Retz,https://osm.org/way/283246644,G,,
406072207,00011,40607220700011,O,,,,,,true,1,,,,,,42750,MARS,,,42141,,,,,,,,,,,,,,,,,,,1984-12-25,F,,,,,39.01,NAP,N,,,0,,,,,,
406271411,00018,40627141100018,O,,,,,,true,1,,,,,,42750,MARS,,,42141,,,,,,,,,,,,,,,,,,,1984-12-25,F,,,,,00.97,NAP,N,,,0,,,,,,
406471268,00010,40647126800010,O,,,,,,true,1,,,,,,42750,MARS,,,42141,,,,,,,,,,,,,,,,,,,1995-06-30,F,,,,,52.1B,NAF1993,N,,,0,,,,,,
407532084,00057,40753208400057,O,2013-03-18,00,2018,,2021-02-23T11:29:45,true,2,CHEZ MELLE PERARD,,,LD,LA GONNE,42750,MARS,,,42141,,,,,,,,,,,,,,,,,,,2014-01-05,A,,,,,90.01Z,NAFRev2,O,4.246949,46.157113,0.93,street,Route de la Gonne 42750 Mars,42141_0063,G,ROUTE DE LA GONNE,
407635945,00014,40763594500014,O,1996-06-01,NN,,,2012-05-05T05:33:29,false,5,,,,,LE BOURG,42750,MARS,,,42141,,,,,,,,,,,,,,,,,,,2010-12-31,F,,,,,47.11B,NAFRev2,O,4.240244,46.153621,0.31,locality,Les Fours à Chaux 42750 Mars,42141_B015,G,LES FOURS A CHAUX,
407635945,00022,40763594500022,O,2012-01-01,,,,2016-02-10T05:14:29,true,2,,,,,LES PHILIPPES,42750,MARS,,,42141,,,,,,,,,,,,,,,,,,,2015-12-31,F,,,,,90.03B,NAFRev2,N,4.246593,46.157612,0.57,street,Impasse des Phillipes 42750 Mars,42141_0084,G,IMPASSE DES PHILLIPES,
409276292,00011,40927629200011,O,1980-01-01,NN,,,2010-02-10T05:27:47,true,4,,,,,ESSERT1NE,42750,MARS,,,42141,,,,,,,,,,,,,,,,,,,2008-01-01,F,,,,,01.42Z,NAFRev2,N,,,0,,,,,,
409276300,00012,40927630000012,O,1980-01-01,NN,,,,true,1,,,,,AUX B01S,42750,MARS,,,42141,,,,,,,,,,,,,,,,,,,1998-02-28,F,,,,,01.1A,NAF1993,N,,,0,,,,,,
409276318,00014,40927631800014,O,1980-01-01,NN,,,2008-01-04T21:24:24,true,3,,,,,CARTEL1ER,42750,MARS,,,42141,,,,,,,,,,,,,,,,,,,2008-01-01,A,,,,,01.42Z,NAFRev2,N,4.252376,46.154267,0.65,street,Chemin de Cartelier 42750 Mars,42141_0023,G,CHEMIN DE CARTELIER,
409276326,00017,40927632600017,O,1980-12-31,NN,,,,true,4,,,,,LA CROIX DE GROS,42750,MARS,,,42141,,,,,,,,,,,,,,,,,,,2002-12-31,F,,,,,01.1A,NAF1993,N,4.243269,46.165889,0.77,street,Chemin de la Croix des Cros 42750 Mars,42141_0047,G,CHEMIN DE LA CROIX DES CROS,
409276334,00011,40927633400011,O,1980-01-01,NN,,,2009-12-23T05:08:54,true,4,,,,,AU B0URG,42750,MARS,,,42141,,,,,,,,,,,,,,,,,,,2009-12-31,F,,,,,01.47Z,NAFRev2,N,,,0,,,,,,
409276342,00014,40927634200014,O,1980-12-31,NN,,,2021-02-23T11:31:26,true,4,,,,,LES CHEZOS,42750,MARS,,,42141,,,,,,,,,,,,,,,,,,,2012-11-01,A,,,,,68.20B,NAFRev2,N,4.279402,46.151156,0.76,street,Allée des Chézos 42750 Mars,42141_0031,G,ALLEE DES CHEZOS,
409276359,00018,40927635900018,O,1992-11-12,NN,,,2015-01-08T03:38:43,true,4,,,,,A ESSERTINE,42750,MARS,,,42141,,,,,,,,,,,,,,,,,,,2014-12-31,F,,,,,01.41Z,NAFRev2,N,4.259162,46.14754,0.77,street,Chemin du Bas d’Essertine 42750 Mars,42141_0005,G,CHEMIN DU BAS D ESSERTINE,
409276367,00011,40927636700011,O,1995-04-01,NN,,,,true,4,,,,,AU CARTELIER,42750,MARS,,,42141,,,,,,,,,,,,,,,,,,,1999-01-01,F,,,,,01.1A,NAF1993,N,4.251721,46.156015,0.86,street,Hameau Cartelier 42750 Mars,42141_lja0qx,G,HAMEAU CARTELIER,
411157746,00016,41115774600016,O,1980-01-01,NN,,,2014-01-29T08:57:26,true,4,,,,,FOUR A CHAUX,42750,MARS,,,42141,,,,,,,,,,,,,,,,,,,2013-12-31,F,,,,,01.42Z,NAFRev2,N,4.240799,46.153467,0.92,street,Chemin du Four à Chaux 42750 Mars,42141_0061,G,CHEMIN DU FOUR A CHAUX,
411157753,00012,41115775300012,O,1996-06-01,NN,,,2008-01-04T21:54:24,true,3,,,,,LE MEPLIE,42750,MARS,,,42141,,,,,,,,,,,,,,,,,,,2008-01-01,A,,,,,01.24Z,NAFRev2,N,4.266421,46.147263,0.74,street,Chemin du Meplié 42750 Mars,42141_0079,G,CHEMIN DU MEPLIE,
411972045,00016,41197204500016,O,1997-05-02,,,,,true,1,,,,,LES MEPLIERS,42750,MARS,,,42141,,,,,,,,,,,,,,,,,,,2000-12-31,F,,,,,01.4A,NAF1993,N,4.266421,46.147263,0.52,street,Chemin du Meplié 42750 Mars,42141_0079,G,CHEMIN DU MEPLIE,
413375429,00011,41337542900011,O,1997-03-01,,,,,true,1,,,,,LE MEPLIE,42750,MARS,,,42141,,,,,,,,,,,,,,,,,,,1999-02-10,F,,,,,01.2C,NAF1993,N,4.266421,46.147263,0.74,street,Chemin du Meplié 42750 Mars,42141_0079,G,CHEMIN DU MEPLIE,
419484142,00023,41948414200023,O,2008-08-15,NN,,,2014-07-08T01:53:46,false,2,,,,,VILLERET,42750,MARS,,,42141,,,,,,,,,,,,,,,,,,,2008-12-23,F,,,,,43.32A,NAFRev2,O,4.262596,46.151865,0.92,street,Chemin de Villeret 42750 Mars,42141_0117,G,CHEMIN DE VILLERET,
419649165,00018,41964916500018,O,1998-03-01,NN,,,2008-01-04T23:40:12,true,3,,,,,AUX BOIS,42750,MARS,,,42141,,,,,,,,,,,,,,,,,,,2008-01-01,A,,,,,01.42Z,NAFRev2,N,4.239105,46.161993,0.51,street,Allée des Bois 42750 Mars,42141_0011,G,ALLEE DES BOIS,
419751177,00017,41975117700017,O,1998-07-01,NN,,,2021-02-23T11:40:41,true,3,,46,,MTE,DES ROCHES,42750,MARS,,,42141,,,,,,,,,,,,,,,,,,,2008-01-01,A,,,,,01.42Z,NAFRev2,N,4.26053,46.135908,0.79,housenumber,46 Montée des Roches 42750 Mars,42141_0103_00046,G,46 MONTEE DES ROCHES,
420014342,00018,42001434200018,O,1998-10-01,,,,,true,1,,,,LD,LES PHILIPPES,42750,MARS,,,42141,,,,,,,,,,,,,,,,,,,1999-06-08,F,,,,,51.1R,NAF1993,N,4.246593,46.157612,0.57,street,Impasse des Phillipes 42750 Mars,42141_0084,G,IMPASSE DES PHILLIPES,
422132894,00011,42213289400011,O,1999-03-01,,,,,true,3,,,,,LA RIVIERE,42750,MARS,,,42141,,,,,,,,,,,,,,,,,,,1999-12-25,F,,,,,51.3T,NAF1993,N,4.234607,46.158917,0.92,street,Chemin de la Rivière 42750 Mars,42141_0099,G,CHEMIN DE LA RIVIERE,
422870352,00016,42287035200016,O,1999-01-01,NN,,,2019-02-13T04:00:05,true,4,,,,,LE CARTELIER,42750,MARS,,,42141,,,,,,,,,,,,,,,,,,,2018-12-31,F,,,,,01.42Z,NAFRev2,N,4.251119,46.1549,0.91,street,Le Raidillon de Cartelier 42750 Mars,42141_0093,G,LE RAIDILLON DE CARTELIER,
424657427,00029,42465742700029,O,2016-04-10,,,,2021-02-23T11:46:54,true,1,,,,,LE BOURG,42750,MARS,,,42141,,,,,,,,,,,,,,,,,,,2016-04-10,A,,,,,85.59A,NAFRev2,N,4.240244,46.153621,0.31,locality,Les Fours à Chaux 42750 Mars,42141_B015,G,LES FOURS A CHAUX,
427476023,00010,42747602300010,O,,NN,,,,true,1,,,,,ECOLE DE FILLES,42750,MARS,,,42141,,,,,,,,,,,,,,,,,,,2003-09-24,F,,,,,85.3K,NAFRev1,N,4.245974,46.15291,0.52,street,Place de l’École 42750 Mars,42141_0055,G,PLACE DE L ECOLE,
429132574,00014,42913257400014,O,1990-07-08,NN,,,2008-01-05T01:35:31,true,3,,,,,LE BOURG,42750,MARS,,,42141,,,,,,,,,,,,,,,,,,,2008-01-01,A,,,,,90.04Z,NAFRev2,N,4.240244,46.153621,0.31,locality,Les Fours à Chaux 42750 Mars,42141_B015,G,LES FOURS A CHAUX,
430214312,00026,43021431200026,O,2002-05-28,NN,,4321AB,2020-02-07T04:01:26,true,5,,,,,LIEU DU MEPLIE,42750,MARS,,,42141,,,,,,,,,,,,,,,,,,,2020-02-03,F,,,,,43.21A,NAFRev2,N,4.266421,46.147263,0.67,street,Chemin du Meplié 42750 Mars,42141_0079,G,CHEMIN DU MEPLIE,
432195840,00017,43219584000017,O,1935-01-01,,,,2006-11-25T17:00:52,true,1,,,,,,42750,MARS,,,42141,,,,,,,,,,,,,,,,,,,1998-12-31,F,,,,,66.0G,NAF1993,N,,,0,,,,,,
432285195,00025,43228519500025,O,2003-09-18,NN,,,2014-07-08T02:09:01,false,6,,,,,LE BOURG,42750,MARS,,,42141,,,,,,,,,,,,,,,,,,,2009-03-24,F,,,,,43.32A,NAFRev2,O,4.240244,46.153621,0.31,locality,Les Fours à Chaux 42750 Mars,42141_B015,G,LES FOURS A CHAUX,
432909547,00023,43290954700023,O,2017-03-09,,,,2020-04-25T03:38:45,true,2,,,,,ESSERTINE,42750,MARS,,,42141,,,,,,,,,,,,,,,,,,,2020-04-16,F,,,,,46.19B,NAFRev2,N,4.259162,46.14754,0.91,street,Chemin du Bas d’Essertine 42750 Mars,42141_0005,G,CHEMIN DU BAS D ESSERTINE,
433567716,00025,43356771600025,O,2010-09-01,,,,2011-12-20T09:28:14,false,2,,,,,VILLERET,42750,MARS,,,42141,,,,,,,,,,,,,,,,,,,2011-10-31,F,L'EFFET DU LOGIS,,,,74.10Z,NAFRev2,N,4.262596,46.151865,0.92,street,Chemin de Villeret 42750 Mars,42141_0117,G,CHEMIN DE VILLERET,
434293031,00010,43429303100010,O,2001-01-01,NN,,,2021-02-23T13:16:08,true,3,,,,,1474 MONTEE DES ROCHES,42750,MARS,,,42141,,,,,,,,,,,,,,,,,,,2008-01-01,A,,,,,01.42Z,NAFRev2,N,4.274528,46.141356,0.95,housenumber,1474 Montée des Roches 42750 Mars,42141_0103_01474,G,1474 MONTEE DES ROCHES,
438912495,00019,43891249500019,O,2001-08-10,NN,,,2020-04-02T03:47:57,true,4,CHEZ MR APPEYROUX PIERRE,,,,LE MEPLIE,42750,MARS,,,42141,,,,,,,,,,,,,,,,,,,2019-07-31,F,,,,,68.20B,NAFRev2,N,4.266421,46.147263,0.74,street,Chemin du Meplié 42750 Mars,42141_0079,G,CHEMIN DU MEPLIE,
440064293,00028,44006429300028,O,2011-09-12,,,,2012-10-21T05:14:24,false,2,,,,,LE BOURG,42750,MARS,,,42141,,,,,,,,,,,,,,,,,,,2012-09-30,F,,,,,56.10A,NAFRev2,N,4.240244,46.153621,0.31,locality,Les Fours à Chaux 42750 Mars,42141_B015,G,LES FOURS A CHAUX,
440320596,00016,44032059600016,O,2002-01-02,NN,,1089ZZ,2015-12-02T05:45:12,true,5,,,,,LES FOURS A CHAUX,42750,MARS,,,42141,,,,,,,,,,,,,,,,,,,2014-01-01,F,,,,,10.71B,NAFRev2,O,4.240244,46.153621,0.94,locality,Les Fours à Chaux 42750 Mars,42141_B015,G,LES FOURS A CHAUX,
441501210,00013,44150121000013,O,2002-04-01,NN,,,2008-09-24T10:20:17,false,3,,,,,LA RIVIERE,42750,MARS,,,42141,,,,,,,,,,,,,,,,,,,2008-01-01,A,,,,,68.20B,NAFRev2,N,4.234607,46.158917,0.92,street,Chemin de la Rivière 42750 Mars,42141_0099,G,CHEMIN DE LA RIVIERE,
443019641,00010,44301964100010,O,2002-08-01,NN,,,,true,3,,,,LD,VALORGE,42750,MARS,,,42141,,,,,,,,,,,,,,,,,,,2003-12-31,F,,,,,01.2A,NAFRev1,N,4.239045,46.147904,0.91,street,Chemin de Valorge 42750 Mars,42141_0115,G,CHEMIN DE VALORGE,
449725613,00011,44972561300011,O,2003-01-01,NN,,,2008-01-04T23:52:36,true,3,,,,,LES AGUETS,42750,MARS,,,42141,,,,,,,,,,,,,,,,,,,2008-01-01,A,,,,,55.20Z,NAFRev2,N,4.253306,46.150564,0.76,street,Chemin des Aguets 42750 Mars,42141_0001,G,CHEMIN DES AGUETS,
450909411,00024,45090941100024,O,2008-01-01,,,,2012-06-08T14:53:10,true,1,,,,,FONCONTAL,42750,MARS,,,42141,,,,,,,,,,,,,,,,,,,2008-01-01,A,,,,,02.10Z,NAFRev2,N,4.278695,46.144695,0.64,street,Allée de Foncomtal 42750 Mars,42141_0059,G,ALLEE DE FONCOMTAL,
451580369,00010,45158036900010,O,2004-01-01,NN,,,2017-10-02T14:09:51,false,3,,,,LD,VALORGES,42750,MARS,,,42141,,,,,,,,,,,,,,,,,,,2006-01-01,F,,,,,01.2A,NAFRev1,N,4.239045,46.147904,0.71,street,Chemin de Valorge 42750 Mars,42141_0115,G,CHEMIN DE VALORGE,