siren,nic,siret,statutDiffusionEtablissement,dateCreationEtablissement,trancheEffectifsEtablissement,anneeEffectifsEtablissement,activitePrincipaleRegistreMetiersEtablissement,dateDernierTraitementEtablissement,etablissementSiege,nombrePeriodesEtablissement,complementAdresseEtablissement,numeroVoieEtablissement,indiceRepetitionEtablissement,typeVoieEtablissement,libelleVoieEtablissement,codePostalEtablissement,libelleCommuneEtablissement,libelleCommuneEtrangerEtablissement,distributionSpecialeEtablissement,codeCommuneEtablissement,codeCedexEtablissement,libelleCedexEtablissement,codePaysEtrangerEtablissement,libellePaysEtrangerEtablissement,complementAdresse2Etablissement,numeroVoie2Etablissement,indiceRepetition2Etablissement,typeVoie2Etablissement,libelleVoie2Etablissement,codePostal2Etablissement,libelleCommune2Etablissement,libelleCommuneEtranger2Etablissement,distributionSpeciale2Etablissement,codeCommune2Etablissement,codeCedex2Etablissement,libelleCedex2Etablissement,codePaysEtranger2Etablissement,libellePaysEtranger2Etablissement,dateDebut,etatAdministratifEtablissement,enseigne1Etablissement,enseigne2Etablissement,enseigne3Etablissement,denominationUsuelleEtablissement,activitePrincipaleEtablissement,nomenclatureActivitePrincipaleEtablissement,caractereEmployeurEtablissement,longitude,latitude,geo_score,geo_type,geo_adresse,geo_id,geo_ligne,geo_l4,geo_l5
215405002,00019,21540500200019,O,1983-03-01,02,2019,,2021-10-27T08:08:55,true,3,,10,,RUE,DU MOULIN,54170,SELAINCOURT,,,54500,,,,,,,,,,,,,,,,,,,2008-01-01,A,MAIRIE,,,,84.11Z,NAFRev2,N,5.966223,48.500823,0.94,housenumber,10 Rue du Moulin 54170 Selaincourt,54500_0021_00010,G,10 RUE DU MOULIN,
215405002,00027,21540500200027,O,1997-04-01,NN,,,2008-01-04T18:36:20,false,3,,10,,RUE,DU MOULIN,54170,SELAINCOURT,,,54500,,,,,,,,,,,,,,,,,,,2008-01-01,A,SCE EAUX,,,,36.00Z,NAFRev2,N,5.966223,48.500823,0.94,housenumber,10 Rue du Moulin 54170 Selaincourt,54500_0021_00010,G,10 RUE DU MOULIN,
215405002,00035,21540500200035,O,1997-04-01,NN,,,2008-01-04T18:36:20,false,3,,10,,RUE,DU MOULIN,54170,SELAINCOURT,,,54500,,,,,,,,,,,,,,,,,,,2008-01-01,A,SCE ASSAINISSEMENT,,,,37.00Z,NAFRev2,N,5.966223,48.500823,0.94,housenumber,10 Rue du Moulin 54170 Selaincourt,54500_0021_00010,G,10 RUE DU MOULIN,
215405002,00043,21540500200043,O,1991-01-01,NN,,,2016-01-12T00:10:29,false,3,,10,,RUE,DU MOULIN,54170,SELAINCOURT,,,54500,,,,,,,,,,,,,,,,,,,2008-01-01,A,EXPLOITATION FORESTIERE,,,,02.20Z,NAFRev2,N,5.966223,48.500823,0.94,housenumber,10 Rue du Moulin 54170 Selaincourt,54500_0021_00010,G,10 RUE DU MOULIN,
265407015,00014,26540701500014,O,1996-01-01,NN,,,2008-01-04T19:00:45,true,3,MAIRIE,10,,RUE,DU MOULIN,54170,SELAINCOURT,,,54500,,,,,,,,,,,,,,,,,,,2008-01-01,A,CCAS,,,,88.99B,NAFRev2,N,5.966223,48.500823,0.94,housenumber,10 Rue du Moulin 54170 Selaincourt,54500_0021_00010,G,10 RUE DU MOULIN,
295400055,00014,29540005500014,O,1983-08-10,NN,,,2013-03-20T14:36:48,true,4,MAIRIE,10,,RUE,DU MOULIN,54170,SELAINCOURT,,,54500,,,,,,,,,,,,,,,,,,,2013-03-07,F,,,,,42.99Z,NAFRev2,N,5.966223,48.500823,0.94,housenumber,10 Rue du Moulin 54170 Selaincourt,54500_0021_00010,G,10 RUE DU MOULIN,
300721958,00019,30072195800019,O,,,,,,true,1,,,,,,54170,SELAINCOURT,,,54500,,,,,,,,,,,,,,,,,,,1984-12-25,F,,,,,67.04,NAP,N,,,0,,,,,,
303785471,00010,30378547100010,O,1900-01-01,NN,,,2017-05-19T08:48:52,true,4,,,,RUE,DE L EGLISE,54170,SELAINCOURT,,,54500,,,,,,,,,,,,,,,,,,,2016-12-31,F,,,,,86.21Z,NAFRev2,N,5.968959,48.499714,0.95,street,Rue de l’Eglise 54170 Selaincourt,54500_0020,G,RUE DE L EGLISE,
319445797,00024,31944579700024,O,,,,,,true,1,,,,,,54170,SELAINCOURT,,,54500,,,,,,,,,,,,,,,,,,,1985-12-25,F,,,,,55.72,NAP,N,,,0,,,,,,
321345647,00010,32134564700010,O,,,,,,true,1,,,,RUE,DE LOUARD,54170,SELAINCOURT,,,54500,,,,,,,,,,,,,,,,,,,1984-12-25,F,,,,,55.72,NAP,N,5.968068,48.500177,0.61,street,Rue du Couard 54170 Selaincourt,54500_0022,G,RUE DU COUARD,
323801134,00012,32380113400012,O,1981-12-30,NN,,,2017-05-04T03:23:55,true,3,,7,,RUE,DU MOULIN,54170,SELAINCOURT,,,54500,,,,,,,,,,,,,,,,,,,2008-01-01,A,,,,,01.42Z,NAFRev2,N,5.966978,48.500169,0.94,housenumber,7 Rue du Moulin 54170 Selaincourt,54500_0021_00007,G,7 RUE DU MOULIN,
349652719,00015,34965271900015,O,1989-01-23,NN,,,,false,4,,,,RUE,DE L EGLISE,54170,SELAINCOURT,,,54500,,,,,,,,,,,,,,,,,,,1993-12-23,F,,,,,51.4S,NAF1993,N,5.968959,48.499714,0.95,street,Rue de l’Eglise 54170 Selaincourt,54500_0020,G,RUE DE L EGLISE,
350261798,00036,35026179800036,O,2007-07-01,,,,2008-06-22T05:56:06,true,3,,40,,RUE,DE L'EGLISE,54170,SELAINCOURT,,,54500,,,,,,,,,,,,,,,,,,,2008-01-08,F,EQUI-SAINTOIS,,,,01.43Z,NAFRev2,N,5.968672,48.499524,0.95,housenumber,40 Rue de l’Eglise 54170 Selaincourt,54500_0020_00040,G,40 RUE DE L EGLISE,
395158272,00017,39515827200017,O,,NN,,,,true,1,,41,,RUE,DE L'EGLISE,54170,SELAINCOURT,,,54500,,,,,,,,,,,,,,,,,,,1994-08-15,F,,,,,92.3A,NAF1993,N,5.966256,48.499199,0.95,housenumber,41 Rue de l’Eglise 54170 Selaincourt,54500_0020_00041,G,41 RUE DE L EGLISE,
399114263,00011,39911426300011,O,1994-11-28,NN,,,2008-11-08T01:06:17,false,3,,38,,RUE,DE L EGLISE,54170,SELAINCOURT,,,54500,,,,,,,,,,,,,,,,,,,1995-12-01,F,,,,,74.8K,NAF1993,N,5.968781,48.499545,0.95,housenumber,38 Rue de l’Eglise 54170 Selaincourt,54500_0020_00038,G,38 RUE DE L EGLISE,
399471747,00010,39947174700010,O,1995-01-02,NN,,,,false,3,,38,,RUE,DE L'EGLISE,54170,SELAINCOURT,,,54500,,,,,,,,,,,,,,,,,,,1997-12-15,F,,,,,70.2A,NAF1993,O,5.968781,48.499545,0.95,housenumber,38 Rue de l’Eglise 54170 Selaincourt,54500_0020_00038,G,38 RUE DE L EGLISE,
400269965,00010,40026996500010,O,1995-04-01,NN,,,2008-11-08T01:08:42,false,4,,1,,RUE,DU BOIS,54170,SELAINCOURT,,,54500,,,,,,,,,,,,,,,,,,,2000-08-01,F,,,,,45.3F,NAF1993,O,5.964968,48.49918,0.95,housenumber,1 Rue du Bois 54170 Selaincourt,54500_0010_00001,G,1 RUE DU BOIS,
400613170,00010,40061317000010,O,,NN,,,,true,1,,38,,RUE,DE L'EGLISE,54170,SELAINCOURT,,,54500,,,,,,,,,,,,,,,,,,,1996-06-11,F,,,,,45.3E,NAF1993,O,5.968781,48.499545,0.95,housenumber,38 Rue de l’Eglise 54170 Selaincourt,54500_0020_00038,G,38 RUE DE L EGLISE,
407886647,00012,40788664700012,O,1969-01-01,NN,,,2007-02-01T16:37:12,true,3,,,,RUE,DE L'EGLISE,54170,SELAINCOURT,,,54500,,,,,,,,,,,,,,,,,,,2006-12-31,F,,,,,01.1A,NAFRev1,N,5.968959,48.499714,0.95,street,Rue de l’Eglise 54170 Selaincourt,54500_0020,G,RUE DE L EGLISE,
407886654,00018,40788665400018,O,1991-01-01,NN,,,,true,4,,,,RUE,DE L EGLISE,54170,SELAINCOURT,,,54500,,,,,,,,,,,,,,,,,,,2002-05-27,F,,,,,01.1A,NAF1993,N,5.968959,48.499714,0.95,street,Rue de l’Eglise 54170 Selaincourt,54500_0020,G,RUE DE L EGLISE,
408588390,00018,40858839000018,O,1996-07-08,NN,,,2012-04-06T11:12:57,true,3,MME MONIQUE HARDY,30,,RUE,DU BOIS,54170,SELAINCOURT,,,54500,,,,,,,,,,,,,,,,,,,2008-01-01,A,,,,,93.29Z,NAFRev2,N,5.960535,48.500422,0.95,housenumber,30 Rue du Bois 54170 Selaincourt,54500_0010_00030,G,30 RUE DU BOIS,
413759218,00014,41375921800014,O,1997-08-19,NN,,,2008-01-04T22:38:07,true,3,MR MALGRAS DAVID,19,,RUE,DE L EGLISE,54170,SELAINCOURT,,,54500,,,,,,,,,,,,,,,,,,,2008-01-01,A,,,,,68.20A,NAFRev2,N,5.968631,48.499581,0.95,housenumber,19 Rue de l’Eglise 54170 Selaincourt,54500_0020_00019,G,19 RUE DE L EGLISE,
424256121,00015,42425612100015,O,1999-03-19,NN,,,2008-01-05T00:54:34,true,3,MR MALGRAS DAVID,19,,RUE,DE L EGLISE,54170,SELAINCOURT,,,54500,,,,,,,,,,,,,,,,,,,2008-01-01,A,,,,,68.20A,NAFRev2,N,5.968631,48.499581,0.95,housenumber,19 Rue de l’Eglise 54170 Selaincourt,54500_0020_00019,G,19 RUE DE L EGLISE,
425123924,00010,42512392400010,O,1999-11-10,NN,,,2008-11-08T01:49:04,true,3,,23,,RUE,DE L'EGLISE,54170,SELAINCOURT,,,54500,,,,,,,,,,,,,,,,,,,2004-03-31,F,,,,,15.9A,NAFRev1,N,5.967212,48.499106,0.95,housenumber,23 Rue de l’Eglise 54170 Selaincourt,54500_0020_00023,G,23 RUE DE L EGLISE,
428029243,00014,42802924300014,O,1993-01-01,NN,,,2008-01-05T01:21:32,true,3,MAIRIE,,,,,54170,SELAINCOURT,,,54500,,,,,,,,,,,,,,,,,,,2008-01-01,A,,,,,94.99Z,NAFRev2,N,,,0,,,,,,
428037592,00014,42803759200014,O,1985-01-01,NN,,,2007-06-04T13:08:04,true,3,,,,,,54170,SELAINCOURT,,,54500,,,,,,,,,,,,,,,,,,,2000-12-31,F,,,,,01.3Z,NAF1993,N,,,0,,,,,,
428212161,00015,42821216100015,O,1977-04-06,NN,,,2019-04-26T03:56:25,true,3,,19,,RUE,DE L EGLISE,54170,SELAINCOURT,,,54500,,,,,,,,,,,,,,,,,,,2008-01-01,A,,,,,68.20A,NAFRev2,N,5.968631,48.499581,0.95,housenumber,19 Rue de l’Eglise 54170 Selaincourt,54500_0020_00019,G,19 RUE DE L EGLISE,
430318261,00020,43031826100020,O,2017-12-31,,,,2020-01-09T03:45:33,true,2,,19,,RUE,DU BOIS,54170,SELAINCOURT,,,54500,,,,,,,,,,,,,,,,,,,2019-12-31,F,,,,,47.89Z,NAFRev2,N,5.962428,48.498946,0.95,housenumber,19 Rue du Bois 54170 Selaincourt,54500_0010_00019,G,19 RUE DU BOIS,
448547299,00025,44854729900025,O,2008-06-05,,,,2011-03-15T05:10:24,true,2,,54,,RUE,DE L EGLISE,54170,SELAINCOURT,,,54500,,,,,,,,,,,,,,,,,,,2009-01-31,F,,,,,82.19Z,NAFRev2,N,5.966689,48.499055,0.95,housenumber,54 Rue de l’Eglise 54170 Selaincourt,54500_0020_00054,G,54 RUE DE L EGLISE,
479273567,00012,47927356700012,O,2004-10-01,NN,,4321AB,2015-03-17T01:21:03,false,4,,59,,RUE,DU BOIS,54170,SELAINCOURT,,,54500,,,,,,,,,,,,,,,,,,,2008-09-02,A,,,,,70.10Z,NAFRev2,O,5.962292,48.501667,0.95,housenumber,59 Rue du Bois 54170 Selaincourt,54500_0010_00059,G,59 RUE DU BOIS,
479273567,00038,47927356700038,O,2009-01-01,,,4321AB,2014-06-27T00:42:25,false,1,,57,,RUE,DU BOIS,54170,SELAINCOURT,,,54500,,,,,,,,,,,,,,,,,,,2009-01-01,A,,,,,43.21A,NAFRev2,N,5.962136,48.501637,0.95,housenumber,57 Rue du Bois 54170 Selaincourt,54500_0010_00057,G,57 RUE DU BOIS,
490485091,00014,49048509100014,O,2006-05-16,NN,,4120BB,2018-04-06T04:15:28,true,3,,27,,RUE,DE L EGLISE,54170,SELAINCOURT,,,54500,,,,,,,,,,,,,,,,,,,2008-01-01,A,,,,,68.20B,NAFRev2,O,5.967431,48.49948,0.95,housenumber,27 Rue de l’Eglise 54170 Selaincourt,54500_0020_00027,G,27 RUE DE L EGLISE,
494838311,00012,49483831100012,O,2007-04-15,21,2019,,2021-10-27T08:34:39,true,3,,47,,RUE,DU BOIS,54170,SELAINCOURT,,,54500,,,,,,,,,,,,,,,,,,,2008-01-01,A,,,,,80.10Z,NAFRev2,O,5.961574,48.501404,0.95,housenumber,47 Rue du Bois 54170 Selaincourt,54500_0010_00047,G,47 RUE DU BOIS,
498393115,00015,49839311500015,O,2007-06-11,,,,2014-07-10T00:51:52,true,3,,12,,RUE,DU BOIS,54170,SELAINCOURT,,,54500,,,,,,,,,,,,,,,,,,,2010-05-10,F,,,,,23.19Z,NAFRev2,N,5.961166,48.499526,0.95,housenumber,12 Rue du Bois 54170 Selaincourt,54500_0010_00012,G,12 RUE DU BOIS,
498902634,00019,49890263400019,O,2007-07-01,,,,2008-01-05T01:06:34,true,2,,59,,RUE,DU BOIS,54170,SELAINCOURT,,,54500,,,,,,,,,,,,,,,,,,,2008-01-01,A,,,,,68.20B,NAFRev2,N,5.962292,48.501667,0.95,housenumber,59 Rue du Bois 54170 Selaincourt,54500_0010_00059,G,59 RUE DU BOIS,
499262954,00021,49926295400021,O,2010-05-11,,,2319ZA,2015-03-18T00:11:14,false,3,,12,,RUE,DU BOIS,54170,SELAINCOURT,,,54500,,,,,,,,,,,,,,,,,,,2012-07-26,F,,,,,23.19Z,NAFRev2,N,5.961166,48.499526,0.95,housenumber,12 Rue du Bois 54170 Selaincourt,54500_0010_00012,G,12 RUE DU BOIS,
500414396,00019,50041439600019,O,2007-11-01,,,,2014-07-10T01:00:08,false,2,,15,,RUE,DE L EGLISE,54170,SELAINCOURT,,,54500,,,,,,,,,,,,,,,,,,,2008-01-01,F,SUCRE SALE DU SAINTOIS,,,,47.22Z,NAFRev2,N,5.969176,48.499727,0.95,housenumber,15 Rue de l’Eglise 54170 Selaincourt,54500_0020_00015,G,15 RUE DE L EGLISE,
501664080,00014,50166408000014,O,2007-12-21,,,,2008-01-05T02:17:01,true,2,CHEZ MME TABBAZA,40,,RUE,DE L'EGLISE,54170,SELAINCOURT,,,54500,,,,,,,,,,,,,,,,,,,2008-01-01,A,,,,,68.20B,NAFRev2,N,5.968672,48.499524,0.95,housenumber,40 Rue de l’Eglise 54170 Selaincourt,54500_0020_00040,G,40 RUE DE L EGLISE,
503782096,00013,50378209600013,O,2008-04-09,NN,,,2014-07-10T01:18:15,false,2,,40,,RUE,DE L'EGLISE,54170,SELAINCOURT,,,54500,,,,,,,,,,,,,,,,,,,2010-08-27,F,,,,,43.99C,NAFRev2,O,5.968672,48.499524,0.95,housenumber,40 Rue de l’Eglise 54170 Selaincourt,54500_0020_00040,G,40 RUE DE L EGLISE,
507612281,00026,50761228100026,O,2014-05-02,,,,2016-03-23T03:54:05,true,2,,37,,RUE,DE L'EGLISE,54170,SELAINCOURT,,,54500,,,,,,,,,,,,,,,,,,,2015-09-30,F,,,,,45.31Z,NAFRev2,N,5.966631,48.499246,0.95,housenumber,37 Rue de l’Eglise 54170 Selaincourt,54500_0020_00037,G,37 RUE DE L EGLISE,
510959406,00016,51095940600016,O,2009-02-10,,,,2014-07-29T10:23:02,false,2,,12,,RUE,DU BOIS,54170,SELAINCOURT,,,54500,,,,,,,,,,,,,,,,,,,2010-01-02,F,,,,,23.41Z,NAFRev2,N,5.961166,48.499526,0.95,housenumber,12 Rue du Bois 54170 Selaincourt,54500_0010_00012,G,12 RUE DU BOIS,
519881320,00013,51988132000013,O,2010-01-29,,,,2012-11-10T01:44:03,true,1,,18,,RUE,DU COUARD,54170,SELAINCOURT,,,54500,,,,,,,,,,,,,,,,,,,2010-01-29,A,,,,,56.21Z,NAFRev2,N,5.967821,48.499974,0.94,housenumber,18 Rue du Couard 54170 Selaincourt,54500_0022_00018,G,18 RUE DU COUARD,
520499344,00015,52049934400015,O,2010-02-25,,,,2016-01-12T00:28:59,true,1,,2,B,RUE,DU BOIS,54170,SELAINCOURT,,,54500,,,,,,,,,,,,,,,,,,,2010-02-25,A,,,,,02.20Z,NAFRev2,N,5.964747,48.499079,0.95,housenumber,2b Rue du Bois 54170 Selaincourt,54500_0010_00002_b,G,2B RUE DU BOIS,
528848955,00019,52884895500019,O,2010-12-08,,,,2015-02-03T05:26:35,true,1,,19,,RUE,DE L'EGLISE,54170,SELAINCOURT,,,54500,,,,,,,,,,,,,,,,,,,2010-12-08,A,,,,,68.20B,NAFRev2,N,5.968631,48.499581,0.95,housenumber,19 Rue de l’Eglise 54170 Selaincourt,54500_0020_00019,G,19 RUE DE L EGLISE,
531617777,00010,53161777700010,O,2011-04-01,,,,2013-01-30T10:22:33,true,2,,9,,RUE,DU BOIS,54170,SELAINCOURT,,,54500,,,,,,,,,,,,,,,,,,,2012-12-31,F,,,,,01.49Z,NAFRev2,N,5.963569,48.499113,0.95,housenumber,9 Rue du Bois 54170 Selaincourt,54500_0010_00009,G,9 RUE DU BOIS,
532790094,00017,53279009400017,O,2011-06-23,,,,2012-12-03T07:53:09,false,2,,21,,RUE,DU BOIS,54170,SELAINCOURT,,,54500,,,,,,,,,,,,,,,,,,,2012-07-13,F,,,,,56.10C,NAFRev2,N,5.962013,48.498787,0.95,housenumber,21 Rue du Bois 54170 Selaincourt,54500_0010_00021,G,21 RUE DU BOIS,
783361322,00010,78336132200010,O,1964-01-01,NN,,,,true,1,,,,,,54170,SELAINCOURT,,,54500,,,,,,,,,,,,,,,,,,,1999-06-30,F,,,,,15.9A,NAF1993,N,,,0,,,,,,
783361355,00010,78336135500010,O,,,,,,true,1,,4,,RUE,DE L EGLISE,54170,SELAINCOURT,,,54500,,,,,,,,,,,,,,,,,,,1984-12-25,F,,,,,67.05,NAP,N,5.971779,48.500916,0.95,housenumber,4 Rue de l’Eglise 54170 Selaincourt,54500_0020_00004,G,4 RUE DE L EGLISE,
793583626,00023,79358362600023,O,2014-11-27,,,,2017-07-28T14:27:26,false,2,,17,,RUE,DU MOULIN,54170,SELAINCOURT,,,54500,,,,,,,,,,,,,,,,,,,2017-05-07,F,,,,,74.20Z,NAFRev2,N,5.966222,48.501075,0.94,housenumber,17 Rue du Moulin 54170 Selaincourt,54500_0021_00017,G,17 RUE DU MOULIN,
804591840,00017,80459184000017,O,2014-08-13,,,,2014-09-16T15:31:02,true,1,,49,,RUE,DU BOIS,54170,SELAINCOURT,,54170,54500,,,,,,,,,,,,,,,,,,,2014-08-13,A,,,,,47.99A,NAFRev2,N,5.96168,48.501449,0.95,housenumber,49 Rue du Bois 54170 Selaincourt,54500_0010_00049,G,49 RUE DU BOIS,
822024386,00010,82202438600010,O,2016-09-01,,,,2018-04-06T18:06:07,true,1,,16,,RUE,DE L EGLISE,54170,SELAINCOURT,,,54500,,,,,,,,,,,,,,,,,,,2016-09-01,A,,,,,81.30Z,NAFRev2,N,5.970586,48.500351,0.95,housenumber,16 Rue de l’Eglise 54170 Selaincourt,54500_0020_00016,G,16 RUE DE L EGLISE,
833682917,00012,83368291700012,O,2017-11-01,,,2370ZZ,2017-12-01T04:39:45,true,1,,13,,RUE,DU BOIS,54170,SELAINCOURT,,,54500,,,,,,,,,,,,,,,,,,,2017-11-01,A,LEBLANC : PIERRE & MACONNERIE,,,LEBLANC : PIERRE & MACONNERIE,23.70Z,NAFRev2,N,5.963169,48.499081,0.95,housenumber,13 Rue du Bois 54170 Selaincourt,54500_0010_00013,G,13 RUE DU BOIS,
841163934,00018,84116393400018,O,2018-02-19,,,,2020-11-05T20:05:31,true,1,,47,,RUE,DU BOIS,54170,SELAINCOURT,,,54500,,,,,,,,,,,,,,,,,,,2018-02-19,A,,,,,88.99B,NAFRev2,N,5.961574,48.501404,0.95,housenumber,47 Rue du Bois 54170 Selaincourt,54500_0010_00047,G,47 RUE DU BOIS,
877633149,00019,87763314900019,O,2019-09-23,,,,2019-09-30T08:36:24,true,1,,4,,RUE,DE L'EGLISE,54170,SELAINCOURT,,,54500,,,,,,,,,,,,,,,,,,,2019-09-23,A,,,,,47.99A,NAFRev2,N,5.971779,48.500916,0.95,housenumber,4 Rue de l’Eglise 54170 Selaincourt,54500_0020_00004,G,4 RUE DE L EGLISE,
903252377,00010,90325237700010,O,2021-09-01,,,4321AB,2021-09-21T08:39:12,true,1,,59,,RUE,DU BOIS,54170,SELAINCOURT,,,54500,,,,,,,,,,,,,,,,,,,2021-09-01,A,,,,MENELEC,43.21A,NAFRev2,O,5.962292,48.501667,0.95,housenumber,59 Rue du Bois 54170 Selaincourt,54500_0010_00059,G,59 RUE DU BOIS,
