siren,nic,siret,statutDiffusionEtablissement,dateCreationEtablissement,trancheEffectifsEtablissement,anneeEffectifsEtablissement,activitePrincipaleRegistreMetiersEtablissement,dateDernierTraitementEtablissement,etablissementSiege,nombrePeriodesEtablissement,complementAdresseEtablissement,numeroVoieEtablissement,indiceRepetitionEtablissement,typeVoieEtablissement,libelleVoieEtablissement,codePostalEtablissement,libelleCommuneEtablissement,libelleCommuneEtrangerEtablissement,distributionSpecialeEtablissement,codeCommuneEtablissement,codeCedexEtablissement,libelleCedexEtablissement,codePaysEtrangerEtablissement,libellePaysEtrangerEtablissement,complementAdresse2Etablissement,numeroVoie2Etablissement,indiceRepetition2Etablissement,typeVoie2Etablissement,libelleVoie2Etablissement,codePostal2Etablissement,libelleCommune2Etablissement,libelleCommuneEtranger2Etablissement,distributionSpeciale2Etablissement,codeCommune2Etablissement,codeCedex2Etablissement,libelleCedex2Etablissement,codePaysEtranger2Etablissement,libellePaysEtranger2Etablissement,dateDebut,etatAdministratifEtablissement,enseigne1Etablissement,enseigne2Etablissement,enseigne3Etablissement,denominationUsuelleEtablissement,activitePrincipaleEtablissement,nomenclatureActivitePrincipaleEtablissement,caractereEmployeurEtablissement,longitude,latitude,geo_score,geo_type,geo_adresse,geo_id,geo_ligne,geo_l4,geo_l5
130005481,01463,13000548101463,O,2008-12-19,NN,,,2015-05-14T03:12:50,false,3,,2,,RUE,LEMOINE,59410,ANZIN,,BP 90107,59014,,,,,,,,,,,,,,,,,,,2013-06-01,F,DDA HAINAULT CAMBRESIS,,,,84.13Z,NAFRev2,O,3.501769,50.371511,0.96,housenumber,2 Rue Lemoine 59410 Anzin,59014_0568_00002,G,2 RUE LEMOINE,
130005481,03030,13000548103030,O,2008-12-19,21,2019,,2021-10-27T08:03:39,false,2,,5,,ESP,JEAN MONNET,59410,ANZIN,,BP 70027,59014,,,,,,,,,,,,,,,,,,,2009-12-13,A,ALE ANZIN,,,,84.13Z,NAFRev2,O,3.502087,50.369361,0.85,housenumber,5 Esplanade Jean Monnet 59410 Anzin,59014_a005_00005,G,5 ESPLANADE JEAN MONNET,
130005481,18145,13000548118145,O,2010-07-01,00,2019,,2021-10-27T08:03:40,false,3,,3,,ESP,JEAN MONNET,59410,ANZIN,,,59014,59416,ANZIN CEDEX,,,,,,,,,,,,,,,,,2019-06-01,F,POLE EMPLOI DDA HAINAUT,,,,84.13Z,NAFRev2,O,3.502087,50.369361,0.85,housenumber,3 Esplanade Jean Monnet 59410 Anzin,59014_a005_00003,G,3 ESPLANADE JEAN MONNET,
130007255,00511,13000725500511,O,2009-07-06,00,2019,,2021-10-27T08:03:43,false,1,,,,RUE,LEMOINE,59410,ANZIN,,,59014,,,,,,,,,,,,,,,,,,,2009-07-06,A,TRESORERIE D' ANZIN,,,,84.11Z,NAFRev2,N,3.501713,50.371398,0.96,street,Rue Lemoine 59410 Anzin,59014_0568,G,RUE LEMOINE,
175901511,00428,17590151100428,O,1987-03-10,NN,,,,false,3,,1,,RUE,DU DOCTEUR CALMETTE,59410,ANZIN,,,59014,,,,,,,,,,,,,,,,,,,1994-02-28,F,COMMISSARIAT SUBDIVISIONNAIRE,,,,75.2G,NAF1993,N,3.510329,50.36908,0.96,housenumber,1 Rue du Docteur Calmette 59410 Anzin,59014_0280_00001,G,1 RUE DU DOCTEUR CALMETTE,
175901511,00956,17590151100956,O,1994-02-28,,,,2008-05-06T11:02:13,false,3,,10,,SQ,DE LA REPUBLIQUE,59410,ANZIN,,,59014,,,,,,,,,,,,,,,,,,,2008-01-01,A,,,,,84.24Z,NAFRev2,N,3.4996,50.371667,0.88,housenumber,10 Square de la Republique 59410 Anzin,59014_0890_00010,G,10 SQUARE DE LA REPUBLIQUE,
175901545,00194,17590154500194,O,1996-01-01,NN,,,2013-05-18T02:08:17,false,4,COMMISSARIAT D'ANZIN,58,,RUE,JEAN JAURES,59410,ANZIN,,BP 46,59014,,,,,,,,,,,,,,,,,,,2012-07-01,F,SPAF DE VALENCIENNES,,,,84.24Z,NAFRev2,N,3.512381,50.369324,0.98,housenumber,58 Rue Jean Jaures 59410 Anzin,59014_0510_00058,G,58 RUE JEAN JAURES,
175902113,00828,17590211300828,O,1960-01-01,,,,2006-10-26T23:39:12,false,3,,40,,RUE,DE LA LIBERTE,59410,ANZIN,,,59014,,,,,,,,,,,,,,,,,,,2004-08-12,F,TRESORERIE D'ANZIN,,,,75.1A,NAFRev1,N,3.50671,50.37015,0.96,housenumber,40 Rue de la Liberte 59410 Anzin,59014_0600_00040,G,40 RUE DE LA LIBERTE,
175902113,01529,17590211301529,O,2004-08-12,,,,2013-04-29T22:36:28,false,4,,,,RUE,LEMOINE,59410,ANZIN,,,59014,59416,ANZIN CEDEX,,,,,,,,,,,,,,,,,2009-07-06,F,TRESORERIE D'ANZIN,,,,84.11Z,NAFRev2,N,3.501713,50.371398,0.96,street,Rue Lemoine 59410 Anzin,59014_0568,G,RUE LEMOINE,
175902303,00098,17590230300098,O,1988-02-18,NN,,,2008-01-04T18:15:46,false,3,,12,,RUE,LOUIS BLANC,59410,ANZIN,,,59014,,,,,,,,,,,,,,,,,,,2008-01-01,A,SCE TECHNIQUE RADIO NÂ¿13 VALENCIENNES,,,,84.11Z,NAFRev2,N,3.507118,50.367003,0.96,housenumber,12 Rue Louis Blanc 59410 Anzin,59014_0620_00012,G,12 RUE LOUIS BLANC,
175902337,00328,17590233700328,O,1959-05-01,,,,2008-05-20T13:42:27,false,4,,14,,RUE,LOUIS BLANC,59410,ANZIN,,,59014,,,,,,,,,,,,,,,,,,,2008-01-01,F,SERVICE TECHNIQUE AUTO,,,,84.11Z,NAFRev2,N,3.506995,50.367036,0.96,housenumber,14 Rue Louis Blanc 59410 Anzin,59014_0620_00014,G,14 RUE LOUIS BLANC,
175903723,00013,17590372300013,O,1988-12-15,,,,,false,4,,75,,RUE,JEAN JAURES,59410,ANZIN,,BP 129,59014,,,,,,,,,,,,,,,,,,,2002-12-25,F,,,,,75.1E,NAF1993,N,3.517207,50.375238,0.98,housenumber,75 Rue Jean Jaures 59410 Anzin,59014_0510_00075,G,75 RUE JEAN JAURES,
175904317,00542,17590431700542,O,1985-04-01,NN,,,2014-06-13T23:17:33,false,5,,22,,RUE,DES MARTYRS,59410,ANZIN,,,59014,,,,,,,,,,,,,,,,,,,2013-05-14,F,CIRC 1ER DEG IEN VALENCIENNES ANZIN,,,,84.12Z,NAFRev2,N,3.504812,50.371559,0.96,housenumber,22 Rue des Martyrs 59410 Anzin,59014_0690_00022,G,22 RUE DES MARTYRS,
175904317,01268,17590431701268,O,1985-04-01,NN,,,2008-01-04T18:15:51,false,3,,22,,RUE,DES MARTYRS,59410,ANZIN,,,59014,,,,,,,,,,,,,,,,,,,2008-01-01,A,COM SEC DEGR ST AMAN VALENCIEN,,,,84.12Z,NAFRev2,N,3.504812,50.371559,0.96,housenumber,22 Rue des Martyrs 59410 Anzin,59014_0690_00022,G,22 RUE DES MARTYRS,
175904317,01276,17590431701276,O,1985-04-01,NN,,,2008-01-04T18:15:51,false,3,,22,,RUE,DES MARTYRS,59410,ANZIN,,BP 135,59014,,,,,,,,,,,,,,,,,,,2008-01-01,A,INSP MIXTE VALENC ANZIN BIS,,,,84.12Z,NAFRev2,N,3.504812,50.371559,0.96,housenumber,22 Rue des Martyrs 59410 Anzin,59014_0690_00022,G,22 RUE DES MARTYRS,
175904317,01391,17590431701391,O,1985-04-01,NN,,,2008-01-04T18:15:51,false,3,,22,,RUE,DES MARTYRS,59410,ANZIN,,,59014,,,,,,,,,,,,,,,,,,,2008-01-01,A,COM PRESCOL ELEM VALENCIENNE 3,,,,84.12Z,NAFRev2,N,3.504812,50.371559,0.96,housenumber,22 Rue des Martyrs 59410 Anzin,59014_0690_00022,G,22 RUE DES MARTYRS,
175904317,01433,17590431701433,O,1985-04-01,NN,,,,false,3,,10,,PL,ROGER SALENGRO,59410,ANZIN,,BP 105,59014,,,,,,,,,,,,,,,,,,,1995-01-01,F,ANTENNE DU CIO DE VALENCIENNES,,,,75.1C,NAF1993,N,3.502249,50.37019,0.88,housenumber,10 Place Roger Salengro 59410 Anzin,59014_0910_00010,G,10 PLACE ROGER SALENGRO,
175904317,01524,17590431701524,O,1990-05-02,NN,,,2008-01-04T18:15:51,false,3,,22,,RUE,DES MARTYRS,59410,ANZIN,,BP 135,59014,,,,,,,,,,,,,,,,,,,2008-01-01,A,INSP MIXTE VALENCIENNES ANZIN 3,,,,84.12Z,NAFRev2,N,3.504812,50.371559,0.96,housenumber,22 Rue des Martyrs 59410 Anzin,59014_0690_00022,G,22 RUE DES MARTYRS,
175904317,01714,17590431701714,O,1995-01-01,NN,,,2009-06-27T03:14:27,false,4,,97,,RUE,PIERRE MATHIEU,59410,ANZIN,,BP 105,59014,,,,,,,,,,,,,,,,,,,2008-08-31,F,CENTRE D INFORMATION ET D ORIENTATION,,,,84.12Z,NAFRev2,N,3.511672,50.36962,0.97,housenumber,97 Rue Pierre Mathieu 59410 Anzin,59014_0850_00097,G,97 RUE PIERRE MATHIEU,
180038028,12572,18003802812572,O,1991-02-01,,,,,false,3,,69,,RUE,JEAN JAURES,59410,ANZIN,,,59014,,,,,,,,,,,,,,,,,,,1992-10-01,F,ALE VALENCIENNES,,,,75.1E,NAF1993,N,3.516673,50.374555,0.98,housenumber,69 Rue Jean Jaures 59410 Anzin,59014_0510_00069,G,69 RUE JEAN JAURES,
180038028,20005,18003802820005,O,1998-08-01,NN,,,2010-04-18T03:07:51,false,6,,2,,RUE,LEMOINE,59410,ANZIN,,BP 90107,59014,59416,ANZIN CEDEX,,,,,,,,,,,,,,,,,2008-12-19,F,DDA HAINAULT CAMBRESIS,,,,84.13Z,NAFRev2,N,3.501769,50.371511,0.96,housenumber,2 Rue Lemoine 59410 Anzin,59014_0568_00002,G,2 RUE LEMOINE,
180038028,27059,18003802827059,O,2008-07-01,NN,,,2010-04-18T03:07:52,false,2,,5,,ESP,JEAN MONNET,59410,ANZIN,,BP 70027,59014,59416,ANZIN CEDEX,,,,,,,,,,,,,,,,,2008-12-19,F,ALE ANZIN,,,,84.13Z,NAFRev2,O,3.502087,50.369361,0.85,housenumber,5 Esplanade Jean Monnet 59410 Anzin,59014_a005_00005,G,5 ESPLANADE JEAN MONNET,
180092538,00636,18009253800636,O,2012-03-31,03,2019,,2021-10-27T08:04:30,false,2,,78,,RUE,JEAN JAURES,59410,ANZIN,,,59014,,,,,,,,,,,,,,,,,,,2021-04-01,F,ACTION SANITAIRE ET SOCIALE CENTRE D'ANZIN,,,,84.30A,NAFRev2,O,3.513997,50.371438,0.98,housenumber,78 Rue Jean Jaures 59410 Anzin,59014_0510_00078,G,78 RUE JEAN JAURES,
195900055,00011,19590005500011,O,1983-03-01,21,2019,,2021-10-27T08:05:00,true,4,,2,,AV,LEO LAGRANGE,59410,ANZIN,,BP 70099,59014,59416,ANZIN CEDEX,,,,,,,,,,,,,,,,,2009-02-08,A,,,,,85.32Z,NAFRev2,O,3.492421,50.369054,0.74,street,Avenue Leo Lagrange 59410 Anzin,59014_0578,G,AVENUE LEO LAGRANGE,
195900063,00015,19590006300015,O,1983-03-01,21,2019,,2021-10-27T08:05:00,false,5,,1,,RUE,JULES FERRY,59410,ANZIN,,BP 90029,59014,59416,ANZIN CEDEX,,,,,,,,,,,,,,,,,2021-09-01,F,,,,,85.31Z,NAFRev2,O,3.505124,50.374347,0.97,housenumber,1 Rue Jules Ferry 59410 Anzin,59014_0530_00001,G,1 RUE JULES FERRY,
195900063,00023,19590006300023,O,2021-09-01,,,,2021-06-19T11:41:31,true,1,,247,,AV,ANATOLE FRANCE,59410,ANZIN,,BP 90029,59014,59416,ANZIN CEDEX,,,,,,,,,,,,,,,,,2021-09-01,A,,,,,85.31Z,NAFRev2,O,3.501011,50.373461,0.89,housenumber,247 Avenue Anatole France 59410 Anzin,59014_0050_00247,G,247 AVENUE ANATOLE FRANCE,
195900071,00018,19590007100018,O,1983-03-01,NN,,,2009-10-24T03:19:14,false,4,,247,,AV,ANATOLE FRANCE,59410,ANZIN,,BP 9,59014,,,,,,,,,,,,,,,,,,,2008-09-01,F,,,,,85.31Z,NAFRev2,N,3.501011,50.373461,0.89,housenumber,247 Avenue Anatole France 59410 Anzin,59014_0050_00247,G,247 AVENUE ANATOLE FRANCE,
195900493,00022,19590049300022,O,2000-01-01,NN,,,2011-04-23T04:10:13,false,4,,69,,RUE,JEAN JAURES,59410,ANZIN,,BP 47,59014,59416,ANZIN CEDEX,,,,,,,,,,,,,,,,,2009-08-30,F,GRETA HAINAUT,,,,85.59A,NAFRev2,N,3.516673,50.374555,0.98,housenumber,69 Rue Jean Jaures 59410 Anzin,59014_0510_00069,G,69 RUE JEAN JAURES,
195902226,00024,19590222600024,O,1989-09-01,NN,,,,false,3,,97,,RUE,PIERRE MATHIEU,59410,ANZIN,,,59014,,,,,,,,,,,,,,,,,,,1992-09-01,F,LYCEE VALENCIENNES EST - ANNEXE -,,,,80.2A,NAF1993,N,3.511672,50.36962,0.97,housenumber,97 Rue Pierre Mathieu 59410 Anzin,59014_0850_00097,G,97 RUE PIERRE MATHIEU,
195902234,00036,19590223400036,O,1995-12-25,,,,,false,2,,69,,RUE,JEAN JAURES,59410,ANZIN,,BP 47,59014,,,,,,,,,,,,,,,,,,,2000-01-01,F,GRETA HAINAUT,,,,80.4C,NAF1993,N,3.516673,50.374555,0.98,housenumber,69 Rue Jean Jaures 59410 Anzin,59014_0510_00069,G,69 RUE JEAN JAURES,
200017218,00039,20001721800039,O,2009-09-01,02,2019,,2021-10-27T08:05:27,false,2,,69,,RUE,JEAN JAURES,59410,ANZIN,,BP 47,59014,59416,ANZIN CEDEX,,,,,,,,,,,,,,,,,2010-12-05,A,GRETA HAINAUT CAMBRESIS,,,,85.59A,NAFRev2,O,3.516673,50.374555,0.98,housenumber,69 Rue Jean Jaures 59410 Anzin,59014_0510_00069,G,69 RUE JEAN JAURES,
200036770,00010,20003677000010,O,2013-01-01,02,2019,,2021-10-27T08:05:37,true,1,MAIRIE,,,PL,ROGER SALENGRO,59410,ANZIN,,BP 60089,59014,59416,ANZIN CEDEX,,,,,,,,,,,,,,,,,2013-01-01,A,,,,,84.13Z,NAFRev2,O,3.50116,50.370027,0.86,street,Place Roger Salengro 59410 Anzin,59014_0910,G,PLACE ROGER SALENGRO,
215900143,00011,21590014300011,O,1983-03-01,31,2019,,2021-10-27T08:09:11,true,4,,,,PL,ROGER SALENGRO,59410,ANZIN,,,59014,,,,,,,,,,,,,,,,,,,2008-01-01,A,MAIRIE,,,,84.11Z,NAFRev2,O,3.50116,50.370027,0.86,street,Place Roger Salengro 59410 Anzin,59014_0910,G,PLACE ROGER SALENGRO,
215900143,00029,21590014300029,O,1983-03-16,00,2019,,2021-10-27T08:09:11,false,4,,189,,AV,ANATOLE FRANCE,59410,ANZIN,,,59014,,,,,,,,,,,,,,,,,,,2019-01-01,F,THEATRE MUNICIPAL,,,,90.04Z,NAFRev2,N,3.502926,50.371431,0.89,housenumber,189 Avenue Anatole France 59410 Anzin,59014_0050_00189,G,189 AVENUE ANATOLE FRANCE,
215900143,00052,21590014300052,O,1983-12-21,11,2019,,2021-10-27T08:09:11,false,3,CITE CARPEAUX,,,RUE,LUCIEN JONAS,59410,ANZIN,,,59014,,,,,,,,,,,,,,,,,,,2008-01-01,A,ECOLE MATERNELLE JEAN BAPTISTE CARPEAUX,,,,85.10Z,NAFRev2,N,3.499516,50.378679,0.95,street,Rue Lucien Jonas 59410 Anzin,59014_0641,G,RUE LUCIEN JONAS,
215900143,00060,21590014300060,O,1983-12-21,03,2019,,2021-10-27T08:09:11,false,4,,21,,RUE,DES FUSILLES PROLONGEE,59410,ANZIN,,,59014,,,,,,,,,,,,,,,,,,,2021-08-31,F,ECOLE MATERNELLE GAMBETTA,,,,85.10Z,NAFRev2,N,3.529793,50.384889,0.88,street,Rue des Fusilles Prolongee 59410 Anzin,59014_0403,G,RUE DES FUSILLES PROLONGEE,
215900143,00078,21590014300078,O,1983-12-21,11,2019,,2021-10-27T08:09:11,false,4,,19,,RUE,DU MARECHAL GALLIENI,59410,ANZIN,,,59014,,,,,,,,,,,,,,,,,,,2008-01-01,A,ECOLE MATERNELLE GALLIENI,,,,85.10Z,NAFRev2,N,3.49936,50.370883,0.59,housenumber,19 Rue Gallieni 59410 Anzin,59014_0675_00019,G,19 RUE GALLIENI,
215900143,00086,21590014300086,O,1983-12-21,12,2019,,2021-10-27T08:09:11,false,4,,65,,PL,DU GENERAL DE GAULLE,59410,ANZIN,,,59014,,,,,,,,,,,,,,,,,,,2020-12-25,A,ECOLE ELEMENTAIRE CHARLES DE GAULLE,,,,85.20Z,NAFRev2,N,3.510925,50.375368,0.93,housenumber,65 Place du General de Gaulle 59410 Anzin,59014_0440_00065,G,65 PLACE DU GENERAL DE GAULLE,
215900143,00094,21590014300094,O,1983-12-21,11,2019,,2021-10-27T08:09:11,false,3,,21,,RUE,DERRIERE LES HAIES,59410,ANZIN,,,59014,,,,,,,,,,,,,,,,,,,2008-01-01,A,ECOLE MATERNELLE BERTRAND TAVERNIER,,,,85.10Z,NAFRev2,N,3.511363,50.374123,0.96,housenumber,21 Rue Derriere les Haies 59410 Anzin,59014_0230_00021,G,21 RUE DERRIERE LES HAIES,
215900143,00102,21590014300102,O,1983-12-21,11,2019,,2021-10-27T08:09:11,false,3,,272,,RUE,JEAN JAURES,59410,ANZIN,,,59014,,,,,,,,,,,,,,,,,,,2008-01-01,A,ECOLE MATERNELLE JEAN JAURES,,,,85.10Z,NAFRev2,N,3.518802,50.377803,0.98,housenumber,272 Rue Jean Jaures 59410 Anzin,59014_0510_00272,G,272 RUE JEAN JAURES,
215900143,00110,21590014300110,O,1983-12-21,12,2019,,2021-10-27T08:09:11,false,4,,274,,RUE,JEAN JAURES,59410,ANZIN,,,59014,,,,,,,,,,,,,,,,,,,2020-12-25,A,ECOLE ELEMENTAIRE JEAN JAURES,,,,85.20Z,NAFRev2,N,3.518852,50.37787,0.98,housenumber,274 Rue Jean Jaures 59410 Anzin,59014_0510_00274,G,274 RUE JEAN JAURES,
215900143,00128,21590014300128,O,1983-12-21,11,2019,,2021-10-27T08:09:11,false,3,,1,,RUE,LUCIEN JONAS,59410,ANZIN,,,59014,,,,,,,,,,,,,,,,,,,2008-01-01,A,ECOLE PRIMAIRE CARPEAUX,,,,85.20Z,NAFRev2,N,3.499516,50.378679,0.87,street,Rue Lucien Jonas 59410 Anzin,59014_0641,G,RUE LUCIEN JONAS,
215900143,00136,21590014300136,O,1983-12-21,12,2019,,2021-10-27T08:09:11,false,5,,20,,RUE,DES MARTYRS,59410,ANZIN,,,59014,,,,,,,,,,,,,,,,,,,2020-12-25,A,ECOLE ELEMENTAIRE VOLTAIRE - ANDRE GILLIARD,,,,85.20Z,NAFRev2,N,3.504843,50.371585,0.96,housenumber,20 Rue des Martyrs 59410 Anzin,59014_0690_00020,G,20 RUE DES MARTYRS,
215900143,00144,21590014300144,O,1983-12-21,11,2019,,2021-10-27T08:09:11,false,3,,28,,RUE,DE RAISMES,59410,ANZIN,,,59014,,,,,,,,,,,,,,,,,,,2008-01-01,A,ECOLE MATERNELLE MONT D'ANZIN,,,,85.10Z,NAFRev2,N,3.495585,50.373269,0.96,housenumber,28 Rue de Raismes 59410 Anzin,59014_0885_00028,G,28 RUE DE RAISMES,
215900143,00151,21590014300151,O,1983-12-21,NN,,,2010-04-18T03:12:49,false,5,,40,,RUE,VOLTAIRE,59410,ANZIN,,,59014,,,,,,,,,,,,,,,,,,,2008-08-31,F,ECOLE PRIMAIRE PUB NIV 1 VOLTAIRE,,,,85.20Z,NAFRev2,N,3.50386,50.372625,0.97,housenumber,40 Rue Voltaire 59410 Anzin,59014_1100_00040,G,40 RUE VOLTAIRE,
215900143,00169,21590014300169,O,1994-12-07,NN,,,2008-01-04T18:37:23,false,3,MAIRIE,,,PL,ROGER SALENGRO,59410,ANZIN,,,59014,,,,,,,,,,,,,,,,,,,2008-01-01,A,ZONES INDUSTRIELLES EUROPESCAULT,,,,42.99Z,NAFRev2,N,3.50116,50.370027,0.86,street,Place Roger Salengro 59410 Anzin,59014_0910,G,PLACE ROGER SALENGRO,
215900143,00177,21590014300177,O,2004-10-01,03,2019,,2021-10-27T08:09:11,false,3,,,,RUE,LOUISE MICHEL,59410,ANZIN,,,59014,,,,,,,,,,,,,,,,,,,2008-01-01,A,HALTE GARDERIE L'ILE AUX ENFANTS,,,,88.91A,NAFRev2,N,3.514067,50.375478,0.97,street,Rue Louise Michel 59410 Anzin,59014_0630,G,RUE LOUISE MICHEL,
225900018,02820,22590001802820,O,2011-09-09,21,2019,,2021-10-27T08:11:38,false,1,,7,,RUE,GUSTAVE THIETARD,59410,ANZIN,,,59014,,,,,,,,,,,,,,,,,,,2011-09-09,A,UTPAS D'ANZIN,,,,88.99B,NAFRev2,N,3.503308,50.369578,0.96,housenumber,7 Rue Gustave Thietard 59410 Anzin,59014_0450_00007,G,7 RUE GUSTAVE THIETARD,
245901160,00193,24590116000193,O,2019-01-01,,,,2019-03-12T08:55:02,false,2,,189,,AV,ANATOLE FRANCE,59410,ANZIN,,,59014,,,,,,,,,,,,,,,,,,,2019-02-04,A,THEATRE ANZIN,,,,84.11Z,NAFRev2,N,3.502926,50.371431,0.89,housenumber,189 Avenue Anatole France 59410 Anzin,59014_0050_00189,G,189 AVENUE ANATOLE FRANCE,
255900854,00027,25590085400027,O,1997-01-01,NN,,,2015-05-14T03:47:20,false,4,MAIRIE,,,PL,ROGER SALENGRO,59410,ANZIN,,,59014,,,,,,,,,,,,,,,,,,,2013-01-01,F,,,,,84.13Z,NAFRev2,N,3.50116,50.370027,0.86,street,Place Roger Salengro 59410 Anzin,59014_0910,G,PLACE ROGER SALENGRO,
255902165,00018,25590216500018,O,,NN,,,,true,1,,,,PL,ROGER SALENGRO,59410,ANZIN,,,59014,,,,,,,,,,,,,,,,,,,1994-01-24,F,,,,,75.1A,NAF1993,N,3.50116,50.370027,0.86,street,Place Roger Salengro 59410 Anzin,59014_0910,G,PLACE ROGER SALENGRO,
265900142,00018,26590014200018,O,1983-03-01,11,2019,,2021-10-27T08:13:03,true,4,MAIRIE,,,PL,ROGER SALENGRO,59410,ANZIN,,BP 89,59014,59416,ANZIN CEDEX,,,,,,,,,,,,,,,,,2008-01-01,A,CCAS,,,,88.99B,NAFRev2,O,3.50116,50.370027,0.86,street,Place Roger Salengro 59410 Anzin,59014_0910,G,PLACE ROGER SALENGRO,
265900142,00026,26590014200026,O,1984-12-17,NN,,,2015-05-14T03:50:41,false,5,MAIRIE,,,PL,ROGER SALENGRO,59410,ANZIN,,BP 89,59014,59416,ANZIN CEDEX,,,,,,,,,,,,,,,,,2008-03-09,A,SERVICE D'AIDE A DOMICILE,,,,88.10A,NAFRev2,O,3.50116,50.370027,0.86,street,Place Roger Salengro 59410 Anzin,59014_0910,G,PLACE ROGER SALENGRO,
265900142,00034,26590014200034,O,2007-08-01,,,,2008-01-04T19:01:11,false,1,MAIRIE,,,PL,ROGER SALENGRO,59410,ANZIN,,BP 89,59014,59416,ANZIN CEDEX,,,,,,,,,,,,,,,,,2007-08-01,F,,,,,85.3J,NAFRev1,N,3.50116,50.370027,0.86,street,Place Roger Salengro 59410 Anzin,59014_0910,G,PLACE ROGER SALENGRO,
265906735,00385,26590673500385,O,2018-01-01,,,,2017-12-19T11:20:51,false,1,,2,,RUE,DE ROUBAIX,59410,ANZIN,,,59014,,,,,,,,,,,,,,,,,,,2018-01-01,A,EHPAD ANZIN,,,,87.10A,NAFRev2,N,3.49873,50.376856,0.96,housenumber,2 Rue de Roubaix 59410 Anzin,59014_0920_00002,G,2 RUE DE ROUBAIX,
265907105,00018,26590710500018,O,1983-03-01,00,2018,,2020-12-23T11:11:42,true,6,,2,,RUE,DE ROUBAIX,59410,ANZIN,,,59014,,,,,,,,,,,,,,,,,,,2018-01-01,F,,,,,87.10A,NAFRev2,O,3.49873,50.376856,0.96,housenumber,2 Rue de Roubaix 59410 Anzin,59014_0920_00002,G,2 RUE DE ROUBAIX,
265907105,00026,26590710500026,O,2004-03-19,,,,2020-12-23T11:11:42,false,4,RESIDENCE DOUX SEJOUR,2,,RUE,DE ROUBAIX,59410,ANZIN,,,59014,,,,,,,,,,,,,,,,,,,2018-01-01,F,DOTATION NON AFFECTEE,,,,66.19A,NAFRev2,N,3.49873,50.376856,0.96,housenumber,2 Rue de Roubaix 59410 Anzin,59014_0920_00002,G,2 RUE DE ROUBAIX,
265907766,00462,26590776600462,O,1991-03-01,NN,,,2006-11-25T09:09:55,false,4,,98,,RUE,KLEBER,59410,ANZIN,,,59014,,,,,,,,,,,,,,,,,,,2000-04-28,F,MAISON DE L ENFANCE,,,,85.3B,NAF1993,N,3.504077,50.375933,0.97,housenumber,98 Rue Kleber 59410 Anzin,59014_0545_00098,G,98 RUE KLEBER,
265908434,00011,26590843400011,O,1994-03-15,02,2019,,2021-10-27T08:13:06,true,4,MAIRIE,,,PL,ROGER SALENGRO,59410,ANZIN,,,59014,,,,,,,,,,,,,,,,,,,2008-01-01,A,CDE,,,,88.99B,NAFRev2,O,3.50116,50.370027,0.86,street,Place Roger Salengro 59410 Anzin,59014_0910,G,PLACE ROGER SALENGRO,
285900015,00238,28590001500238,O,2004-12-25,,,,2006-10-26T23:46:12,false,1,,,,SQ,DE LA REPUBLIQUE,59410,ANZIN,,,59014,,,,,,,,,,,,,,,,,,,2004-12-25,F,CENTRE D'INCENDIE ET DE SECOURS,,,,75.2J,NAFRev1,O,3.500173,50.371098,0.87,street,Square de la Republique 59410 Anzin,59014_0890,G,SQUARE DE LA REPUBLIQUE,
300015492,00063,30001549200063,O,2004-09-01,NN,,,2008-11-07T00:16:28,false,3,,13,,RUE,DES MARTYRS,59410,ANZIN,,,59014,,,,,,,,,,,,,,,,,,,2006-04-01,F,,,,,22.2C,NAFRev1,O,3.504254,50.370804,0.96,housenumber,13 Rue des Martyrs 59410 Anzin,59014_0690_00013,G,13 RUE DES MARTYRS,
300015492,00071,30001549200071,O,2006-04-01,NN,,1812ZB,2021-02-23T10:35:36,true,2,,450,,RUE,JEAN JAURES,59410,ANZIN,,,59014,,,,,,,,,,,,,,,,,,,2008-01-01,A,,,,,18.12Z,NAFRev2,O,3.523118,50.383432,0.98,housenumber,450 Rue Jean Jaures 59410 Anzin,59014_0510_00450,G,450 RUE JEAN JAURES,
300059011,00027,30005901100027,O,,,,,,true,1,,,,ALL,DES TILLEULS,59410,ANZIN,,,59014,,,,,,,,,,,,,,,,,,,1985-12-25,F,,,,,15.03,NAP,N,3.500312,50.377703,0.48,street,Allee des Troenes 59410 Anzin,59014_1040,G,ALLEE DES TROENES,
300431418,00015,30043141800015,O,,NN,,,,true,1,,198,,AV,ANATOLE FRANCE,59410,ANZIN,,,59014,,,,,,,,,,,,,,,,,,,1993-03-31,F,,,,,74.8B,NAF1993,N,3.501586,50.372502,0.89,housenumber,198 Avenue Anatole France 59410 Anzin,59014_0050_00198,G,198 AVENUE ANATOLE FRANCE,
300455284,00012,30045528400012,O,,,,,,true,1,,250,,AV,A FRANCE,59410,ANZIN,,,59014,,,,,,,,,,,,,,,,,,,1984-12-25,F,,,,,,,N,3.508397,50.368559,0.65,street,Avenue à France 57b Cour Daubress 59410 Anzin,59014_0185,G,AV A FRANCE 57B COUR DAUBRESS,
300455391,00023,30045539100023,O,2006-01-01,,,,2013-01-11T05:26:47,true,3,,33,,RUE,FAIDHERBE,59410,ANZIN,,,59014,,,,,,,,,,,,,,,,,,,2012-12-31,F,,,,,77.39Z,NAFRev2,N,3.502921,50.368888,0.96,housenumber,33 Rue Faidherbe 59410 Anzin,59014_0350_00033,G,33 RUE FAIDHERBE,
300479425,00013,30047942500013,O,,NN,,,,true,1,,39,,BD,DAMPIERRE,59410,ANZIN,,,59014,,,,,,,,,,,,,,,,,,,,F,,,,,77.06,NAP,N,3.509727,50.365503,0.84,housenumber,39 Boulevard Dampierre 59410 Anzin,59014_0180_00039,G,39 BOULEVARD DAMPIERRE,
300484516,00046,30048451600046,O,2016-03-01,01,2019,,2021-10-27T08:13:44,false,1,,486,,AV,AUGUSTA ADA KING,59410,ANZIN,,,59014,,,,,,,,,,,,,,,,,,,2016-03-01,A,,,,,43.22B,NAFRev2,O,3.522326,50.378312,0.87,housenumber,486 Avenue Augusta Ada King 59410 Anzin,59014_0543_00486,G,486 AVENUE AUGUSTA ADA KING,
301064507,00017,30106450700017,O,1974-01-01,NN,,,,true,3,,233,T,RUE,JEAN JAURES,59410,ANZIN,,,59014,,,,,,,,,,,,,,,,,,,1995-12-25,F,,,,,70.2C,NAF1993,N,3.523493,50.383018,0.89,housenumber,233ter Rue Jean Jaures 59410 Anzin,59014_0510_00233_ter,G,233TER RUE JEAN JAURES,
301064515,00036,30106451500036,O,1900-01-01,NN,,,2008-01-04T19:13:11,true,3,,19,,RUE,DU SOLDAT BEAULIEU,59410,ANZIN,,,59014,,,,,,,,RUE,PLUCHART BRIEUDE,59410,ANZIN,,,59014,,,,,2008-01-01,A,,,,,68.20B,NAFRev2,N,3.498352,50.369821,0.97,housenumber,19 Rue du Soldat Beaulieu 59410 Anzin,59014_0950_00019,G,19 RUE DU SOLDAT BEAULIEU,
301249132,00012,30124913200012,O,,,,,,true,1,,,,RUE,JEAN JAURES,59410,ANZIN,,,59014,,,,,,,,,,,,,,,,,,,1984-12-25,F,,,,,64.23,NAP,N,3.518311,50.376892,0.98,street,Rue Jean Jaures 59410 Anzin,59014_0510,G,RUE JEAN JAURES,
301311361,00010,30131136100010,O,,NN,,,,true,1,,96,B,RUE,WALDECK ROUSSEAU,59410,ANZIN,,,59014,,,,,,,,,,,,,,,,,,,1991-12-31,F,,,,,64.46,NAP,N,3.510687,50.375574,0.97,interpolation,96 Rue Waldeck Rousseau 59410 Anzin,,G,94 RUE WALDECK ROUSSEAU,
301340584,03412,30134058403412,O,2001-11-01,12,2019,,2021-10-27T08:13:59,false,3,,36,,RUE,PIERRE MATHIEU,59410,ANZIN,,,59014,,,,,,,,,,,,,,,,,,,2008-01-01,A,,,,,43.22B,NAFRev2,O,3.511057,50.369887,0.97,housenumber,36 Rue Pierre Mathieu 59410 Anzin,59014_0850_00036,G,36 RUE PIERRE MATHIEU,
301420568,00026,30142056800026,O,2007-05-01,NN,,,2010-04-18T03:21:42,false,3,,121,,AV,ANATOLE FRANCE,59410,ANZIN,,,59014,,,,,,,,,,,,,,,,,,,2008-03-07,F,,,,,56.30Z,NAFRev2,O,3.504804,50.369752,0.89,housenumber,121 Avenue Anatole France 59410 Anzin,59014_0050_00121,G,121 AVENUE ANATOLE FRANCE,
301586467,00047,30158646700047,O,1994-04-13,NN,,,2006-11-25T09:13:22,true,3,RATTACHEMENT MAIRIE,,,PL,ROGER SALENGRO,59410,ANZIN,,,59014,,,,,,,,,,,,,,,,,,,2005-12-02,F,,,,,52.6E,NAFRev1,N,3.50116,50.370027,0.86,street,Place Roger Salengro 59410 Anzin,59014_0910,G,PLACE ROGER SALENGRO,
301592366,00050,30159236600050,O,1993-02-08,,,,,false,3,,151,,AV,ANATOLE FRANCE,59410,ANZIN,,,59014,,,,,,,,,,,,,,,,,,,1994-04-29,F,,,,,52.4Z,NAF1993,N,3.503926,50.370404,0.89,housenumber,151 Avenue Anatole France 59410 Anzin,59014_0050_00151,G,151 AVENUE ANATOLE FRANCE,