siren,nic,siret,statutDiffusionEtablissement,dateCreationEtablissement,trancheEffectifsEtablissement,anneeEffectifsEtablissement,activitePrincipaleRegistreMetiersEtablissement,dateDernierTraitementEtablissement,etablissementSiege,nombrePeriodesEtablissement,complementAdresseEtablissement,numeroVoieEtablissement,indiceRepetitionEtablissement,typeVoieEtablissement,libelleVoieEtablissement,codePostalEtablissement,libelleCommuneEtablissement,libelleCommuneEtrangerEtablissement,distributionSpecialeEtablissement,codeCommuneEtablissement,codeCedexEtablissement,libelleCedexEtablissement,codePaysEtrangerEtablissement,libellePaysEtrangerEtablissement,complementAdresse2Etablissement,numeroVoie2Etablissement,indiceRepetition2Etablissement,typeVoie2Etablissement,libelleVoie2Etablissement,codePostal2Etablissement,libelleCommune2Etablissement,libelleCommuneEtranger2Etablissement,distributionSpeciale2Etablissement,codeCommune2Etablissement,codeCedex2Etablissement,libelleCedex2Etablissement,codePaysEtranger2Etablissement,libellePaysEtranger2Etablissement,dateDebut,etatAdministratifEtablissement,enseigne1Etablissement,enseigne2Etablissement,enseigne3Etablissement,denominationUsuelleEtablissement,activitePrincipaleEtablissement,nomenclatureActivitePrincipaleEtablissement,caractereEmployeurEtablissement,longitude,latitude,geo_score,geo_type,geo_adresse,geo_id,geo_ligne,geo_l4,geo_l5
096180252,00155,09618025200155,O,1995-07-01,NN,,,2019-11-14T14:00:52,false,3,,,,,,64450,MIOSSENS-LANUSSE,,,64385,,,,,,,,,,,,,,,,,,,2008-01-01,A,,,,,46.21Z,NAFRev2,N,,,0,,,,,,
200014702,00019,20001470200019,O,2008-03-06,,,,2019-11-14T14:00:52,true,2,MAIRIE,26,,RTE,DE SAINT JACQUES,64450,MIOSSENS-LANUSSE,,,64385,,,,,,,,,,,,,,,,,,,2014-03-10,F,,,,,42.99Z,NAFRev2,N,-0.300004,43.468376,0.87,housenumber,26 Route de Saint Jacques 64450 Miossens-Lanusse,64385_0100_00026,G,26 ROUTE DE SAINT JACQUES,
216403857,00016,21640385700016,O,1983-03-01,01,2019,,2021-10-27T08:09:45,true,3,,,,,,64450,MIOSSENS-LANUSSE,,,64385,,,,,,,,,,,,,,,,,,,2008-01-01,A,MAIRIE,,,,84.11Z,NAFRev2,N,,,0,,,,,,
216403857,00024,21640385700024,O,1983-12-21,01,2019,,2021-10-27T08:09:45,false,3,,,,,,64450,MIOSSENS-LANUSSE,,,64385,,,,,,,,,,,,,,,,,,,2008-01-01,A,ECOLE PRIMAIRE PUBLIQUE,,,,85.20Z,NAFRev2,N,,,0,,,,,,
256401779,00010,25640177900010,O,,NN,,,2019-11-14T14:00:52,true,1,,,,,,64450,MIOSSENS-LANUSSE,,,64385,,,,,,,,,,,,,,,,,,,1991-11-18,F,,,,,90.11,NAP,N,,,0,,,,,,
266403674,00010,26640367400010,O,1983-03-01,NN,,,2019-11-14T14:00:52,true,4,,,,,,64450,MIOSSENS-LANUSSE,,,64385,,,,,,,,,,,,,,,,,,,2016-12-31,F,CCAS,,,,88.99B,NAFRev2,N,,,0,,,,,,
304212202,00010,30421220200010,O,1982-12-31,NN,,,2019-11-14T14:00:52,true,3,,,,,,64450,MIOSSENS-LANUSSE,,,64385,,,,,,,,,,,,,,,,,,,2005-12-31,F,,,,,01.1A,NAFRev1,N,,,0,,,,,,
317706810,00015,31770681000015,O,,NN,,,2019-11-14T14:00:52,true,1,,,,,,64450,MIOSSENS-LANUSSE,,,64385,,,,,,,,,,,,,,,,,,,1988-04-01,F,,,,,35.04,NAP,N,,,0,,,,,,
324716992,00015,32471699200015,O,1973-12-03,NN,,,2019-11-14T14:00:52,false,4,,,,,,64450,MIOSSENS-LANUSSE,,,64385,,,,,,,,,,,,,,,,,,,2002-12-31,F,,,,,85.3K,NAF1993,O,,,0,,,,,,
325181048,00027,32518104800027,O,1995-01-01,,,,2019-11-14T14:00:52,false,2,,,,,,64450,MIOSSENS-LANUSSE,,,64385,,,,,,,,,,,,,,,,,,,1995-12-25,F,,,,,74.8F,NAF1993,N,,,0,,,,,,
328906805,00010,32890680500010,O,1983-12-30,NN,,,2019-11-14T14:00:52,true,3,,,,,,64450,MIOSSENS-LANUSSE,,,64385,,,,,,,,,,,,,,,,,,,2008-01-01,A,,,,,01.41Z,NAFRev2,N,,,0,,,,,,
332356971,00017,33235697100017,O,,,,,2019-11-14T14:00:52,true,1,,,,,,64450,MIOSSENS-LANUSSE,,,64385,,,,,,,,,,,,,,,,,,,1997-02-01,F,,,,,01.1A,NAF1993,N,,,0,,,,,,
332768092,00014,33276809200014,O,1984-12-01,NN,,,2019-11-14T14:00:52,false,4,,,,,,64450,MIOSSENS-LANUSSE,,,64385,,,,,,,,,,,,,,,,,,,2003-01-15,F,,,,,01.1A,NAFRev1,N,,,0,,,,,,
333135655,00046,33313565500046,O,1994-01-01,NN,,,2019-11-14T14:00:52,false,3,,13,,RTE,ST JACQUES,64450,MIOSSENS-LANUSSE,,,64385,,,,,,,,,,,,,,,,,,,2004-07-01,F,,,,,51.2A,NAFRev1,O,-0.296749,43.472747,0.74,housenumber,13 Route de Saint Jacques 64450 Miossens-Lanusse,64385_0100_00013,G,13 ROUTE DE SAINT JACQUES,
344325972,00018,34432597200018,O,1988-01-01,NN,,,2021-02-23T10:59:22,true,3,,,,,,64450,MIOSSENS-LANUSSE,,,64385,,,,,,,,,,,,,,,,,,,2008-01-01,A,,,,,01.50Z,NAFRev2,N,,,0,,,,,,
347644890,00019,34764489000019,O,,NN,,,2019-11-14T14:00:52,true,1,,,,,,64450,MIOSSENS-LANUSSE,,,64385,,,,,,,,,,,,,,,,,,,1989-06-30,F,,,,,60.08,NAP,N,,,0,,,,,,
352292148,00017,35229214800017,O,1989-01-01,NN,,,2019-11-14T14:00:52,true,3,,,,,,64450,MIOSSENS-LANUSSE,,,64385,,,,,,,,,,,,,,,,,,,2008-01-01,A,,,,,01.11Z,NAFRev2,N,,,0,,,,,,
380279463,00943,38027946300943,O,2008-07-01,NN,,,2019-11-14T14:00:52,false,2,BORNE KILOMETRIQUE 14,,,,A65 PAU LANGON SECTION SUD RD 3,64450,MIOSSENS-LANUSSE,,,64385,,,,,,,,,,,,,,,,,,,2011-06-30,F,EGIS ROUTE SCETAUROUTE,,,,71.12B,NAFRev2,O,,,0,,,,,,
381222462,00016,38122246200016,O,1991-01-30,NN,,,2019-11-14T14:00:52,false,4,,,,,MAIRIE,64450,MIOSSENS-LANUSSE,,,64385,,,,,,,,,,,,,,,,,,,2010-02-25,F,,,,,01.61Z,NAFRev2,N,3.0709671,50.6304695,0.92,poi.townhall,Hôtel de Ville Lille,https://osm.org/way/40917078,G,,
381222462,00024,38122246200024,O,2010-02-25,01,2019,,2021-10-27T08:09:19,true,1,SILO BONAVENTURE,2,,RUE,DE LALONQUETTE,64450,MIOSSENS-LANUSSE,,,64385,,,,,,,,,,,,,,,,,,,2010-02-25,A,,,,,01.61Z,NAFRev2,O,-0.307423,43.464973,0.81,housenumber,2 Route de Lalonquette 64450 Miossens-Lanusse,64385_0060_00002,G,2 ROUTE DE LALONQUETTE,
381222462,00032,38122246200032,O,2019-01-01,,,,2021-02-23T11:09:40,false,1,,2,,RUE,LALONQUETTE,64450,MIOSSENS-LANUSSE,,,64385,,,,,,,,,,,,,,,,,,,2019-01-01,A,,,,,35.11Z,NAFRev2,N,-0.307423,43.464973,0.79,housenumber,2 Route de Lalonquette 64450 Miossens-Lanusse,64385_0060_00002,G,2 ROUTE DE LALONQUETTE,
381222462,00040,38122246200040,O,2019-01-01,,,,2020-06-05T08:55:15,false,1,,2,A,RUE,DE LA LALONQUETTE,64450,MIOSSENS-LANUSSE,,,64385,,,,,,,,,,,,,,,,,,,2019-01-01,A,,,,,35.11Z,NAFRev2,N,-0.314691,43.475135,0.65,street,Route de Lalonquette 64450 Miossens-Lanusse,64385_0060,G,ROUTE DE LALONQUETTE,
382743730,00014,38274373000014,O,1991-08-01,NN,,,2020-10-07T03:57:44,true,4,,,,,,64450,MIOSSENS-LANUSSE,,,64385,,,,,,,,,,,,,,,,,,,2020-05-12,F,,,,,01.11Z,NAFRev2,N,,,0,,,,,,
384791620,00014,38479162000014,O,1992-03-12,NN,,,2019-11-14T14:00:52,true,3,,,,,,64450,MIOSSENS-LANUSSE,,,64385,,,,,,,,,,,,,,,,,,,2008-01-01,A,,,,,49.41B,NAFRev2,N,,,0,,,,,,
384791620,00022,38479162000022,O,1983-12-31,NN,,,2019-11-14T14:00:52,false,4,,1,,RTE,DES PYRENEES,64450,MIOSSENS-LANUSSE,,,64385,,,,,,,,,,,,,,,,,,,2003-01-01,F,,,,,01.1A,NAF1993,N,-0.297994,43.454501,0.84,housenumber,1 Route des Pyrenees 64450 Miossens-Lanusse,64385_0090_00001,G,1 ROUTE DES PYRENEES,
388403214,00017,38840321400017,O,1992-02-01,NN,,,2019-11-14T14:00:52,true,4,,,,,,64450,MIOSSENS-LANUSSE,,,64385,,,,,,,,,,,,,,,,,,,2003-02-14,F,,,,,01.2A,NAFRev1,N,,,0,,,,,,
388715047,00014,38871504700014,O,1992-10-03,NN,,,2019-11-14T14:00:52,true,1,,10,,RTE,DE SAINT JACQUES,64450,MIOSSENS-LANUSSE,,,64385,,,,,,,,,,,,,,,,,,,2002-03-31,F,,,,,60.2E,NAF1993,N,-0.296607,43.472246,0.87,housenumber,10 Route de Saint Jacques 64450 Miossens-Lanusse,64385_0100_00010,G,10 ROUTE DE SAINT JACQUES,
389541764,00012,38954176400012,O,1992-12-10,NN,,,2019-11-14T14:00:52,true,3,CHEZ MONSIEUR ARRAMON ANDR,,,,,64450,MIOSSENS-LANUSSE,,,64385,,,,,,,,,,,,,,,,,,,2008-01-01,A,,,,,01.50Z,NAFRev2,N,,,0,,,,,,
392509279,00015,39250927900015,O,1993-10-01,NN,,,2019-11-14T14:00:52,true,3,,16,,RTE,DE SAINT-JACQUES,64450,MIOSSENS-LANUSSE,,,64385,,,,,,,,,,,,,,,,,,,2008-01-01,A,,,,,68.20A,NAFRev2,N,-0.296813,43.470589,0.87,housenumber,16 Route de Saint Jacques 64450 Miossens-Lanusse,64385_0100_00016,G,16 ROUTE DE SAINT JACQUES,
401051099,00018,40105109900018,O,1995-05-01,NN,,,2019-11-14T14:00:52,true,3,,,,,AU CASSOU,64450,MIOSSENS-LANUSSE,,,64385,,,,,,,,,,,,,,,,,,,2008-01-01,A,,,,,01.50Z,NAFRev2,N,,,0,,,,,,
402499503,00017,40249950300017,O,1995-09-18,NN,,,2020-05-05T10:12:57,true,4,,,,,,64450,MIOSSENS-LANUSSE,,,64385,,,,,,,,,,,,,,,,,,,2020-03-30,F,,,,,68.20B,NAFRev2,N,,,0,,,,,,
403718091,00016,40371809100016,O,1995-09-18,NN,,,2019-11-14T14:00:52,true,5,,16,,RTE,DE SAINT JACQUES,64450,MIOSSENS-LANUSSE,,,64385,,,,,,,,,,,,,,,,,,,2018-08-07,A,,,,,47.99A,NAFRev2,N,-0.296813,43.470589,0.87,housenumber,16 Route de Saint Jacques 64450 Miossens-Lanusse,64385_0100_00016,G,16 ROUTE DE SAINT JACQUES,
403718091,00024,40371809100024,O,1998-01-01,NN,,,2019-11-14T14:00:52,false,4,,,,,,64450,MIOSSENS-LANUSSE,,,64385,,,,,,,,,,,,,,,,,,,2018-05-31,F,,,,,01.11Z,NAFRev2,N,,,0,,,,,,
410672836,00013,41067283600013,O,1976-04-01,NN,,,2019-11-14T14:00:52,true,4,,,,,,64450,MIOSSENS-LANUSSE,,,64385,,,,,,,,,,,,,,,,,,,2008-01-01,A,,,,,68.20B,NAFRev2,N,,,0,,,,,,
411037229,00019,41103722900019,O,1981-01-01,NN,,,2019-11-14T14:00:52,true,3,,,,,,64450,MIOSSENS-LANUSSE,,,64385,,,,,,,,,,,,,,,,,,,2008-01-01,A,,,,,01.50Z,NAFRev2,N,,,0,,,,,,
411274384,00014,41127438400014,O,1997-02-01,NN,,,2019-11-14T14:00:52,true,4,,,,,,64450,MIOSSENS-LANUSSE,,,64385,,,,,,,,,,,,,,,,,,,2016-09-30,F,,,,,01.11Z,NAFRev2,N,,,0,,,,,,
413870262,00016,41387026200016,O,1975-11-01,NN,,,2019-11-14T14:00:52,true,1,,,,,,64450,MIOSSENS-LANUSSE,,,64385,,,,,,,,,,,,,,,,,,,2001-03-02,F,,,,,01.3Z,NAF1993,N,,,0,,,,,,
413911173,00016,41391117300016,O,1900-01-01,,,,2019-11-14T14:00:52,false,3,,,,,MAISON CLAUZET,64450,MIOSSENS-LANUSSE,,,64385,,,,,,,,,,,,,,,,,,,1997-12-25,F,,,,,74.8K,NAF1993,N,,,0,,,,,,
414503961,00016,41450396100016,O,1997-10-01,,,,2019-11-14T14:00:52,true,1,,,,,,64450,MIOSSENS-LANUSSE,,,64385,,,,,,,,,,,,,,,,,,,1999-01-25,F,,,,,74.1J,NAF1993,N,,,0,,,,,,
414504118,00012,41450411800012,O,1997-10-01,,,,2019-11-14T14:00:52,true,1,,,,,,64450,MIOSSENS-LANUSSE,,,64385,,,,,,,,,,,,,,,,,,,1999-12-15,F,,,,,74.1J,NAF1993,N,,,0,,,,,,
414625129,00013,41462512900013,O,1997-12-01,,,,2019-11-14T14:00:52,false,4,,,,,LA MAISON CLAUZET,64450,MIOSSENS-LANUSSE,,,64385,,,,,,,,,,,,,,,,,,,2005-10-01,F,,,,,85.2Z,NAFRev1,O,,,0,,,,,,
414812859,00018,41481285900018,O,1976-01-01,,,,2019-11-14T14:00:52,true,1,,,,,,64450,MIOSSENS-LANUSSE,,,64385,,,,,,,,,,,,,,,,,,,2000-12-31,F,,,,,01.3Z,NAF1993,N,,,0,,,,,,
414813030,00015,41481303000015,O,1972-01-01,NN,,,2019-11-14T14:00:52,true,4,,,,,,64450,MIOSSENS-LANUSSE,,,64385,,,,,,,,,,,,,,,,,,,2008-01-01,F,,,,,68.20B,NAFRev2,N,,,0,,,,,,
414813097,00014,41481309700014,O,1976-01-01,NN,,,2019-11-14T14:00:52,true,3,,,,,,64450,MIOSSENS-LANUSSE,,,64385,,,,,,,,,,,,,,,,,,,1998-06-01,F,,,,,01.3Z,NAF1993,N,,,0,,,,,,
415194851,00010,41519485100010,O,1997-12-28,NN,,,2020-12-31T03:48:49,true,4,,16,,RTE,DE SAINT-JACQUES,64450,MIOSSENS-LANUSSE,,,64385,,,,,,,,,,,,,,,,,,,2020-11-06,F,,,,,68.20B,NAFRev2,N,-0.296813,43.470589,0.87,housenumber,16 Route de Saint Jacques 64450 Miossens-Lanusse,64385_0100_00016,G,16 ROUTE DE SAINT JACQUES,
419195128,00014,41919512800014,O,1983-12-31,NN,,,2019-11-14T14:00:52,true,4,,,,,,64450,MIOSSENS-LANUSSE,,,64385,,,,,,,,,,,,,,,,,,,2012-04-30,F,,,,,01.50Z,NAFRev2,N,,,0,,,,,,
419195136,00017,41919513600017,O,1982-12-31,NN,,,2019-11-14T14:00:52,true,3,,,,,,64450,MIOSSENS-LANUSSE,,,64385,,,,,,,,,,,,,,,,,,,2008-01-01,A,,,,,01.42Z,NAFRev2,N,,,0,,,,,,
419195144,00011,41919514400011,O,1991-01-01,,,,2019-11-14T14:00:52,true,3,,,,,,64450,MIOSSENS-LANUSSE,,,64385,,,,,,,,,,,,,,,,,,,1998-12-25,F,,,,,01.1A,NAF1993,N,,,0,,,,,,
419195151,00016,41919515100016,O,1982-12-31,,,,2019-11-14T14:00:52,true,1,,,,,,64450,MIOSSENS-LANUSSE,,,64385,,,,,,,,,,,,,,,,,,,1999-12-31,F,,,,,01.1A,NAF1993,N,,,0,,,,,,
419254743,00018,41925474300018,O,1993-04-01,NN,,,2019-11-14T14:00:52,true,3,,,,,,64450,MIOSSENS-LANUSSE,,,64385,,,,,,,,,,,,,,,,,,,2005-12-31,F,,,,,01.1A,NAFRev1,N,,,0,,,,,,
419275839,00019,41927583900019,O,1998-06-01,NN,,,2019-11-14T14:00:52,true,4,,,,,,64450,MIOSSENS-LANUSSE,,,64385,,,,,,,,,,,,,,,,,,,2008-01-01,A,,,,,68.20B,NAFRev2,N,,,0,,,,,,
419277686,00012,41927768600012,O,1994-03-01,NN,,,2019-11-14T14:00:52,true,3,,,,,,64450,MIOSSENS-LANUSSE,,,64385,,,,,,,,,,,,,,,,,,,2007-12-31,F,,,,,01.1A,NAFRev1,N,,,0,,,,,,
420030470,00017,42003047000017,O,1998-06-30,NN,,,2019-11-14T14:00:52,true,3,CHEZ MR MME GAUBE ALPHONSE,,,,,64450,MIOSSENS-LANUSSE,,,64385,,,,,,,,,,,,,,,,,,,2008-01-01,A,,,,,68.20B,NAFRev2,N,,,0,,,,,,
420348138,00017,42034813800017,O,1984-12-31,NN,,,2019-11-14T14:00:52,true,3,,,,,,64450,MIOSSENS-LANUSSE,,,64385,,,,,,,,,,,,,,,,,,,2007-05-01,F,,,,,01.1A,NAFRev1,N,,,0,,,,,,
420348146,00010,42034814600010,O,1986-12-31,NN,,,2019-11-14T14:00:52,true,3,,,,,,64450,MIOSSENS-LANUSSE,,,64385,,,,,,,,,,,,,,,,,,,2008-01-01,A,,,,,01.11Z,NAFRev2,N,,,0,,,,,,
421300732,00011,42130073200011,O,1998-06-30,NN,,,2019-11-14T14:00:52,true,3,,,,,,64450,MIOSSENS-LANUSSE,,,64385,,,,,,,,,,,,,,,,,,,2008-01-01,A,,,,,01.11Z,NAFRev2,N,,,0,,,,,,
425214459,00017,42521445900017,O,1972-01-01,NN,,,2019-11-14T14:00:52,true,3,,,,,,64450,MIOSSENS-LANUSSE,,,64385,,,,,,,,,,,,,,,,,,,2008-01-01,A,,,,,01.11Z,NAFRev2,N,,,0,,,,,,
425214467,00010,42521446700010,O,1981-01-01,NN,,,2019-11-14T14:00:52,true,4,,,,,,64450,MIOSSENS-LANUSSE,,,64385,,,,,,,,,,,,,,,,,,,2008-01-13,F,,,,,01.50Z,NAFRev2,N,,,0,,,,,,
428869465,00016,42886946500016,O,2000-01-01,NN,,,2019-11-14T14:00:52,true,4,,,,,,64450,MIOSSENS-LANUSSE,,,64385,,,,,,,,,,,,,,,,,,,2012-03-01,F,,,,,01.11Z,NAFRev2,N,,,0,,,,,,
432088458,00018,43208845800018,O,1995-01-01,NN,,,2019-11-14T14:00:52,true,3,,,,,,64450,MIOSSENS-LANUSSE,,,64385,,,,,,,,,,,,,,,,,,,2003-12-25,F,,,,,74.8F,NAFRev1,N,,,0,,,,,,
432088458,00026,43208845800026,O,2000-01-01,NN,,,2019-11-14T14:00:52,false,3,,,,,,64450,MIOSSENS-LANUSSE,,,64385,,,,,,,,,,,,,,,,,,,2002-12-31,F,,,,,67.2Z,NAF1993,N,,,0,,,,,,
432134351,00019,43213435100019,O,2000-04-11,NN,,,2019-11-14T14:00:52,true,3,,12,,CHE,HENRI,64450,MIOSSENS-LANUSSE,,,64385,,,,,,,,,,,,,,,,,,,2008-01-01,A,,,,,68.20B,NAFRev2,N,-0.298615,43.463556,0.79,housenumber,12 Chemin Henri IV 64450 Miossens-Lanusse,64385_0040_00012,G,12 CHEMIN HENRI IV,
433206273,00016,43320627300016,O,2000-08-02,NN,,,2019-11-14T14:00:52,false,4,,,,,,64450,MIOSSENS-LANUSSE,,,64385,,,,,,,,,,,,,,,,,,,2002-12-31,F,,,,,01.2A,NAF1993,N,,,0,,,,,,
433206273,00024,43320627300024,O,2003-10-15,NN,,,2019-11-14T14:00:52,true,3,,,,,,64450,MIOSSENS-LANUSSE,,,64385,,,,,,,,,,,,,,,,,,,2008-01-01,A,,,,,01.42Z,NAFRev2,N,,,0,,,,,,
434635348,00015,43463534800015,O,2001-02-19,NN,,,2019-11-14T14:00:52,false,4,,5,,CHE,DE L'ARRIOU,64450,MIOSSENS-LANUSSE,,,64385,,,,,,,,,,,,,,,,,,,2004-01-23,F,TUROUNET PISCINES,,,,45.4M,NAFRev1,N,-0.308626,43.47678,0.84,housenumber,5 Chemin de l’Arriou 64450 Miossens-Lanusse,64385_0012_00005,G,5 CHEMIN DE L ARRIOU,
440807576,00010,44080757600010,O,2001-03-03,NN,,,2019-11-14T14:00:52,true,3,,7,,RTE,DES PYRENEES,64450,MIOSSENS-LANUSSE,,,64385,,,,,,,,,,,,,,,,,,,2008-01-01,A,,,,,01.11Z,NAFRev2,N,-0.299851,43.457219,0.84,housenumber,7 Route des Pyrenees 64450 Miossens-Lanusse,64385_0090_00007,G,7 ROUTE DES PYRENEES,
440910198,00017,44091019800017,O,2002-02-15,NN,,,2019-11-14T14:00:52,true,4,,10,,RTE,DE SAINT JACQUES,64450,MIOSSENS-LANUSSE,,,64385,,,,,,,,,,,,,,,,,,,2012-02-01,F,,,,,49.32Z,NAFRev2,N,-0.296607,43.472246,0.87,housenumber,10 Route de Saint Jacques 64450 Miossens-Lanusse,64385_0100_00010,G,10 ROUTE DE SAINT JACQUES,
442760526,00024,44276052600024,O,2011-01-10,00,2019,,2021-10-27T08:23:19,true,5,,1,,CHE,MAYLOU,64450,MIOSSENS-LANUSSE,,,64385,,,,,,,,,,,,,,,,,,,2018-12-31,A,,,,,70.22Z,NAFRev2,N,-0.303539,43.468146,0.85,housenumber,1 Chemin de Maylou 64450 Miossens-Lanusse,64385_0070_00001,G,1 CHEMIN DE MAYLOU,
444040562,00019,44404056200019,O,2002-10-09,NN,,,2019-11-14T14:00:52,true,3,,,,,,64450,MIOSSENS-LANUSSE,,,64385,,,,,,,,,,,,,,,,,,,2008-01-01,A,,,,,68.20B,NAFRev2,N,,,0,,,,,,
444653992,00016,44465399200016,O,2002-12-20,NN,,,2019-11-14T14:00:52,false,4,,,,,,64450,MIOSSENS-LANUSSE,,,64385,,,,,,,,,,,,,,,,,,,2012-02-01,F,,,,,01.41Z,NAFRev2,N,,,0,,,,,,
444653992,00024,44465399200024,O,2012-02-01,NN,,,2021-02-23T13:27:30,true,1,,9,B,RTE,DES PYRENEES,64450,MIOSSENS-LANUSSE,,,64385,,,,,,,,,,,,,,,,,,,2012-02-01,A,,,,,01.42Z,NAFRev2,N,-0.30225,43.459257,0.75,housenumber,9bis Route des Pyrenees 64450 Miossens-Lanusse,64385_0090_00009_bis,G,9BIS ROUTE DES PYRENEES,
444849087,00010,44484908700010,O,1987-04-03,NN,,,2019-11-14T14:00:52,true,3,,,,,,64450,MIOSSENS-LANUSSE,,,64385,,,,,,,,,,,,,,,,,,,2008-01-01,A,,,,,01.11Z,NAFRev2,N,,,0,,,,,,
447692609,00012,44769260900012,O,2003-02-15,NN,,,2019-11-14T14:00:52,true,4,,17,,RTE,DE SAINT JACQUES,64450,MIOSSENS-LANUSSE,,,64385,,,,,,,,,,,,,,,,,,,2012-01-01,A,,,,,01.11Z,NAFRev2,O,-0.297949,43.469343,0.87,housenumber,17 Route de Saint Jacques 64450 Miossens-Lanusse,64385_0100_00017,G,17 ROUTE DE SAINT JACQUES,
449172576,00018,44917257600018,O,2003-05-01,NN,,,2019-11-14T14:00:52,true,3,,3,,CHE,DE L ARRICABET,64450,MIOSSENS-LANUSSE,,,64385,,,,,,,,,,,,,,,,,,,2008-01-01,A,,,,,01.11Z,NAFRev2,N,-0.300344,43.467742,0.85,housenumber,3 Chemin de l’Arricabet 64450 Miossens-Lanusse,64385_0010_00003,G,3 CHEMIN DE L ARRICABET,
453365199,00018,45336519900018,O,2004-03-01,NN,,,2021-02-23T13:37:43,true,3,,,,,,64450,MIOSSENS-LANUSSE,,,64385,,,,,,,,,,,,,,,,,,,2008-01-01,A,,,,,01.50Z,NAFRev2,N,,,0,,,,,,
479158834,00016,47915883400016,O,2004-11-15,,,9602BA,2019-11-14T14:00:52,true,3,,,,VLA,LA MANDRAGORE,64450,MIOSSENS-LANUSSE,,,64385,,,,,,,,,,,,,,,,,,,2008-01-01,A,,,,,96.02B,NAFRev2,N,5.7267105,45.1896849,0.74,poi.pharmacy,Pharmacie de la Mandragore Grenoble,https://osm.org/node/313953255,G,,
480312057,00015,48031205700015,O,2005-01-02,,,,2019-11-14T14:00:52,true,3,,20,,RTE,SAINT JACQUES,64450,MIOSSENS-LANUSSE,,,64385,,,,,,,,,,,,,,,,,,,2008-01-01,F,,,,,70.22Z,NAFRev2,N,-0.298811,43.468469,0.86,housenumber,20 Route de Saint Jacques 64450 Miossens-Lanusse,64385_0100_00020,G,20 ROUTE DE SAINT JACQUES,
480406974,00018,48040697400018,O,2005-01-02,,,,2019-11-14T14:00:52,true,3,,13,,RUE,SAINT JACQUES,64450,MIOSSENS-LANUSSE,,,64385,,,,,,,,,,,,,,,,,,,2008-09-24,F,,,,,47.78B,NAFRev2,N,-0.296749,43.472747,0.81,housenumber,13 Route de Saint Jacques 64450 Miossens-Lanusse,64385_0100_00013,G,13 ROUTE DE SAINT JACQUES,
488088469,00017,48808846900017,O,2006-01-01,,,,2019-11-14T14:00:52,true,2,,5,,RTE,DE LALONQUETTE,64450,MIOSSENS-LANUSSE,,,64385,,,,,,,,,,,,,,,,,,,2008-01-01,A,,,,,01.11Z,NAFRev2,N,-0.313029,43.473103,0.85,housenumber,5 Route de Lalonquette 64450 Miossens-Lanusse,64385_0060_00005,G,5 ROUTE DE LALONQUETTE,
488360009,00028,48836000900028,O,2016-12-05,,,2630ZZ,2021-02-23T13:52:53,true,2,PEPINIERE D'ENT INTERCOMMUNALE ESPELID,,,,PARC D'ACT ECO THEZE-MIOSSENS,64450,MIOSSENS-LANUSSE,,,64385,,,,,,,,,,,,,,,,,,,2018-07-09,A,,,,,26.30Z,NAFRev2,O,,,0,,,,,,
488656307,00029,48865630700029,O,2016-08-06,,,,2020-10-13T19:34:50,false,2,,12,,RTE,DE LA LONQUETTE,64450,MIOSSENS-LANUSSE,,,64385,,,,,,,,,,,,,,,,,,,2020-06-27,F,,,,,68.20B,NAFRev2,N,-0.314808,43.475659,0.74,housenumber,12 Route de Lalonquette 64450 Miossens-Lanusse,64385_0060_00012,G,12 ROUTE DE LALONQUETTE,
491796512,00037,49179651200037,O,2011-07-20,,,4322BC,2021-02-23T13:58:19,true,1,,,,RTE,PYRENEES,64450,MIOSSENS-LANUSSE,,,64385,,,,,,,,,,,,,,,,,,,2011-07-20,A,,,,DOMINGO DEPANNAGE ET ENTRETIEN,43.22B,NAFRev2,N,-0.302362,43.460491,0.72,street,Route des Pyrenees 64450 Miossens-Lanusse,64385_0090,G,ROUTE DES PYRENEES,
492966460,00015,49296646000015,O,1998-01-01,,,,2019-11-14T14:00:52,true,2,MAISON VIGNAU,,,,,64450,MIOSSENS-LANUSSE,,,64385,,,,,,,,,,,,,,,,,,,2008-01-01,A,,,,,01.42Z,NAFRev2,N,,,0,,,,,,
495021479,00029,49502147900029,O,2015-07-01,,,,2019-11-14T14:00:52,true,2,,1,,RTE,DE ST JACQUES,64450,MIOSSENS-LANUSSE,,,64385,,,,,,,,,,,,,,,,,,,2016-08-01,F,,,,,81.22Z,NAFRev2,N,-0.299371,43.47569,0.77,housenumber,1 Route de Saint Jacques 64450 Miossens-Lanusse,64385_0100_00001,G,1 ROUTE DE SAINT JACQUES,
497555342,00011,49755534200011,O,2007-03-23,,,,2019-11-14T14:00:52,true,2,,12,,CHE,HENRI IV,64450,MIOSSENS-LANUSSE,,,64385,,,,,,,,,,,,,,,,,,,2008-01-01,A,,,,,70.22Z,NAFRev2,N,-0.298615,43.463556,0.82,housenumber,12 Chemin Henri IV 64450 Miossens-Lanusse,64385_0040_00012,G,12 CHEMIN HENRI IV,
498117308,00011,49811730800011,O,2007-05-01,,,,2019-11-14T14:00:52,true,2,,1,,CHE,MAYLOU,64450,MIOSSENS-LANUSSE,,,64385,,,,,,,,,,,,,,,,,,,2007-05-02,F,,,,,01.1A,NAFRev1,N,-0.303539,43.468146,0.85,housenumber,1 Chemin de Maylou 64450 Miossens-Lanusse,64385_0070_00001,G,1 CHEMIN DE MAYLOU,
498477140,00012,49847714000012,O,2007-05-02,,,,2019-11-14T14:00:52,true,2,,1,,CHE,MAYLOU,64450,MIOSSENS-LANUSSE,,,64385,,,,,,,,,,,,,,,,,,,2008-01-01,A,,,,,01.11Z,NAFRev2,N,-0.303539,43.468146,0.85,housenumber,1 Chemin de Maylou 64450 Miossens-Lanusse,64385_0070_00001,G,1 CHEMIN DE MAYLOU,
500109319,00011,50010931900011,O,2007-09-02,,,,2019-11-14T14:00:52,true,2,,,,RTE,SAINT JACQUES,64450,MIOSSENS-LANUSSE,,,64385,,,,,,,,,,,,,,,,,,,2008-01-01,A,,,,,01.11Z,NAFRev2,N,-0.296749,43.472747,0.84,street,Route de Saint Jacques 64450 Miossens-Lanusse,64385_0100,G,ROUTE DE SAINT JACQUES,
500109319,00029,50010931900029,O,2012-06-18,,,,2021-02-23T14:09:16,false,1,,30,,RTE,DE SAINT JACQUES,64450,MIOSSENS-LANUSSE,,,64385,,,,,,,,,,,,,,,,,,,2012-06-18,A,,,,PASSION CUISINE BRIGITTE,56.21Z,NAFRev2,N,-0.301805,43.468666,0.87,housenumber,30 Route de Saint Jacques 64450 Miossens-Lanusse,64385_0100_00030,G,30 ROUTE DE SAINT JACQUES,
500176763,00018,50017676300018,O,2007-07-05,,,,2019-11-14T14:00:52,false,3,,7,,CHE,DE L ARRIOU,64450,MIOSSENS-LANUSSE,,,64385,,,,,,,,,,,,,,,,,,,2008-11-17,F,,,,,86.90D,NAFRev2,N,-0.310722,43.477051,0.84,housenumber,7 Chemin de l’Arriou 64450 Miossens-Lanusse,64385_0012_00007,G,7 CHEMIN DE L ARRIOU,
501311682,00014,50131168200014,O,2008-01-01,,,,2019-11-14T14:00:52,true,2,,2,,CHE,ARRIOU,64450,MIOSSENS-LANUSSE,,,64385,,,,,,,,,,,,,,,,,,,2016-10-01,F,,,,,01.11Z,NAFRev2,N,-0.304301,43.476299,0.79,housenumber,2 Chemin de l’Arriou 64450 Miossens-Lanusse,64385_0012_00002,G,2 CHEMIN DE L ARRIOU,
501357248,00019,50135724800019,O,2007-08-21,,,,2019-11-14T14:00:52,false,3,,2,,IMP,CAZENAVE,64450,MIOSSENS-LANUSSE,,,64385,,,,,,,,,,,,,,,,,,,2008-01-01,F,,,,,86.90D,NAFRev2,N,-0.302774,43.463728,0.81,housenumber,2 Impasse Cazenave 64450 Miossens-Lanusse,64385_0020_00002,G,2 IMPASSE CAZENAVE,
505236810,00022,50523681000022,O,2011-03-01,,,,2021-02-23T14:18:55,true,1,,,,CHE,DE L ARRIOU,64450,MIOSSENS-LANUSSE,,,64385,,,,,,,,,,,,,,,,,,,2011-03-01,A,,,,,01.11Z,NAFRev2,N,-0.310757,43.477054,0.83,street,Chemin de l’Arriou 64450 Miossens-Lanusse,64385_0012,G,CHEMIN DE L ARRIOU,
507742344,00017,50774234400017,O,2008-07-01,,,,2019-11-14T14:00:52,true,2,,29,,RTE,ST JACQUES DE COMPOSTELLE,64450,MIOSSENS-LANUSSE,,,64385,,,,,,,,,,,,,,,,,,,2008-09-30,F,,,,,47.89Z,NAFRev2,N,-0.302981,43.464946,0.49,housenumber,29 Route de Saint Jacques 64450 Miossens-Lanusse,64385_0100_00029,G,29 ROUTE DE SAINT JACQUES,
509501300,00016,50950130000016,O,2008-10-07,,,,2019-11-14T14:00:52,false,2,,2,,CHE,DE L ARRIOU,64450,MIOSSENS-LANUSSE,,,64385,,,,,,,,,,,,,,,,,,,2009-03-20,F,,,,,86.23Z,NAFRev2,N,-0.304301,43.476299,0.84,housenumber,2 Chemin de l’Arriou 64450 Miossens-Lanusse,64385_0012_00002,G,2 CHEMIN DE L ARRIOU,
510757362,00015,51075736200015,O,2009-02-26,01,2019,4776ZP,2021-10-27T08:16:49,true,2,,2,,RTE,DE SAINT JACQUES,64450,MIOSSENS-LANUSSE,,,64385,,,,,,,,,,,,,,,,,,,2009-04-01,A,UN JOUR UNE FLEUR,,,,47.76Z,NAFRev2,O,-0.291365,43.478358,0.87,housenumber,2 Route de Saint Jacques 64450 Miossens-Lanusse,64385_0100_00002,G,2 ROUTE DE SAINT JACQUES,
514891761,00017,51489176100017,O,2009-09-01,,,,2019-11-14T14:00:52,true,2,,2,,,ROUTE DE ST JACQUES,64450,MIOSSENS-LANUSSE,,,64385,,,,,,,,,,,,,,,,,,,2014-01-14,F,,,,,74.90A,NAFRev2,N,-0.291365,43.478358,0.86,housenumber,2 Route de Saint Jacques 64450 Miossens-Lanusse,64385_0100_00002,G,2 ROUTE DE SAINT JACQUES,