siren,nic,siret,statutDiffusionEtablissement,dateCreationEtablissement,trancheEffectifsEtablissement,anneeEffectifsEtablissement,activitePrincipaleRegistreMetiersEtablissement,dateDernierTraitementEtablissement,etablissementSiege,nombrePeriodesEtablissement,complementAdresseEtablissement,numeroVoieEtablissement,indiceRepetitionEtablissement,typeVoieEtablissement,libelleVoieEtablissement,codePostalEtablissement,libelleCommuneEtablissement,libelleCommuneEtrangerEtablissement,distributionSpecialeEtablissement,codeCommuneEtablissement,codeCedexEtablissement,libelleCedexEtablissement,codePaysEtrangerEtablissement,libellePaysEtrangerEtablissement,complementAdresse2Etablissement,numeroVoie2Etablissement,indiceRepetition2Etablissement,typeVoie2Etablissement,libelleVoie2Etablissement,codePostal2Etablissement,libelleCommune2Etablissement,libelleCommuneEtranger2Etablissement,distributionSpeciale2Etablissement,codeCommune2Etablissement,codeCedex2Etablissement,libelleCedex2Etablissement,codePaysEtranger2Etablissement,libellePaysEtranger2Etablissement,dateDebut,etatAdministratifEtablissement,enseigne1Etablissement,enseigne2Etablissement,enseigne3Etablissement,denominationUsuelleEtablissement,activitePrincipaleEtablissement,nomenclatureActivitePrincipaleEtablissement,caractereEmployeurEtablissement,longitude,latitude,geo_score,geo_type,geo_adresse,geo_id,geo_ligne,geo_l4,geo_l5
218601912,00015,21860191200015,O,1983-03-01,02,2019,,2021-10-27T08:11:05,true,4,,2,,RUE,DU LAVOIR,86500,PINDRAY,,,86191,,,,,,,,,,,,,,,,,,,2008-01-01,A,MAIRIE,,,,84.11Z,NAFRev2,O,0.810203,46.490645,0.94,housenumber,2 Rue du Lavoir 86500 Pindray,86191_0090_00002,G,2 RUE DU LAVOIR,
218601912,00023,21860191200023,O,1996-12-26,NN,,,2019-01-31T17:12:01,false,4,MAIRIE,2,,RUE,DU LAVOIR,86500,PINDRAY,,,86191,,,,,,,,,,,,,,,,,,,2017-12-31,F,SERVICE D'ASSAINISSEMENT,,,,37.00Z,NAFRev2,N,0.810203,46.490645,0.94,housenumber,2 Rue du Lavoir 86500 Pindray,86191_0090_00002,G,2 RUE DU LAVOIR,
268601051,00017,26860105100017,O,1995-12-25,NN,,,2012-10-24T16:32:35,true,3,MAIRIE,2,,RUE,DU LAVOIR,86500,PINDRAY,,,86191,,,,,,,,,,,,,,,,,,,2011-12-25,A,,,,,88.99B,NAFRev2,N,0.810203,46.490645,0.94,housenumber,2 Rue du Lavoir 86500 Pindray,86191_0090_00002,G,2 RUE DU LAVOIR,
301326450,00105,30132645000105,O,2000-05-10,NN,,,2006-10-26T23:51:34,false,3,,,,,LA TUILERIE,86500,PINDRAY,,,86191,,,,,,,,,,,,,,,,,,,2005-01-01,F,,,,,92.3A,NAFRev1,N,0.830821,46.474497,0.54,street,Lieu Dit la Roche Tuile 86500 Pindray,86191_B147,G,LIEU DIT LA ROCHE TUILE,
310762638,00032,31076263800032,O,,NN,,,,true,1,,,,LD,LE PLASTEAU,86500,PINDRAY,,,86191,,,,,,,,,,,,,,,,,,,,F,,,,,55.40,NAP,N,0.826057,46.446625,0.77,street,Les Brandes du Plasteau 86500 Pindray,86191_B023,G,LES BRANDES DU PLASTEAU,
316010644,00029,31601064400029,O,1986-01-01,NN,,,2008-11-07T00:31:32,true,3,LE PLASTEAU,,,RTE,,86500,PINDRAY,,,86191,,,,,,,,,,,,,,,,,,,2004-12-31,F,,,,,45.2V,NAFRev1,N,0.82563,46.488431,0.38,street,Rue de la Dionette 86500 Pindray,86191_0045,G,RUE DE LA DIONETTE,
322051061,00057,32205106100057,O,2002-10-01,NN,,,2008-03-18T19:01:34,true,4,,,,,LE BOURG,86500,PINDRAY,,,86191,,,,,,,,,,,,,,,,,,,2008-03-31,F,,,,,47.89Z,NAFRev2,N,0.805493,46.488318,0.31,locality,Le Moulin de Pindray 86500 Pindray,86191_B097,G,LE MOULIN DE PINDRAY,
322684150,00020,32268415000020,O,2003-11-16,NN,,,2006-11-25T09:52:23,true,3,,,,LD,LE FAISANT VALOIR,86500,PINDRAY,,,86191,,,,,,,,,,,,,,,,,,,2004-05-24,F,,,,,74.1J,NAFRev1,N,,,0,,,,,,
325102309,00011,32510230900011,O,1982-08-02,01,2018,,2020-08-25T10:31:09,true,3,,,,LD,PETIT POIRAT,86500,PINDRAY,,,86191,,,,,,,,,,,,,,,,,,,2008-01-01,A,,,,,01.45Z,NAFRev2,N,0.810144,46.453797,0.64,street,Lieu Dit le Poirat 86500 Pindray,86191_zna7yb,G,LIEU DIT LE POIRAT,
326273208,00024,32627320800024,O,2003-01-01,NN,,,2006-10-27T01:38:42,true,3,,,,,LE BOURG,86500,PINDRAY,,,86191,,,,,,,,,,,,,,,,,,,2005-12-31,F,,,,,70.2C,NAFRev1,N,0.805493,46.488318,0.31,locality,Le Moulin de Pindray 86500 Pindray,86191_B097,G,LE MOULIN DE PINDRAY,
326771292,00025,32677129200025,O,2010-10-15,,,,2021-02-23T10:48:40,true,1,,,,,LE MOULIN DE PRUNIER,86500,PINDRAY,,,86191,,,,,,,,,,,,,,,,,,,2010-10-15,A,,,,,47.99A,NAFRev2,N,0.855967,46.464338,0.66,street,Moulin Prunier 86500 Pindray,86191_B098,G,MOULIN PRUNIER,
327470365,00013,32747036500013,O,1974-01-01,NN,,,2018-12-12T09:45:58,true,6,,,,LD,COUPE,86500,PINDRAY,,,86191,,,,,,,,,,,,,,,,,,,2018-04-01,F,,,,,81.30Z,NAFRev2,O,0.855956,46.459292,0.77,street,Couppé 86500 Pindray,86191_g06q7v,G,COUPPE,
327470365,00021,32747036500021,O,1987-12-31,,,,2013-04-29T23:56:16,false,4,,,,,COUPE,86500,PINDRAY,,,86191,,,,,,,,,,,,,,,,,,,2011-06-30,F,,,,,01.24Z,NAFRev2,N,0.855956,46.459292,0.77,street,Couppé 86500 Pindray,86191_g06q7v,G,COUPPE,
327527149,00014,32752714900014,O,1983-07-01,NN,,2370ZZ,2017-05-04T03:54:45,true,5,L'EBEAUPIN,3,,RUE,DE LA DIONETTE,86500,PINDRAY,,,86191,,,,,,,,,,,,,,,,,,,2015-12-28,F,,,,,23.70Z,NAFRev2,O,0.825664,46.487749,0.94,housenumber,3 Rue de la Dionette 86500 Pindray,86191_0045_00003,G,3 RUE DE LA DIONETTE,
331321497,00017,33132149700017,O,1973-09-01,NN,,,2008-01-04T20:10:37,true,3,,,,,MAIRIE,86500,PINDRAY,,,86191,,,,,,,,,,,,,,,,,,,2008-01-01,A,,,,,94.99Z,NAFRev2,N,0.807413,46.490508,0.38,street,Rue du Poirier Cure 86500 Pindray,86191_0125,G,RUE DU POIRIER CURE,
333890531,00028,33389053100028,O,1998-08-27,NN,,,2015-05-14T06:48:27,true,3,,,,,LE GRAND SCOT,86500,PINDRAY,,,86191,,,,,,,,,,,,,,,,,,,2008-01-01,A,,,,,01.50Z,NAFRev2,N,0.827085,46.499398,0.93,locality,Le Grand Scot 86500 Pindray,86191_B074,G,LE GRAND SCOT,
334750742,00010,33475074200010,O,1986-01-01,NN,,,,false,3,,,,LD,LA ROCHE A BAUSSANT,86500,PINDRAY,,,86191,,,,,,,,,,,,,,,,,,,1994-01-01,F,,,,,01.1A,NAF1993,N,0.830821,46.474497,0.43,street,Lieu Dit la Roche Tuile 86500 Pindray,86191_B147,G,LIEU DIT LA ROCHE TUILE,
334750742,00028,33475074200028,O,1994-01-01,NN,,,2008-04-05T00:37:58,true,3,,,,,LES LOGES,86500,PINDRAY,,,86191,,,,,,,,,,,,,,,,,,,2008-01-01,A,,,,,01.42Z,NAFRev2,N,0.826333,46.469882,0.91,street,Lieu Dit les Loges 86500 Pindray,86191_3pbaxg,G,LIEU DIT LES LOGES,
342281235,00057,34228123500057,O,2009-12-21,,,,2009-12-29T19:45:18,false,1,,,,,SOULAGE,86500,PINDRAY,,,86191,,,,,,,,,,,,,,,,,,,2009-12-21,A,,,,,35.11Z,NAFRev2,N,5.7385668,45.1752711,0.9,poi.park,Parc Soulage Grenoble,https://osm.org/way/105908863,G,,
342445251,00016,34244525100016,O,1987-08-01,01,2019,,2021-10-27T08:35:11,true,4,,17,,LD,PRUNIER,86500,PINDRAY,,,86191,,,,,,,,,,,,,,,,,,,2012-12-31,A,,,,,01.11Z,NAFRev2,O,0.851121,46.467173,0.84,housenumber,17 Lieu Dit Prunier 86500 Pindray,86191_bdoxmr_00017,G,17 LIEU DIT PRUNIER,
343209516,00024,34320951600024,O,2009-10-01,,,,2017-12-20T04:22:43,true,2,LE BOURG,,,,LE FAISANT VALOIR,86500,PINDRAY,,,86191,,,,,,,,,,,,,,,,,,,2017-10-31,F,,,,,74.20Z,NAFRev2,N,,,0,,,,,,
348773839,00033,34877383900033,O,2011-10-15,01,2018,,2021-02-23T11:01:44,true,1,,,,,LE MOULIN DE PINDRAY,86500,PINDRAY,,,86191,,,,,,,,,,,,,,,,,,,2011-10-15,A,,,,,47.99A,NAFRev2,N,0.805493,46.488318,0.93,locality,Le Moulin de Pindray 86500 Pindray,86191_B097,G,LE MOULIN DE PINDRAY,
349233890,00020,34923389000020,O,1900-01-01,NN,,,2006-12-15T00:35:11,false,3,,,,LD,BEAUREGARD,86500,PINDRAY,,,86191,,,,,,,,,,,,,,,,,,,1992-11-30,F,,,,,01.1A,NAF1993,N,2.44911,48.7282215,0.9,poi.park,Parc Beauregard Villeneuve-Saint-Georges,https://osm.org/way/256864200,G,,
380432815,00013,38043281500013,O,1991-01-01,NN,,,2007-10-09T05:20:53,true,3,,,,,L'EBEAUPIN,86500,PINDRAY,,,86191,,,,,,,,,,,,,,,,,,,2004-09-28,F,,,,,01.1A,NAFRev1,N,0.81165,46.490374,0.34,street,Rue de l’Eglise 86500 Pindray,86191_0055,G,RUE DE L EGLISE,
381674357,00011,38167435700011,O,1991-01-01,NN,,,2009-02-08T05:51:29,true,4,,,,LD,BEAUREGARD,86500,PINDRAY,,,86191,,,,,,,,,,,,,,,,,,,2008-10-01,A,,,,,01.42Z,NAFRev2,N,2.44911,48.7282215,0.9,poi.park,Parc Beauregard Villeneuve-Saint-Georges,https://osm.org/way/256864200,G,,
381674399,00013,38167439900013,O,1991-01-01,NN,,,2008-11-06T05:36:01,true,4,,,,LD,BEAUREGARD,86500,PINDRAY,,,86191,,,,,,,,,,,,,,,,,,,2008-09-30,F,,,,,01.43Z,NAFRev2,N,2.44911,48.7282215,0.9,poi.park,Parc Beauregard Villeneuve-Saint-Georges,https://osm.org/way/256864200,G,,
382966521,00017,38296652100017,O,1991-10-08,NN,,,2008-11-08T00:42:25,false,4,,,,,LA GROGE,86500,PINDRAY,,,86191,,,,,,,,,,,,,,,,,,,1995-03-01,F,BEAUTE SERVICES,,,,93.0E,NAF1993,N,0.794292,46.468718,0.5,street,La Loge à Cornuchon 86500 Pindray,86191_B089,G,LA LOGE A CORNUCHON,
383003985,00017,38300398500017,O,1991-08-05,NN,,,,false,4,,,,LD,PRUNIER,86500,PINDRAY,,,86191,,,,,,,,,,,,,,,,,,,1995-12-25,F,,,,,01.1A,NAF1993,N,0.849727,46.466765,0.92,street,Lieu Dit Prunier 86500 Pindray,86191_bdoxmr,G,LIEU DIT PRUNIER,
384080719,00196,38408071900196,O,2020-11-10,,,,2021-06-17T11:17:02,false,1,,,,,LE PETIT POIRAT,86500,PINDRAY,,,86191,,,,,,,,,,,,,,,,,,,2020-11-10,A,,,,,35.11Z,NAFRev2,N,0.810144,46.453797,0.69,street,Lieu Dit le Poirat 86500 Pindray,86191_zna7yb,G,LIEU DIT LE POIRAT,
397531989,00010,39753198900010,O,1993-01-01,NN,,,2008-01-04T18:29:35,true,3,,,,,BEAUREGARD,86500,PINDRAY,,,86191,,,,,,,,,,,,,,,,,,,2008-01-01,A,,,,,01.11Z,NAFRev2,N,2.44911,48.7282215,0.9,poi.park,Parc Beauregard Villeneuve-Saint-Georges,https://osm.org/way/256864200,G,,
397990565,00012,39799056500012,O,1994-07-22,NN,,,2021-04-02T03:36:58,true,4,,,,,L'EBAUPIN,86500,PINDRAY,,,86191,,,,,,,,,,,,,,,,,,,2021-04-01,F,,,,,68.20A,NAFRev2,N,0.81165,46.490374,0.37,street,Rue de l’Eglise 86500 Pindray,86191_0055,G,RUE DE L EGLISE,
398005249,00014,39800524900014,O,,,,,,true,1,,,,,LE TERRIER,86500,PINDRAY,,,86191,,,,,,,,,,,,,,,,,,,1997-11-01,F,,,,,01.1A,NAF1993,N,0.807413,46.490508,0.35,street,Rue du Poirier Cure 86500 Pindray,86191_0125,G,RUE DU POIRIER CURE,
399362342,00012,39936234200012,O,1994-04-07,NN,,,2020-12-25T03:33:58,true,3,,,,,GRAILLE,86500,PINDRAY,,,86191,,,,,,,,,,,,,,,,,,,2008-01-01,A,,,,,68.20B,NAFRev2,N,0.791224,46.488119,0.91,street,Lieu Dit Graille 86500 Pindray,86191_532vap,G,LIEU DIT GRAILLE,
400099677,00017,40009967700017,O,1994-01-01,NN,,,,true,4,,,,,LA PIAUDERIE,86500,PINDRAY,,,86191,,,,,,,,,,,,,,,,,,,2001-09-30,F,,,,,01.2A,NAF1993,N,0.82563,46.488431,0.3,street,Rue de la Dionette 86500 Pindray,86191_0045,G,RUE DE LA DIONETTE,
409041217,00012,40904121700012,O,,NN,,,,true,1,,,,LD,LA FERME,86500,PINDRAY,,,86191,,,,,,,,,,,,,,,,,,,1997-09-30,F,,,,,52.6D,NAF1993,N,0.82563,46.488431,0.31,street,Rue de la Dionette 86500 Pindray,86191_0045,G,RUE DE LA DIONETTE,
410784730,00013,41078473000013,O,1997-01-01,NN,,,2008-01-04T21:49:05,true,3,,,,,LE PETIT POIRAT,86500,PINDRAY,,,86191,,,,,,,,,,,,,,,,,,,2008-01-01,A,,,,,68.20B,NAFRev2,N,0.810144,46.453797,0.69,street,Lieu Dit le Poirat 86500 Pindray,86191_zna7yb,G,LIEU DIT LE POIRAT,
412430274,00016,41243027400016,O,1978-01-01,,,,,true,1,,,,,LA TUILERIE,86500,PINDRAY,,,86191,,,,,,,,,,,,,,,,,,,1998-09-29,F,,,,,01.3Z,NAF1993,N,0.830821,46.474497,0.54,street,Lieu Dit la Roche Tuile 86500 Pindray,86191_B147,G,LIEU DIT LA ROCHE TUILE,
412862476,00014,41286247600014,O,1987-12-31,NN,,,2012-07-28T14:25:11,true,4,,,,,GRAILLE,86500,PINDRAY,,,86191,,,,,,,,,,,,,,,,,,,2008-12-25,F,,,,,01.11Z,NAFRev2,N,0.791224,46.488119,0.91,street,Lieu Dit Graille 86500 Pindray,86191_532vap,G,LIEU DIT GRAILLE,
412864175,00010,41286417500010,O,1987-12-31,NN,,,,true,1,,,,,GRAILLE,86500,PINDRAY,,,86191,,,,,,,,,,,,,,,,,,,1999-12-31,F,,,,,01.1A,NAF1993,N,0.791224,46.488119,0.91,street,Lieu Dit Graille 86500 Pindray,86191_532vap,G,LIEU DIT GRAILLE,
412867798,00016,41286779800016,O,1987-12-31,NN,,,2014-02-10T02:31:56,true,4,,,,,COUPE,86500,PINDRAY,,,86191,,,,,,,,,,,,,,,,,,,2013-09-29,F,,,,,01.11Z,NAFRev2,N,0.855956,46.459292,0.77,street,Couppé 86500 Pindray,86191_g06q7v,G,COUPPE,
412873051,00012,41287305100012,O,1991-09-29,NN,,,2008-01-04T22:23:53,true,3,,,,,PRUNIER,86500,PINDRAY,,,86191,,,,,,,,,,,,,,,,,,,2008-01-01,A,,,,,01.50Z,NAFRev2,N,0.849727,46.466765,0.92,street,Lieu Dit Prunier 86500 Pindray,86191_bdoxmr,G,LIEU DIT PRUNIER,
413073784,00014,41307378400014,O,1997-06-25,NN,,,2021-04-03T03:40:56,true,4,,,,,LA MAISON NEUVE,86500,PINDRAY,,,86191,,,,,,,,,,,,,,,,,,,2021-04-02,F,,,,,01.11Z,NAFRev2,N,0.79064,46.475747,0.92,locality,Piece de la Maison Neuve 86500 Pindray,86191_B115,G,PIECE DE LA MAISON NEUVE,
413616384,00017,41361638400017,O,1997-08-18,NN,,,2021-04-06T13:41:41,true,4,,,,,CHATEAU DE PINDRAY,86500,PINDRAY,,,86191,,,,,,,,,,,,,,,,,,,2021-04-01,F,,,,,68.20A,NAFRev2,N,0.855019,46.465666,0.92,street,Chateau de Prunier 86500 Pindray,86191_B030,G,CHATEAU DE PRUNIER,
413946864,00019,41394686400019,O,1987-12-31,NN,,,2008-01-04T22:40:59,true,3,,,,,LA ROCHE A BEAUSSANT,86500,PINDRAY,,,86191,,,,,,,,,,,,,,,,,,,2008-01-01,A,,,,,01.11Z,NAFRev2,N,0.830821,46.474497,0.42,street,Lieu Dit la Roche Tuile 86500 Pindray,86191_B147,G,LIEU DIT LA ROCHE TUILE,
413948555,00011,41394855500011,O,,NN,,,,true,1,,,,,LA MAISON NEUVE,86500,PINDRAY,,,86191,,,,,,,,,,,,,,,,,,,1997-07-17,F,,,,,01.1A,NAF1993,N,0.79064,46.475747,0.92,locality,Piece de la Maison Neuve 86500 Pindray,86191_B115,G,PIECE DE LA MAISON NEUVE,
413950437,00017,41395043700017,O,1987-12-31,NN,,,,true,1,,,,,CHEZ NADEAU,86500,PINDRAY,,,86191,,,,,,,,,,,,,,,,,,,1998-09-30,F,,,,,01.1A,NAF1993,N,0.832101,46.488191,0.94,street,Chez Nadeau 86500 Pindray,86191_B036,G,CHEZ NADEAU,
413951518,00013,41395151800013,O,,,,,2011-04-23T09:40:04,true,1,,,,,SOULAGE,86500,PINDRAY,,,86191,,,,,,,,,,,,,,,,,,,1987-12-31,F,,,,,01.1A,NAF1993,N,5.7385668,45.1752711,0.9,poi.park,Parc Soulage Grenoble,https://osm.org/way/105908863,G,,
418604583,00017,41860458300017,O,1997-11-01,NN,,,2016-01-12T00:20:02,true,4,,,,,LE TERRIER,86500,PINDRAY,,,86191,,,,,,,,,,,,,,,,,,,2012-03-01,A,,,,,68.20B,NAFRev2,N,0.807413,46.490508,0.35,street,Rue du Poirier Cure 86500 Pindray,86191_0125,G,RUE DU POIRIER CURE,
420053084,00018,42005308400018,O,1998-08-17,NN,,,,true,4,,,,,LA ROCHE A BEAUSSANT,86500,PINDRAY,,,86191,,,,,,,,,,,,,,,,,,,2003-06-20,F,,,,,01.1A,NAFRev1,N,0.830821,46.474497,0.42,street,Lieu Dit la Roche Tuile 86500 Pindray,86191_B147,G,LIEU DIT LA ROCHE TUILE,
420599573,00029,42059957300029,O,2014-09-22,,,,2021-02-23T11:41:43,true,1,,,,,LE POIRAT,86500,PINDRAY,,,86191,,,,,,,,,,,,,,,,,,,2014-09-22,A,,,,,68.20B,NAFRev2,N,0.810144,46.453797,0.91,street,Lieu Dit le Poirat 86500 Pindray,86191_zna7yb,G,LIEU DIT LE POIRAT,
420602203,00010,42060220300010,O,1998-10-01,00,2019,,2021-10-27T08:01:19,true,4,,,,,CHEZ NADEAU,86500,PINDRAY,,,86191,,,,,,,,,,,,,,,,,,,2019-03-13,F,,,,,01.43Z,NAFRev2,N,0.832101,46.488191,0.94,street,Chez Nadeau 86500 Pindray,86191_B036,G,CHEZ NADEAU,
427928718,00019,42792871800019,O,1978-01-01,NN,,,2013-02-09T12:55:23,true,5,,,,,L EBEAUPIN,86500,PINDRAY,,,86191,,,,,,,,,,,,,,,,,,,2012-12-25,F,,,,,01.11Z,NAFRev2,N,0.81165,46.490374,0.34,street,Rue de l’Eglise 86500 Pindray,86191_0055,G,RUE DE L EGLISE,
429240187,00014,42924018700014,O,2000-01-01,NN,,,2016-01-12T00:21:56,true,3,,,,,GRAILLE,86500,PINDRAY,,,86191,,,,,,,,,,,,,,,,,,,2008-01-01,A,,,,,01.11Z,NAFRev2,N,0.791224,46.488119,0.91,street,Lieu Dit Graille 86500 Pindray,86191_532vap,G,LIEU DIT GRAILLE,
431006626,00011,43100662600011,O,1972-10-01,NN,,,2016-09-07T14:50:15,true,3,,,,,,86500,PINDRAY,,,86191,,,,,,,,,,,,,,,,,,,2008-01-01,A,,,,,01.43Z,NAFRev2,N,,,0,,,,,,
433248267,00026,43324826700026,O,2003-08-15,NN,,,2008-11-08T01:58:12,false,4,,,,,LA ROCHE A BAUSSANT,86500,PINDRAY,,,86191,,,,,,,,,,,,,,,,,,,2006-11-11,F,,,,,45.3A,NAFRev1,N,0.830821,46.474497,0.43,street,Lieu Dit la Roche Tuile 86500 Pindray,86191_B147,G,LIEU DIT LA ROCHE TUILE,
435171418,00039,43517141800039,O,2013-01-01,,,,2017-09-26T14:49:41,true,1,,,,LD,PRUNIER,86500,PINDRAY,,,86191,,,,,,,,,,,,,,,,,,,2013-01-01,A,,,,,02.10Z,NAFRev2,N,0.849727,46.466765,0.92,street,Lieu Dit Prunier 86500 Pindray,86191_bdoxmr,G,LIEU DIT PRUNIER,
437598782,00351,43759878200351,O,2016-06-30,,,,2016-08-01T14:32:10,false,1,,,,,LA LOGE A CORMUCHON,86500,PINDRAY,,,86191,,,,,,,,,,,,,,,,,,,2016-06-30,A,,,,,35.11Z,NAFRev2,N,0.794292,46.468718,0.8,street,La Loge à Cornuchon 86500 Pindray,86191_B089,G,LA LOGE A CORNUCHON,
440696664,00018,44069666400018,O,2002-01-01,NN,,,2008-01-16T09:17:06,false,3,,,,,LA TUILERIE,86500,PINDRAY,,,86191,,,,,,,,,,,,,,,,,,,2008-01-01,F,,,,,90.03A,NAFRev2,N,0.830821,46.474497,0.54,street,Lieu Dit la Roche Tuile 86500 Pindray,86191_B147,G,LIEU DIT LA ROCHE TUILE,
441661238,00010,44166123800010,O,1998-04-01,NN,,,2008-01-04T21:24:48,true,3,,,,,LE POIRAT,86500,PINDRAY,,,86191,,,,,,,,,,,,,,,,,,,2008-01-01,A,,,,,01.11Z,NAFRev2,N,0.810144,46.453797,0.91,street,Lieu Dit le Poirat 86500 Pindray,86191_zna7yb,G,LIEU DIT LE POIRAT,
442735981,00015,44273598100015,O,2002-07-12,01,2019,,2021-10-27T08:23:17,true,3,SAINT HUBERT,,,,,86500,PINDRAY,,,86191,,,,,,,,,,,,,,,,,,,2008-01-01,A,,,,,01.11Z,NAFRev2,O,0.803457,46.482313,0.93,locality,Saint Hubert 86500 Pindray,86191_B151,D,SAINT HUBERT,
449308626,00018,44930862600018,O,2003-06-25,NN,,,2021-04-03T03:36:40,true,4,,,,,LES PRUNIERS,86500,PINDRAY,,,86191,,,,,,,,,,,,,,,,,,,2021-04-02,F,,,,,68.20A,NAFRev2,N,0.849727,46.466765,0.51,street,Lieu Dit Prunier 86500 Pindray,86191_bdoxmr,G,LIEU DIT PRUNIER,
450931613,00019,45093161300019,O,2003-11-16,NN,,,2016-04-26T01:58:26,false,4,,,,,LE FAISANT VALOIR,86500,PINDRAY,,,86191,,,,,,,,,,,,,,,,,,,2015-07-01,F,,,,,75.00Z,NAFRev2,O,,,0,,,,,,
452381833,00014,45238183300014,O,2004-03-01,NN,,,2014-07-08T02:47:36,false,4,LE PLASTEAU,,,,,86500,PINDRAY,,,86191,,,,,,,,,,,,,,,,,,,2010-05-01,F,,,,,43.99C,NAFRev2,O,0.826057,46.446625,0.77,street,Les Brandes du Plasteau 86500 Pindray,86191_B023,D,LES BRANDES DU PLASTEAU,
489159111,00025,48915911100025,O,2017-11-01,,,,2021-02-23T13:54:10,true,2,,8,,,CHEZ NADEAU,86500,PINDRAY,,,86191,,,,,,,,,,,,,,,,,,,2019-07-12,A,,,,EDITIONS LES TRESORS D'HILDEGARDE,90.03A,NAFRev2,N,0.832463,46.488942,0.94,housenumber,8 Chez Nadeau 86500 Pindray,86191_b036_00008,G,8 CHEZ NADEAU,
489286922,00013,48928692200013,O,2006-01-01,,,,2008-01-05T03:00:38,true,2,,,,LD,BEAUREGARD,86500,PINDRAY,,,86191,,,,,,,,,,,,,,,,,,,2008-01-01,A,,,,,01.11Z,NAFRev2,N,2.44911,48.7282215,0.9,poi.park,Parc Beauregard Villeneuve-Saint-Georges,https://osm.org/way/256864200,G,,
490391034,00017,49039103400017,O,2006-06-04,,,1013BZ,2021-02-23T13:56:06,true,2,,,,,LE BOURG,86500,PINDRAY,,,86191,,,,,,,,,,,,,,,,,,,2008-01-01,A,,,,,56.10C,NAFRev2,N,0.805493,46.488318,0.31,locality,Le Moulin de Pindray 86500 Pindray,86191_B097,G,LE MOULIN DE PINDRAY,
497635938,00010,49763593800010,O,2007-04-25,,,,2013-05-21T19:24:37,false,3,LE MOULIN DE PINDRAY,,,,,86500,PINDRAY,,,86191,,,,,,,,,,,,,,,,,,,2013-05-15,F,AU BAZAR,,,,47.89Z,NAFRev2,N,0.805493,46.488318,0.93,locality,Le Moulin de Pindray 86500 Pindray,86191_B097,D,LE MOULIN DE PINDRAY,
510938731,00013,51093873100013,O,2009-03-01,,,1082ZZ,2018-04-07T03:47:49,false,2,,,,,LA GROGE,86500,PINDRAY,,,86191,,,,,,,,,,,,,,,,,,,2018-03-01,F,,,,,10.82Z,NAFRev2,N,0.794292,46.468718,0.5,street,La Loge à Cornuchon 86500 Pindray,86191_B089,G,LA LOGE A CORNUCHON,
514242767,00010,51424276700010,O,2009-09-01,,,,2013-03-28T19:29:42,true,1,LE TERRIER,,,,,86500,PINDRAY,,,86191,,,,,,,,,,,,,,,,,,,2009-09-01,A,,,,,35.11Z,NAFRev2,N,0.807413,46.490508,0.35,street,Rue du Poirier Cure 86500 Pindray,86191_0125,D,RUE DU POIRIER CURE,
518509559,00010,51850955900010,O,2009-12-15,,,,2016-01-12T00:28:49,true,1,LE MOULIN DE PINDRAY,,,,,86500,PINDRAY,,,86191,,,,,,,,,,,,,,,,,,,2009-12-15,A,ECLIPSE SERVICE 86,,,,01.61Z,NAFRev2,N,0.805493,46.488318,0.93,locality,Le Moulin de Pindray 86500 Pindray,86191_B097,D,LE MOULIN DE PINDRAY,
521451286,00020,52145128600020,O,2010-05-25,,,,2011-08-12T13:59:49,false,2,LIEUDIT CHEZ NADEAU,,,,,86500,PINDRAY,,,86191,,,,,,,,,,,,,,,,,,,2011-07-22,F,,,,,35.11Z,NAFRev2,N,0.832101,46.488191,0.62,street,Chez Nadeau 86500 Pindray,86191_B036,D,CHEZ NADEAU,
527809321,00187,52780932100187,O,2010-11-10,,,,2014-01-21T19:26:19,false,2,,,,,CHEZ NADEAU,86500,PINDRAY,,,86191,,,,,,,,,,,,,,,,,,,2013-12-31,F,,,,,35.11Z,NAFRev2,N,0.832101,46.488191,0.94,street,Chez Nadeau 86500 Pindray,86191_B036,G,CHEZ NADEAU,
750884181,00017,75088418100017,O,2012-03-01,,,,2012-04-13T11:34:58,true,1,,,,LD,LE TERRIER,86500,PINDRAY,,,86191,,,,,,,,,,,,,,,,,,,2012-03-01,A,,,,,01.50Z,NAFRev2,N,0.807413,46.490508,0.35,street,Rue du Poirier Cure 86500 Pindray,86191_0125,G,RUE DU POIRIER CURE,
751222035,00253,75122203500253,O,2020-01-09,,,,2020-01-13T10:09:20,false,1,,,,LD,POIRAT,86500,PINDRAY,,,86191,,,,,,,,,,,,,,,,,,,2020-01-09,A,,,,,35.11Z,NAFRev2,N,0.815061,46.461568,0.91,locality,Logis du Poirat 86500 Pindray,86191_B091,G,LOGIS DU POIRAT,
781549225,00014,78154922500014,O,,NN,,,,true,1,,,,,,86500,PINDRAY,,,86191,,,,,,,,,,,,,,,,,,,,F,,,,,64.42,NAP,N,,,0,,,,,,
791458516,00162,79145851600162,O,2018-10-02,,,,2018-11-26T19:33:05,false,1,SAINT-HUBERT,,,LD,SAINT HUBERT,86500,PINDRAY,,,86191,,,,,,,,,,,,,,,,,,,2018-10-02,A,,,,,35.11Z,NAFRev2,N,0.803457,46.482313,0.93,locality,Saint Hubert 86500 Pindray,86191_B151,G,SAINT HUBERT,
791458516,00220,79145851600220,O,2018-10-02,,,,2018-11-28T13:44:42,false,1,LE BEAULIEU,,,LD,SAINT HUBERT,86500,PINDRAY,,,86191,,,,,,,,,,,,,,,,,,,2018-10-02,A,,,,,35.11Z,NAFRev2,N,0.803457,46.482313,0.93,locality,Saint Hubert 86500 Pindray,86191_B151,G,SAINT HUBERT,
792483869,00014,79248386900014,O,1996-02-20,,,,2013-04-16T10:37:13,true,1,MAIRIE,2,,RUE,DU LAVOIR,86500,PINDRAY,,,86191,,,,,,,,,,,,,,,,,,,1996-02-20,A,,,,,94.99Z,NAFRev2,N,0.810203,46.490645,0.94,housenumber,2 Rue du Lavoir 86500 Pindray,86191_0090_00002,G,2 RUE DU LAVOIR,
792719742,00019,79271974200019,O,1995-07-24,,,,2013-04-26T10:09:55,true,1,MAIRIE,,,,LE BOURG,86500,PINDRAY,,,86191,,,,,,,,,,,,,,,,,,,1995-07-24,A,,,,,90.01Z,NAFRev2,N,0.805493,46.488318,0.31,locality,Le Moulin de Pindray 86500 Pindray,86191_B097,G,LE MOULIN DE PINDRAY,
793637760,00018,79363776000018,O,2013-06-17,,,,2020-11-24T08:54:25,true,2,,11,,RUE,DE LA DIONETTE,86500,PINDRAY,,,86191,,,,,,,,,,,,,,,,,,,2020-11-20,F,,,,,93.29Z,NAFRev2,N,0.826199,46.489194,0.94,housenumber,11 Rue de la Dionette 86500 Pindray,86191_0045_00011,G,11 RUE DE LA DIONETTE,
794983742,00014,79498374200014,O,2013-07-10,,,,2014-03-11T00:10:55,true,1,,,,LD,LE GRAND POIRAT,86500,PINDRAY,,,86191,,,,,,,,,,,,,,,,,,,2013-07-10,A,,,,,01.11Z,NAFRev2,N,0.811287,46.462966,0.93,locality,Le Grand Poirat 86500 Pindray,86191_B072,G,LE GRAND POIRAT,
797401635,00231,79740163500231,O,2015-06-16,,,,2015-06-25T19:28:09,false,1,BATIMENT B,,,,LES LOGES,86500,PINDRAY,,,86191,,,,,,,,,,,,,,,,,,,2015-06-16,A,,,,,35.11Z,NAFRev2,N,0.826333,46.469882,0.91,street,Lieu Dit les Loges 86500 Pindray,86191_3pbaxg,G,LIEU DIT LES LOGES,
797401635,00264,79740163500264,O,2015-06-16,,,,2015-06-26T13:46:53,false,1,BATIMENT A,,,,LES LOGES,86500,PINDRAY,,,86191,,,,,,,,,,,,,,,,,,,2015-06-16,A,,,,,35.11Z,NAFRev2,N,0.826333,46.469882,0.91,street,Lieu Dit les Loges 86500 Pindray,86191_3pbaxg,G,LIEU DIT LES LOGES,
798666442,00016,79866644200016,O,2013-11-08,,,,2013-11-24T03:17:04,true,1,,17,,CHE,DES NAGASSES,86500,PINDRAY,,,86191,,,,,,,,,,,,,,,,,,,2013-11-08,A,,,,,68.32A,NAFRev2,N,0.836,46.477675,0.84,housenumber,17 Chemin des Nagasses 86500 Pindray,86191_0110_00017,G,17 CHEMIN DES NAGASSES,
804441012,00015,80444101200015,O,2003-02-19,,,,2014-09-09T11:07:23,true,1,MAIRIE,,,,,86500,PINDRAY,,,86191,,,,,,,,,,,,,,,,,,,2003-02-19,A,,,,,94.99Z,NAFRev2,N,0.807413,46.490508,0.38,street,Rue du Poirier Cure 86500 Pindray,86191_0125,D,RUE DU POIRIER CURE,
804667160,00019,80466716000019,O,1993-01-14,,,,2014-09-19T11:12:52,true,1,CHATEAU DE PRUNIERS,,,,,86500,PINDRAY,,,86191,,,,,,,,,,,,,,,,,,,1993-01-14,A,,,,,93.29Z,NAFRev2,N,0.855019,46.465666,0.85,street,Chateau de Prunier 86500 Pindray,86191_B030,D,CHATEAU DE PRUNIER,
811881754,00014,81188175400014,O,2015-06-10,01,2019,,2021-10-27T09:18:13,true,1,,,,,CHATEAU DE PRUNIERS,86500,PINDRAY,,,86191,,,,,,,,,,,,,,,,,,,2015-06-10,A,LA CHAMBRE,,,LA CHAMBRE AUX FRESQUES,59.11A,NAFRev2,O,0.855019,46.465666,0.85,street,Chateau de Prunier 86500 Pindray,86191_B030,G,CHATEAU DE PRUNIER,