siren,nic,siret,statutDiffusionEtablissement,dateCreationEtablissement,trancheEffectifsEtablissement,anneeEffectifsEtablissement,activitePrincipaleRegistreMetiersEtablissement,dateDernierTraitementEtablissement,etablissementSiege,nombrePeriodesEtablissement,complementAdresseEtablissement,numeroVoieEtablissement,indiceRepetitionEtablissement,typeVoieEtablissement,libelleVoieEtablissement,codePostalEtablissement,libelleCommuneEtablissement,libelleCommuneEtrangerEtablissement,distributionSpecialeEtablissement,codeCommuneEtablissement,codeCedexEtablissement,libelleCedexEtablissement,codePaysEtrangerEtablissement,libellePaysEtrangerEtablissement,complementAdresse2Etablissement,numeroVoie2Etablissement,indiceRepetition2Etablissement,typeVoie2Etablissement,libelleVoie2Etablissement,codePostal2Etablissement,libelleCommune2Etablissement,libelleCommuneEtranger2Etablissement,distributionSpeciale2Etablissement,codeCommune2Etablissement,codeCedex2Etablissement,libelleCedex2Etablissement,codePaysEtranger2Etablissement,libellePaysEtranger2Etablissement,dateDebut,etatAdministratifEtablissement,enseigne1Etablissement,enseigne2Etablissement,enseigne3Etablissement,denominationUsuelleEtablissement,activitePrincipaleEtablissement,nomenclatureActivitePrincipaleEtablissement,caractereEmployeurEtablissement,longitude,latitude,geo_score,geo_type,geo_adresse,geo_id,geo_ligne,geo_l4,geo_l5
215403155,00017,21540315500017,O,1983-03-01,02,2019,,2021-10-27T08:08:53,true,4,,,,RUE,DES ECOLES,54760,LEYR,,,54315,,,,,,,,,,,,,,,,,,,2008-01-01,A,MAIRIE,,,,84.11Z,NAFRev2,O,6.264141,48.803063,0.92,street,Rue des Ecoles Vincent Van Gogh 54760 Leyr,54315_0060,G,RUE DES ECOLES VINCENT VAN GOGH,
215403155,00025,21540315500025,O,1983-12-21,03,2019,,2021-10-27T08:08:53,false,3,,,,RUE,DES ECOLES,54760,LEYR,,,54315,,,,,,,,,,,,,,,,,,,2008-01-01,A,ECOLE PRIMAIRE PUBLIQUE VINCENT VAN GOGH,,,,85.20Z,NAFRev2,N,6.264141,48.803063,0.92,street,Rue des Ecoles Vincent Van Gogh 54760 Leyr,54315_0060,G,RUE DES ECOLES VINCENT VAN GOGH,
215403155,00033,21540315500033,O,1996-03-01,NN,,,2013-10-05T12:41:55,false,4,,,,RUE,DES ECOLES,54760,LEYR,,,54315,,,,,,,,,,,,,,,,,,,2012-12-25,F,SCE D'ASSAINISSEMENT,,,,37.00Z,NAFRev2,N,6.264141,48.803063,0.92,street,Rue des Ecoles Vincent Van Gogh 54760 Leyr,54315_0060,G,RUE DES ECOLES VINCENT VAN GOGH,
245400494,00010,24540049400010,O,1991-04-23,NN,,,,true,1,,,,RUE,DES ECOLES,54760,LEYR,,,54315,,,,,,,,,,,,,,,,,,,1999-06-28,F,,,,,75.1A,NAF1993,O,6.264141,48.803063,0.92,street,Rue des Ecoles Vincent Van Gogh 54760 Leyr,54315_0060,G,RUE DES ECOLES VINCENT VAN GOGH,
255400269,00015,25540026900015,O,1983-03-01,NN,,,2006-10-26T23:44:03,true,3,,,,RUE,DES ECOLES,54760,LEYR,,,54315,,,,,,,,,,,,,,,,,,,2005-12-25,F,,,,,75.1E,NAFRev1,N,6.264141,48.803063,0.92,street,Rue des Ecoles Vincent Van Gogh 54760 Leyr,54315_0060,G,RUE DES ECOLES VINCENT VAN GOGH,
265403774,00010,26540377400010,O,1992-01-01,NN,,,2008-01-04T19:00:40,true,3,MAIRIE,,,RUE,DES ECOLES,54760,LEYR,,,54315,,,,,,,,,,,,,,,,,,,2008-01-01,A,CCAS,,,,88.99B,NAFRev2,N,6.264141,48.803063,0.92,street,Rue des Ecoles Vincent Van Gogh 54760 Leyr,54315_0060,G,RUE DES ECOLES VINCENT VAN GOGH,
295404487,00015,29540448700015,O,2000-07-18,NN,,,2018-09-29T12:08:58,true,5,MAIRIE,,,RUE,DES ECOLES,54760,LEYR,,,54315,,,,,,,,,,,,,,,,,,,2008-09-01,A,,,,,42.99Z,NAFRev2,O,6.264141,48.803063,0.92,street,Rue des Ecoles Vincent Van Gogh 54760 Leyr,54315_0060,G,RUE DES ECOLES VINCENT VAN GOGH,
301383634,00039,30138363400039,O,2007-12-20,NN,,,2014-06-13T23:53:14,true,2,,2,,RUE,DES ECOLES,54760,LEYR,,,54315,,,,,,,,,,,,,,,,,,,2014-03-30,F,,,,,46.18Z,NAFRev2,O,6.265214,48.80287,0.92,housenumber,2 Rue des Ecoles Vincent Van Gogh 54760 Leyr,54315_0060_00002,G,2 RUE DES ECOLES V VAN GOGH,
301649315,00019,30164931500019,O,1963-01-01,NN,,,2008-11-07T00:17:43,true,4,,15,,RUE,ECOLES VINCENT VAN GOGH,54760,LEYR,,,54315,,,,,,,,,,,,,,,,,,,2006-06-30,F,,,,,15.8C,NAFRev1,O,6.263068,48.802974,0.92,housenumber,15 Rue des Ecoles Vincent Van Gogh 54760 Leyr,54315_0060_00015,G,15 RUE DES ECOLES V VAN GOGH,
301649315,00027,30164931500027,O,1989-08-01,NN,,,,false,4,,9,,,GRANDE RUE,54760,LEYR,,,54315,,,,,,,,,,,,,,,,,,,1999-01-28,F,BOULANGERIE NOUVELLE,,,,15.8C,NAF1993,N,6.266084,48.803218,0.95,housenumber,9 Grande Rue 54760 Leyr,54315_0340_00009,G,9 GRANDE RUE,
301851614,00018,30185161400018,O,,NN,,,,true,1,,11,,,GRANDE RUE,54760,LEYR,,,54315,,,,,,,,,,,,,,,,,,,1990-12-25,F,,,,,45.2V,NAF1993,N,6.266188,48.803296,0.95,housenumber,11 Grande Rue 54760 Leyr,54315_0340_00011,G,11 GRANDE RUE,
301877668,00014,30187766800014,O,,,,,,true,1,,11,,,GRANDE RUE,54760,LEYR,,,54315,,,,,,,,,,,,,,,,,,,1984-12-25,F,,,,,00.10,NAP,N,6.266188,48.803296,0.95,housenumber,11 Grande Rue 54760 Leyr,54315_0340_00011,G,11 GRANDE RUE,
301877676,00017,30187767600017,O,,NN,,,,true,1,,11,,,GRANDE RUE,54760,LEYR,,,54315,,,,,,,,,,,,,,,,,,,1999-03-31,F,,,,,55.3A,NAF1993,N,6.266188,48.803296,0.95,housenumber,11 Grande Rue 54760 Leyr,54315_0340_00011,G,11 GRANDE RUE,
303317622,00023,30331762200023,O,1900-01-01,NN,,,2017-05-04T01:52:07,true,5,,4,,RUE,DU HAUT CHATEAU,54760,LEYR,,,54315,,,,,,,,,,,,,,,,,,,2015-09-30,F,,,,,86.21Z,NAFRev2,O,6.26491,48.802283,0.95,housenumber,4 Rue du Haut Château 54760 Leyr,54315_0160_00004,G,4 RUE DU HAUT CHATEAU,
306625716,00015,30662571600015,O,1963-01-01,,,,2008-11-07T00:22:22,true,5,,34,,RUE,DE LA PROMENADE,54760,LEYR,,,54315,,,,,,,,,,,,,,,,,,,2005-06-30,F,,,,,52.6D,NAFRev1,N,6.275158,48.804554,0.95,housenumber,34 Rue de la Promenade 54760 Leyr,54315_0325_00034,G,34 RUE DE LA PROMENADE,
309681328,00030,30968132800030,O,,NN,,,,true,1,,16,,,GRANDE RUE,54760,LEYR,,,54315,,,,,,,,,,,,,,,,,,,1987-03-30,F,,,,,64.43,NAP,N,6.266361,48.803058,0.95,housenumber,16 Grande Rue 54760 Leyr,54315_0340_00016,G,16 GRANDE RUE,
309705812,00027,30970581200027,O,,NN,,,,true,1,,2,,RUE,DE LA PROMENADE,54760,LEYR,,,54315,,,,,,,,,,,,,,,,,,,1994-01-01,F,,,,,71.3C,NAF1993,O,6.27143,48.804434,0.95,housenumber,2 Rue de la Promenade 54760 Leyr,54315_0325_00002,G,2 RUE DE LA PROMENADE,
309950244,00033,30995024400033,O,1987-03-30,NN,,,2011-12-08T19:43:42,true,4,,6,,RUE,DE L EGLISE,54760,LEYR,,,54315,,,,,,,,,,,,,,,,,,,2011-01-01,F,,,,,47.71Z,NAFRev2,N,6.264802,48.80268,0.95,housenumber,6 Rue de l’Eglise 54760 Leyr,54315_0100_00006,G,6 RUE DE L EGLISE,
310056874,00012,31005687400012,O,1900-01-01,NN,,,2008-01-04T19:58:41,true,3,,,,,MAIRIE,54760,LEYR,,,54315,,,,,,,,,,,,,,,,,,,2008-01-01,A,,,,,94.99Z,NAFRev2,N,3.0709671,50.6304695,0.92,poi.townhall,Hôtel de Ville Lille,https://osm.org/way/40917078,G,,
312987688,00016,31298768800016,O,,NN,,,,true,1,,8,,RUE,DU HAUT CHATEAU,54760,LEYR,,,54315,,,,,,,,,,,,,,,,,,,,F,,,,,87.06,NAP,N,6.264651,48.802082,0.95,housenumber,8 Rue du Haut Château 54760 Leyr,54315_0160_00008,G,8 RUE DU HAUT CHATEAU,
313245474,00058,31324547400058,O,1986-01-01,NN,,,2014-07-08T00:17:19,false,6,,26,,,GRANDE RUE,54760,LEYR,,,54315,,,,,,,,,,,,,,,,,,,2011-05-31,F,,,,,43.33Z,NAFRev2,N,6.266887,48.803592,0.95,housenumber,26 Grande Rue 54760 Leyr,54315_0340_00026,G,26 GRANDE RUE,
313348393,00023,31334839300023,O,1981-10-01,NN,,,,true,1,,5,,CHE,DE LA RUELLE DE CROTELLE,54760,LEYR,,,54315,,,,,,,,,,,,,,,,,,,2002-06-20,F,,,,,45.4C,NAF1993,O,6.272116,48.803802,0.64,housenumber,5 Chemin de Crotelle 54760 Leyr,54315_0058_00005,G,5 CHEMIN DE CROTELLE,
316133545,00020,31613354500020,O,,NN,,,,true,1,,15,,RUE,DES LILAS,54760,LEYR,,,54315,,,,,,,,,,,,,,,,,,,1990-04-03,F,,,,,55.71,NAP,N,6.268934,48.805327,0.95,housenumber,15 Rue des Lilas 54760 Leyr,54315_0190_00015,G,15 RUE DES LILAS,
317396943,00027,31739694300027,O,2002-04-03,NN,,,2008-11-07T00:32:59,false,3,,28,,RUE,DES LILAS,54760,LEYR,,,54315,,,,,,,,,,,,,,,,,,,2005-06-14,F,,,,,45.4M,NAFRev1,O,6.268959,48.805066,0.95,housenumber,28 Rue des Lilas 54760 Leyr,54315_0190_00028,G,28 RUE DES LILAS,
317820652,00012,31782065200012,O,,NN,,,,true,1,,5,,RUE,DE LA GARE,54760,LEYR,,,54315,,,,,,,,,,,,,,,,,,,1987-12-25,F,,,,,64.43,NAP,N,6.262341,48.804196,0.95,housenumber,5 Rue de la Gare 54760 Leyr,54315_0140_00005,G,5 RUE DE LA GARE,
319651576,00013,31965157600013,O,,,,,,true,1,,21,,,GRANDE RUE,54760,LEYR,,,54315,,,,,,,,,,,,,,,,,,,1985-12-25,F,,,,,02.20,NAP,N,6.266736,48.803863,0.95,housenumber,21 Grande Rue 54760 Leyr,54315_0340_00021,G,21 GRANDE RUE,
319659538,00015,31965953800015,O,,,,,,true,1,,21,,,GRANDE RUE,54760,LEYR,,,54315,,,,,,,,,,,,,,,,,,,1985-12-25,F,,,,,02.20,NAP,N,6.266736,48.803863,0.95,housenumber,21 Grande Rue 54760 Leyr,54315_0340_00021,G,21 GRANDE RUE,
320372576,00019,32037257600019,O,,,,,,true,1,,9,,,GRANDE RUE,54760,LEYR,,,54315,,,,,,,,,,,,,,,,,,,1989-07-31,F,,,,,38.40,NAP,N,6.266084,48.803218,0.95,housenumber,9 Grande Rue 54760 Leyr,54315_0340_00009,G,9 GRANDE RUE,
323988931,00016,32398893100016,O,1982-02-15,,,,2014-07-08T00:28:34,false,5,,,,LOT,DU MOLNEY,54760,LEYR,,,54315,,,,,,,,,,,,,,,,,,,2011-10-01,F,,,,,43.21A,NAFRev2,O,6.261593,48.802953,0.48,street,Rue de Molney 54760 Leyr,54315_0220,G,RUE DE MOLNEY,
324191386,00022,32419138600022,O,2005-08-11,,,,2009-01-07T09:39:15,true,3,,3,,RUE,DES LILAS,54760,LEYR,,,54315,,,,,,,,,,,,,,,,,,,2008-02-05,F,,,,,70.10Z,NAFRev2,N,6.268917,48.806834,0.95,housenumber,3 Rue des Lilas 54760 Leyr,54315_0190_00003,G,3 RUE DES LILAS,
324604271,00027,32460427100027,O,,NN,,,,true,1,,42,,,GRANDE RUE,54760,LEYR,,,54315,,,,,,,,,,,,,,,,,,,1989-03-31,F,,,,,64.49,NAP,N,6.267665,48.804451,0.95,housenumber,42 Grande Rue 54760 Leyr,54315_0340_00042,G,42 GRANDE RUE,
325388502,00016,32538850200016,O,1982-09-13,NN,,,2008-11-07T00:42:36,false,4,,6,,IMP,,54760,LEYR,,,54315,,,,,,,,,,,,,,,,,,,1999-03-01,F,,,,,45.4C,NAF1993,N,6.268,48.806624,0.75,housenumber,6 Impasse des Coquelicots 54760 Leyr,54315_0050_00006,G,6 IMPASSE DES COQUELICOTS,
326950128,00016,32695012800016,O,1983-04-05,NN,,,2020-04-07T03:48:35,false,4,,42,,,GRANDE RUE,54760,LEYR,,,54315,,,,,,,,,,,,,,,,,,,2019-12-31,F,,,,,68.20B,NAFRev2,N,6.267665,48.804451,0.95,housenumber,42 Grande Rue 54760 Leyr,54315_0340_00042,G,42 GRANDE RUE,
328454244,00018,32845424400018,O,,,,,,true,1,,4,,RTE,DE MONTENOY,54760,LEYR,,,54315,,,,,,,,,,,,,,,,,,,1991-03-14,F,,,,,84.10,NAP,N,6.263562,48.801089,0.85,housenumber,4 Route de Montenoy 54760 Leyr,54315_0240_00004,G,4 ROUTE DE MONTENOY,
329300164,00020,32930016400020,O,,,,,,true,1,,58,,RUE,DE LA GARE,54760,LEYR,,,54315,,,,,,,,,,,,,,,,,,,1996-03-31,F,,,,,45.2V,NAF1993,N,6.261218,48.807043,0.95,housenumber,58 Rue de la Gare 54760 Leyr,54315_0140_00058,G,58 RUE DE LA GARE,
329330039,00028,32933003900028,O,1994-01-07,,,,,false,4,,20,,RUE,DES ECOLES,54760,LEYR,,,54315,,,,,,,,,,,,,,,,,,,2003-02-07,F,,,,,85.1G,NAFRev1,N,6.263681,48.803059,0.93,housenumber,20 Rue des Ecoles Vincent Van Gogh 54760 Leyr,54315_0060_00020,G,20 RUE DES ECOLES V VAN GOGH,
329330039,00044,32933003900044,O,2003-02-07,NN,,,2018-09-29T12:24:56,false,4,,,,RUE,ALMAND,54760,LEYR,,,54315,,,,,,,,,,,,,,,,,,,2018-02-28,A,,,,,86.90E,NAFRev2,N,6.26537,48.804081,0.85,street,Ruelle Almand 54760 Leyr,54315_0021,G,RUELLE ALMAND,
334407582,00017,33440758200017,O,,NN,,,,true,1,,1,,RUE,DES ECOLES,54760,LEYR,,,54315,,,,,,,,,,,,,,,,,,,1989-09-19,F,,,,,67.01,NAP,N,6.26463,48.802991,0.92,housenumber,1 Rue des Ecoles Vincent Van Gogh 54760 Leyr,54315_0060_00001,G,1 RUE DES ECOLES V VAN GOGH,
334631256,00016,33463125600016,O,1985-10-03,NN,,,2012-05-05T02:25:40,true,5,SALLE POLYVALENTE,,,RUE,DE LA PROMENADE,54760,LEYR,,,54315,,,,,,,,,,,,,,,,,,,2011-03-31,A,,,,,94.99Z,NAFRev2,N,6.2731,48.804393,0.95,street,Rue de la Promenade 54760 Leyr,54315_0325,G,RUE DE LA PROMENADE,
334631256,00024,33463125600024,O,2008-07-01,,,,2008-09-08T16:03:23,false,1,CHEZ MR SAGORIN STEPHANE,7,,RUE,DU MOLNEY,54760,LEYR,,,54315,,,,,,,,,,,,,,,,,,,2008-07-01,F,,,,,94.99Z,NAFRev2,O,6.261844,48.802946,0.78,housenumber,7 Rue de Molney 54760 Leyr,54315_0220_00007,G,7 RUE DE MOLNEY,
338113178,00010,33811317800010,O,1986-05-02,NN,,,2006-12-15T00:28:32,false,3,,,,RUE,DE LA PROMENADE,54760,LEYR,,,54315,,,,,,,,,,,,,,,,,,,1993-12-31,F,,,,,50.2Z,NAF1993,N,6.2731,48.804393,0.95,street,Rue de la Promenade 54760 Leyr,54315_0325,G,RUE DE LA PROMENADE,
339959355,00027,33995935500027,O,1988-06-29,,,,,false,4,,17,,RUE,DE LA GARE,54760,LEYR,,,54315,,,,,,,,,,,,,,,,,,,1993-12-25,F,,,,,45.2V,NAF1993,N,6.261709,48.80539,0.95,housenumber,17 Rue de la Gare 54760 Leyr,54315_0140_00017,G,17 RUE DE LA GARE,
340044262,00012,34004426200012,O,1985-08-01,NN,,,2012-11-07T03:41:35,true,5,,1,,RUE,DES ECOLES,54760,LEYR,,,54315,,,,,,,,,,,,,,,,,,,2011-12-31,F,,,,,47.99A,NAFRev2,N,6.26463,48.802991,0.92,housenumber,1 Rue des Ecoles Vincent Van Gogh 54760 Leyr,54315_0060_00001,G,1 RUE DES ECOLES V VAN GOGH,
340829399,00021,34082939900021,O,,NN,,,,true,1,,17,,RUE,DE NANCY,54760,LEYR,,,54315,,,,,,,,,,,,,,,,,,,1992-12-31,F,,,,,45.2V,NAF1993,N,6.26441,48.799833,0.95,housenumber,17 Rue de Nancy 54760 Leyr,54315_0280_00017,G,17 RUE DE NANCY,
342150612,00014,34215061200014,O,1987-07-15,NN,,,,false,4,,20,,RUE,DES ECOLES,54760,LEYR,,,54315,,,,,,,,,,,,,,,,,,,2003-02-10,F,,,,,85.1E,NAFRev1,O,6.263681,48.803059,0.93,housenumber,20 Rue des Ecoles Vincent Van Gogh 54760 Leyr,54315_0060_00020,G,20 RUE DES ECOLES V VAN GOGH,
342150612,00022,34215061200022,O,2003-02-10,01,2019,,2021-10-27T08:34:57,true,4,,,,RUE,DU PATURAL,54760,LEYR,,,54315,,,,,,,,,,,,,,,,,,,2008-01-01,A,,,,,86.23Z,NAFRev2,O,6.262105,48.805718,0.94,street,Rue du Patural 54760 Leyr,54315_0295,G,RUE DU PATURAL,
343156584,00017,34315658400017,O,1986-05-01,NN,,,2016-04-26T03:44:49,true,5,,,,,,54760,LEYR,,,54315,,,,,,,,,,,,,,,,,,,2014-03-03,F,,,,,01.50Z,NAFRev2,O,,,0,,,,,,
343668190,00014,34366819000014,O,1986-01-01,NN,,,2007-01-18T09:24:57,true,3,,,,,,54760,LEYR,,,54315,,,,,,,,,,,,,,,,,,,1993-12-25,F,,,,,01.2A,NAF1993,N,,,0,,,,,,
344073986,00020,34407398600020,O,2015-04-01,,,,2021-02-23T10:59:10,true,1,,6,,RUE,DE NANCY,54760,LEYR,,,54315,,,,,,,,,,,,,,,,,,,2015-04-01,A,,,,,70.22Z,NAFRev2,N,6.264421,48.80048,0.95,housenumber,6 Rue de Nancy 54760 Leyr,54315_0280_00006,G,6 RUE DE NANCY,
344408554,00014,34440855400014,O,,NN,,,,true,1,,,,RUE,DE LA PROMENADE,54760,LEYR,,,54315,,,,,,,,,,,,,,,,,,,1993-12-31,F,,,,,50.2Z,NAF1993,O,6.2731,48.804393,0.95,street,Rue de la Promenade 54760 Leyr,54315_0325,G,RUE DE LA PROMENADE,
344816558,00011,34481655800011,O,,NN,,,,true,1,,2,,RUE,DU MOLNEY,54760,LEYR,,,54315,,,,,,,,,,,,,,,,,,,1993-12-31,F,,,,,51.1N,NAF1993,N,6.262823,48.803139,0.78,housenumber,2 Rue de Molney 54760 Leyr,54315_0220_00002,G,2 RUE DE MOLNEY,
347908717,00049,34790871700049,O,1995-02-01,NN,,,2012-10-16T11:02:44,false,4,,19,,RUE,DU HAUT CHATEAU,54760,LEYR,,,54315,,,,,,,,,,,,,,,,,,,1998-08-10,F,,,,,85.1G,NAF1993,N,6.264207,48.801281,0.95,housenumber,19 Rue du Haut Château 54760 Leyr,54315_0160_00019,G,19 RUE DU HAUT CHATEAU,
347908717,00080,34790871700080,O,2021-11-01,,,,2021-11-06T14:45:10,true,1,,17,,RUE,DU HAUT CHATEAU,54760,LEYR,,,54315,,,,,,,,,,,,,,,,,,,2021-11-01,A,,,,,86.90D,NAFRev2,N,6.264276,48.801644,0.95,housenumber,17 Rue du Haut Château 54760 Leyr,54315_0160_00017,G,17 RUE DU HAUT CHATEAU,
349238808,00019,34923880800019,O,,NN,,,,true,1,,16,,RUE,DES LILAS,54760,LEYR,,,54315,,,,,,,,,,,,,,,,,,,1992-03-31,F,,,,,74.2B,NAF1993,N,6.269291,48.806334,0.95,housenumber,16 Rue des Lilas 54760 Leyr,54315_0190_00016,G,16 RUE DES LILAS,
349787515,00023,34978751500023,O,1989-10-12,,,,,false,4,,44,,,GRANDE RUE,54760,LEYR,,,54315,,,,,,,,,,,,,,,,,,,1993-12-25,F,,,,,52.6E,NAF1993,N,6.267642,48.804435,0.95,housenumber,44 Grande Rue 54760 Leyr,54315_0340_00044,G,44 GRANDE RUE,
351953690,00010,35195369000010,O,1989-08-01,NN,,,2008-01-04T23:36:49,true,3,,5,,RUE,DE LA GARE,54760,LEYR,,,54315,,,,,,,,,,,,,,,,,,,2008-01-01,A,,,,,01.50Z,NAFRev2,N,6.262341,48.804196,0.95,housenumber,5 Rue de la Gare 54760 Leyr,54315_0140_00005,G,5 RUE DE LA GARE,
356000000,15573,35600000015573,O,2012-01-01,,,,2014-01-19T05:57:41,false,2,,8,,RUE,DES ECOLES VINCENT VAN GOGH,54760,LEYR,,,54315,,,,,,,,,,,,,,,,,,,2014-01-10,A,LA POSTE,,,,53.10Z,NAFRev2,N,6.264696,48.803139,0.95,housenumber,8 Rue des Ecoles Vincent Van Gogh 54760 Leyr,54315_0060_00008,G,8 RUE DES ECOLES V VAN GOGH,
356000414,01262,35600041401262,O,1991-01-01,NN,,,2009-10-17T12:40:32,false,4,,,,RUE,DES ECOLES,54760,LEYR,,,54315,,,,,,,,,,,,,,,,,,,2009-03-18,F,BUREAU DE POSTE,,,,53.10Z,NAFRev2,O,6.264141,48.803063,0.92,street,Rue des Ecoles Vincent Van Gogh 54760 Leyr,54315_0060,G,RUE DES ECOLES VINCENT VAN GOGH,
356000414,11436,35600041411436,O,2005-10-25,NN,,,2013-03-05T10:41:48,false,4,,6,,RUE,DES ECOLES,54760,LEYR,,,54315,,,,,,,,,,,,,,,,,,,2011-12-31,F,CENTRE COURRIER,,,,53.10Z,NAFRev2,O,6.264981,48.80321,0.92,housenumber,6 Rue des Ecoles Vincent Van Gogh 54760 Leyr,54315_0060_00006,G,6 RUE DES ECOLES V VAN GOGH,
378104962,00014,37810496200014,O,1990-04-18,NN,,,2008-11-08T00:33:33,true,3,,58,,RUE,DE LA GARE,54760,LEYR,,,54315,,,,,,,,,,,,,,,,,,,1995-12-25,F,,,,,45.2V,NAF1993,N,6.261218,48.807043,0.95,housenumber,58 Rue de la Gare 54760 Leyr,54315_0140_00058,G,58 RUE DE LA GARE,
378130108,00012,37813010800012,O,,NN,,,,true,1,,1,,RUE,DES ECOLES,54760,LEYR,,,54315,,,,,,,,,,,,,,,,,,,1990-09-08,F,,,,,55.3A,NAF1993,N,6.26463,48.802991,0.92,housenumber,1 Rue des Ecoles Vincent Van Gogh 54760 Leyr,54315_0060_00001,G,1 RUE DES ECOLES V VAN GOGH,
378130199,00011,37813019900011,O,,NN,,,,true,1,,1,,RUE,DES ECOLES,54760,LEYR,,,54315,,,,,,,,,,,,,,,,,,,1990-09-08,F,,,,,55.3A,NAF1993,N,6.26463,48.802991,0.92,housenumber,1 Rue des Ecoles Vincent Van Gogh 54760 Leyr,54315_0060_00001,G,1 RUE DES ECOLES V VAN GOGH,
379998941,00015,37999894100015,O,1990-11-01,NN,,,,true,1,,3,,IMP,DES JONQUILLES,54760,LEYR,,,54315,,,,,,,,,,,,,,,,,,,1998-02-17,F,,,,,45.4C,NAF1993,O,6.267278,48.806341,0.85,housenumber,3 Impasse des Jonquilles 54760 Leyr,54315_0170_00003,G,3 IMPASSE DES JONQUILLES,
380730077,00019,38073007700019,O,1991-01-01,NN,,,2011-05-13T09:29:48,true,4,,,,RUE,DE LA GARE,54760,LEYR,,,54315,,,,,,,,,,,,,,,,,,,2011-04-01,F,,,,,01.50Z,NAFRev2,N,6.261557,48.806138,0.95,street,Rue de la Gare 54760 Leyr,54315_0140,G,RUE DE LA GARE,
381043116,00015,38104311600015,O,,NN,,,,true,1,,,,RUE,DE LA PROMENADE,54760,LEYR,,,54315,,,,,,,,,,,,,,,,,,,1994-01-01,F,,,,,71.3G,NAF1993,O,6.2731,48.804393,0.95,street,Rue de la Promenade 54760 Leyr,54315_0325,G,RUE DE LA PROMENADE,
382094563,00030,38209456300030,O,2006-01-01,,,,2016-07-10T04:09:34,true,3,,1,,RTE,DE MONTENOY,54760,LEYR,,,54315,,,,,,,,,,,,,,,,,,,2016-03-04,F,,,,,70.10Z,NAFRev2,N,6.264039,48.801027,0.85,housenumber,1 Route de Montenoy 54760 Leyr,54315_0240_00001,G,1 ROUTE DE MONTENOY,
382105963,00013,38210596300013,O,1991-06-01,NN,,1413ZG,2015-03-17T00:34:44,true,3,,5,,RUE,DE LA PROMENADE,54760,LEYR,,,54315,,,,,,,,,,,,,,,,,,,2008-01-01,A,,,,,14.13Z,NAFRev2,N,6.269481,48.804674,0.95,housenumber,5 Rue de la Promenade 54760 Leyr,54315_0325_00005,G,5 RUE DE LA PROMENADE,
382444909,00016,38244490900016,O,1991-06-01,NN,,,2007-05-19T11:01:08,true,4,,6,,RUE,DE LA PROMENADE,54760,LEYR,,,54315,,,,,,,,,,,,,,,,,,,2005-12-31,F,,,,,67.1E,NAFRev1,O,6.269144,48.804589,0.95,housenumber,6 Rue de la Promenade 54760 Leyr,54315_0325_00006,G,6 RUE DE LA PROMENADE,
385328752,00014,38532875200014,O,1900-01-01,NN,,,2011-04-28T00:51:43,false,4,,2,,PL,DE L EGLISE,54760,LEYR,,,54315,,,,,,,,,,,,,,,,,,,1995-01-24,F,,,,,45.3A,NAF1993,O,6.266018,48.802208,0.82,housenumber,2 Place de l’Église Saint-Hilaire 54760 Leyr,54315_0080_00002,G,2 PL DE L EGLISE SAINT HILAIRE,
387483506,00011,38748350600011,O,1992-02-29,NN,,,2008-01-04T22:55:05,true,3,,58,,RUE,DE LA GARE,54760,LEYR,,,54315,,,,,,,,,,,,,,,,,,,2008-01-01,A,,,,,68.20A,NAFRev2,N,6.261218,48.807043,0.95,housenumber,58 Rue de la Gare 54760 Leyr,54315_0140_00058,G,58 RUE DE LA GARE,
389194994,00015,38919499400015,O,,NN,,,,true,1,,3,,RUE,DES BLEUETS,54760,LEYR,,,54315,,,,,,,,,,,,,,,,,,,1993-04-24,F,,,,,85.1C,NAF1993,N,6.268482,48.806134,0.95,housenumber,3 Rue des Bleuets 54760 Leyr,54315_0044_00003,G,3 RUE DES BLEUETS,
390695922,00034,39069592200034,O,2006-06-01,01,2019,4399CZ,2021-10-27T08:18:27,true,2,,36,,RUE,DE LA GARE,54760,LEYR,,,54315,,,,,,,,,,,,,,,,,,,2008-01-01,A,,,,,43.99C,NAFRev2,O,6.262013,48.804859,0.95,housenumber,36 Rue de la Gare 54760 Leyr,54315_0140_00036,G,36 RUE DE LA GARE,
392522470,00021,39252247000021,O,1995-11-01,NN,,,2015-05-14T06:11:55,true,6,,,,RTE,DE MOIVRONS,54760,LEYR,,,54315,,,,,,,,,,,,,,,,,,,2014-07-29,F,,,,,43.12A,NAFRev2,N,6.259988,48.810228,0.82,street,Route de Moivrons 54760 Leyr,54315_ccn9u0,G,ROUTE DE MOIVRONS,
392596524,00018,39259652400018,O,,,,,,true,1,,44,,,GRAND RUE,54760,LEYR,,,54315,,,,,,,,,,,,,,,,,,,1994-09-30,F,,,,,52.4X,NAF1993,N,6.267642,48.804435,0.81,housenumber,44 Grande Rue 54760 Leyr,54315_0340_00044,G,44 GRANDE RUE,
393100243,00012,39310024300012,O,1993-11-22,NN,,,2008-11-08T00:57:31,false,4,,7,,RUE,DE LA PROMENADE,54760,LEYR,,,54315,,,,,,,,,,,,,,,,,,,1998-09-01,F,,,,,45.3F,NAF1993,N,6.269388,48.804675,0.95,housenumber,7 Rue de la Promenade 54760 Leyr,54315_0325_00007,G,7 RUE DE LA PROMENADE,
393100243,00020,39310024300020,O,1998-09-01,NN,,,2014-07-08T01:21:43,true,4,,13,,RUE,DU MOLNEY,54760,LEYR,,,54315,,,,,,,,,,,,,,,,,,,2011-09-24,F,,,,,43.22B,NAFRev2,N,6.261762,48.801873,0.79,housenumber,13 Rue de Molney 54760 Leyr,54315_0220_00013,G,13 RUE DE MOLNEY,
393993191,00013,39399319100013,O,1994-01-22,NN,,,2009-02-04T00:28:11,false,4,,6,,RUE,DE LA PROMENADE,54760,LEYR,,BP NÂ° 2,54315,,,,,,,,,,,,,,,,,,,2004-02-02,F,,,,,45.2T,NAFRev1,O,6.269144,48.804589,0.95,housenumber,6 Rue de la Promenade 54760 Leyr,54315_0325_00006,G,6 RUE DE LA PROMENADE,
394196364,00019,39419636400019,O,1994-01-01,NN,,,2008-01-04T18:01:47,true,3,,5,,RUE,DE NANCY,54760,LEYR,,,54315,,,,,,,,,,,,,,,,,,,2008-01-01,A,,,,,90.03B,NAFRev2,N,6.264359,48.800969,0.95,housenumber,5 Rue de Nancy 54760 Leyr,54315_0280_00005,G,5 RUE DE NANCY,
394246805,00045,39424680500045,O,1994-09-01,NN,,,2007-01-09T11:57:56,false,3,MR SONNARD LUC,12,,RUE,DES BLEUETS,54760,LEYR,,,54315,,,,,,,,,,,,,,,,,,,2004-12-31,F,,,,,51.3T,NAFRev1,N,6.267129,48.805637,0.95,housenumber,12 Rue des Bleuets 54760 Leyr,54315_0044_00012,G,12 RUE DES BLEUETS,
394294045,00023,39429404500023,O,1995-02-01,NN,,,,false,4,,19,,RUE,DE HAUT CHATEAU,54760,LEYR,,,54315,,,,,,,,,,,,,,,,,,,1998-09-01,F,,,,,85.1G,NAF1993,N,6.264207,48.801281,0.83,housenumber,19 Rue du Haut Château 54760 Leyr,54315_0160_00019,G,19 RUE DU HAUT CHATEAU,
398324608,00015,39832460800015,O,1994-07-01,NN,,,2008-11-08T01:04:25,false,3,,42,,,GRANDE RUE,54760,LEYR,,,54315,,,,,,,,,,,,,,,,,,,1996-04-01,F,,,,,31.6D,NAF1993,N,6.267665,48.804451,0.95,housenumber,42 Grande Rue 54760 Leyr,54315_0340_00042,G,42 GRANDE RUE,
398475715,00015,39847571500015,O,1994-09-23,NN,,,2019-01-29T11:09:48,false,4,MR GOURLIA GERARD,72,,RUE,DE LA GARE,54760,LEYR,,,54315,,,,,,,,,,,,,,,,,,,2018-12-15,F,,,,,68.20A,NAFRev2,N,6.260925,48.807818,0.95,housenumber,72 Rue de la Gare 54760 Leyr,54315_0140_00072,G,72 RUE DE LA GARE,
399260363,00011,39926036300011,O,1994-10-01,,,,2008-01-04T19:05:46,true,3,,,,RUE,DE LA PROMENADE,54760,LEYR,,,54315,,,,,,,,,,,,,,,,,,,2008-01-01,A,,,,,93.12Z,NAFRev2,N,6.2731,48.804393,0.95,street,Rue de la Promenade 54760 Leyr,54315_0325,G,RUE DE LA PROMENADE,
399261304,00022,39926130400022,O,1996-12-31,NN,,4120BB,2019-06-24T13:22:35,false,5,,15,,,GRAND RUE,54760,LEYR,,,54315,,,,,,,,,,,,,,,,,,,2017-10-31,F,,,,,43.32A,NAFRev2,O,6.266431,48.803585,0.81,housenumber,15 Grande Rue 54760 Leyr,54315_0340_00015,G,15 GRANDE RUE,
399895143,00010,39989514300010,O,1994-12-31,NN,,,2008-01-04T19:18:19,true,3,,18,,,GRANDE RUE,54760,LEYR,,,54315,,,,,,,,,,,,,,,,,,,2008-01-01,A,,,,,68.20B,NAFRev2,N,6.266551,48.803245,0.95,housenumber,18 Grande Rue 54760 Leyr,54315_0340_00018,G,18 GRANDE RUE,
400113361,00028,40011336100028,O,2003-05-02,NN,,,2008-11-08T01:08:27,false,3,,10,,RUE,DE L'EGLISE,54760,LEYR,,,54315,,,,,,,,,,,,,,,,,,,2006-06-01,F,,,,,45.3A,NAFRev1,N,6.264474,48.802803,0.95,housenumber,10 Rue de l’Eglise 54760 Leyr,54315_0100_00010,G,10 RUE DE L EGLISE,