siren,nic,siret,statutDiffusionEtablissement,dateCreationEtablissement,trancheEffectifsEtablissement,anneeEffectifsEtablissement,activitePrincipaleRegistreMetiersEtablissement,dateDernierTraitementEtablissement,etablissementSiege,nombrePeriodesEtablissement,complementAdresseEtablissement,numeroVoieEtablissement,indiceRepetitionEtablissement,typeVoieEtablissement,libelleVoieEtablissement,codePostalEtablissement,libelleCommuneEtablissement,libelleCommuneEtrangerEtablissement,distributionSpecialeEtablissement,codeCommuneEtablissement,codeCedexEtablissement,libelleCedexEtablissement,codePaysEtrangerEtablissement,libellePaysEtrangerEtablissement,complementAdresse2Etablissement,numeroVoie2Etablissement,indiceRepetition2Etablissement,typeVoie2Etablissement,libelleVoie2Etablissement,codePostal2Etablissement,libelleCommune2Etablissement,libelleCommuneEtranger2Etablissement,distributionSpeciale2Etablissement,codeCommune2Etablissement,codeCedex2Etablissement,libelleCedex2Etablissement,codePaysEtranger2Etablissement,libellePaysEtranger2Etablissement,dateDebut,etatAdministratifEtablissement,enseigne1Etablissement,enseigne2Etablissement,enseigne3Etablissement,denominationUsuelleEtablissement,activitePrincipaleEtablissement,nomenclatureActivitePrincipaleEtablissement,caractereEmployeurEtablissement,longitude,latitude,geo_score,geo_type,geo_adresse,geo_id,geo_ligne,geo_l4,geo_l5
200047660,00010,20004766000010,O,1990-07-17,01,2019,,2021-10-27T08:05:45,true,2,MAIRIE,,,,,08500,LES MAZURES,,,08284,,,,,,,,,,,,,,,,,,,2015-02-01,A,,,,,84.11Z,NAFRev2,O,4.625393,49.894176,0.38,street,Les Riezes 08500 Les Mazures,08284_45bz9f,D,LES RIEZES,
210802567,00011,21080256700011,O,1983-03-01,12,2019,,2021-10-27T08:06:36,true,4,,,,RUE,MARTIN MARTHE,08500,LES MAZURES,,,08284,,,,,,,,,,,,,,,,,,,2008-01-01,A,MAIRIE,,,,84.11Z,NAFRev2,O,4.626768,49.88803,0.95,street,Rue Martin Marthe 08500 Les Mazures,08284_B109,G,RUE MARTIN MARTHE,
210802567,00029,21080256700029,O,1983-12-21,03,2019,,2021-10-27T08:06:36,false,3,,,,RUE,DU PETIT MARAIS,08500,LES MAZURES,,,08284,,,,,,,,,,,,,,,,,,,2008-01-01,A,ECOLE PRIMAIRE PUBLIQUE,,,,85.20Z,NAFRev2,N,4.623885,49.88757,0.95,street,Rue du Petit Marais 08500 Les Mazures,08284_0033,G,RUE DU PETIT MARAIS,
210802567,00037,21080256700037,O,1996-05-01,NN,,,2008-01-04T18:24:52,false,3,MAIRIE,,,RUE,MARTIN MARTHE,08500,LES MAZURES,,,08284,,,,,,,,,,,,,,,,,,,2008-01-01,A,SERVICE D'EAU ET D'ASSAINISSEMENT,,,,36.00Z,NAFRev2,N,4.626768,49.88803,0.95,street,Rue Martin Marthe 08500 Les Mazures,08284_B109,G,RUE MARTIN MARTHE,
210802567,00045,21080256700045,O,1981-01-01,NN,,,2008-01-04T18:24:52,false,3,MAIRIE,,,RUE,MARTIN MARTHE,08500,LES MAZURES,,,08284,,,,,,,,,,,,,,,,,,,2008-01-01,A,EXPLOITATION FORESTIERE,,,,02.20Z,NAFRev2,N,4.626768,49.88803,0.95,street,Rue Martin Marthe 08500 Les Mazures,08284_B109,G,RUE MARTIN MARTHE,
210802567,00052,21080256700052,O,1998-01-01,NN,,,2013-10-05T12:25:56,false,4,MAIRIE,,,RUE,MARTIN MARTHE,08500,LES MAZURES,,,08284,,,,,,,,,,,,,,,,,,,2012-12-25,F,BUDGET ANNEXE LOTISSEMENT,,,,42.99Z,NAFRev2,N,4.626768,49.88803,0.95,street,Rue Martin Marthe 08500 Les Mazures,08284_B109,G,RUE MARTIN MARTHE,
210802567,00060,21080256700060,O,2000-01-27,NN,,,2013-10-05T12:25:56,false,4,MAIRIE,,,RUE,MARTIN MARTHE,08500,LES MAZURES,,,08284,,,,,,,,,,,,,,,,,,,2012-12-25,F,LOCATION BATIMENT INDUSTRIEL,,,,68.20B,NAFRev2,N,4.626768,49.88803,0.95,street,Rue Martin Marthe 08500 Les Mazures,08284_B109,G,RUE MARTIN MARTHE,
220800049,00128,22080004900128,O,1977-05-18,12,2019,,2021-10-27T08:11:34,false,3,,,,,LES VIEILLES FORGES,08500,LES MAZURES,,,08284,,,,,,,,,,,,,,,,,,,2008-01-01,A,TERRAIN CAMPING DEP LAC VIEILLES FORGES,,,,55.30Z,NAFRev2,N,4.589343,49.889095,0.94,street,Les Vieilles Forges 08500 Les Mazures,08284_B119,G,LES VIEILLES FORGES,
250800141,00013,25080014100013,O,1983-03-01,02,2019,,2021-10-27T08:11:57,true,4,MAIRIE,58,,RUE,CLEMENT PIERLOT,08500,LES MAZURES,,,08284,,,,,,,,,,,,,,,,,,,2018-01-30,A,,,,,84.12Z,NAFRev2,O,4.629279,49.889136,0.43,street,Chemin Rural de la Prise Clement 08500 Les Mazures,08284_qqie22,G,CHEMIN RURAL DE LA PRISE CLEMENT,
250801842,00015,25080184200015,O,1990-07-17,NN,,,2014-10-08T10:54:35,true,3,,,,,MAIRIE,08500,LES MAZURES,,,08284,,,,,,,,,,,,,,,,,,,2008-01-01,F,,,,,42.99Z,NAFRev2,N,4.625393,49.894176,0.38,street,Les Riezes 08500 Les Mazures,08284_45bz9f,G,LES RIEZES,
260802533,00018,26080253300018,O,1983-03-01,NN,,,2010-06-26T03:03:49,true,3,MAIRIE,,,RUE,MARTIN MOTHE,08500,LES MAZURES,,,08284,,,,,,,,,,,,,,,,,,,2008-01-01,A,CCAS,,,,88.99B,NAFRev2,N,4.626768,49.88803,0.79,street,Rue Martin Marthe 08500 Les Mazures,08284_B109,G,RUE MARTIN MARTHE,
270801186,00015,27080118600015,O,,,,,,true,1,,,,,,08500,LES MAZURES,,,08284,,,,,,,,,,,,,,,,,,,1995-12-25,F,,,,,41.0Z,NAF1993,N,,,0,,,,,,
270801194,00019,27080119400019,O,,,,,,true,1,,,,,,08500,LES MAZURES,,,08284,,,,,,,,,,,,,,,,,,,1995-12-25,F,,,,,90.0A,NAF1993,N,,,0,,,,,,
300439387,00014,30043938700014,O,,,,,,true,1,,,,PL,DE LA MAIRIE,08500,LES MAZURES,,,08284,,,,,,,,,,,,,,,,,,,1997-07-31,F,,,,,55.4A,NAF1993,N,4.626808,49.888774,0.49,street,Place de la Fontinette 08500 Les Mazures,08284_0013,G,PLACE DE LA FONTINETTE,
301077814,00053,30107781400053,O,2018-01-01,,,,2021-02-23T10:35:51,true,1,,,,,LA PALMERAIE DU BOCHET,08500,LES MAZURES,,,08284,,,,,,,,,,,,,,,,,,,2018-01-01,A,,,,,81.21Z,NAFRev2,N,4.617972,49.871091,0.57,street,La Prise du Bochet Bas 08500 Les Mazures,08284_B092,G,LA PRISE DU BOCHET BAS,
304711302,00014,30471130200014,O,,NN,,,,true,1,,,,DOM,BOIS DES MARQUISADES,08500,LES MAZURES,,,08284,,,,,,,,,,,,,,,,,,,1988-12-25,F,,,,,02.20,NAP,N,,,0,,,,,,
307344507,00016,30734450700016,O,,NN,,,,true,1,,,,LD,LES VIEILLES FORGES,08500,LES MAZURES,,,08284,,,,,,,,,,,,,,,,,,,1987-03-27,F,,,,,67.01,NAP,N,4.589343,49.889095,0.94,street,Les Vieilles Forges 08500 Les Mazures,08284_B119,G,LES VIEILLES FORGES,
308638907,00011,30863890700011,O,,,,,,true,1,,8,,RUE,DE L EGLISE,08500,LES MAZURES,,,08284,,,,,,,,,,,,,,,,,,,1987-12-31,F,,,,,55.72,NAP,N,4.625446,49.888756,0.83,housenumber,8 Rue du l’Eglise 08500 Les Mazures,08284_0011_00008,G,8 RUE DU L EGLISE,
309101152,00010,30910115200010,O,,NN,,,,true,1,,,,,,08500,LES MAZURES,,,08284,,,,,,,,,,,,,,,,,,,,F,,,,,67.07,NAP,N,,,0,,,,,,
309206340,00023,30920634000023,O,1900-01-01,,,,2006-11-25T09:24:12,false,4,,,,,LAC DES VIEILLES FORGES,08500,LES MAZURES,,,08284,,,,,,,,,,,,,,,,,,,1993-08-31,F,,,,,92.6C,NAF1993,N,4.589343,49.889095,0.71,street,Les Vieilles Forges 08500 Les Mazures,08284_B119,G,LES VIEILLES FORGES,
310085196,00031,31008519600031,O,,NN,,,,true,1,,,,RUE,DU PETIT MARAIS,08500,LES MAZURES,,,08284,,,,,,,,,,,,,,,,,,,1987-01-12,F,,,,,73.08,NAP,N,4.623885,49.88757,0.95,street,Rue du Petit Marais 08500 Les Mazures,08284_0033,G,RUE DU PETIT MARAIS,
310098967,00014,31009896700014,O,,NN,,,,true,1,,,,,,08500,LES MAZURES,,,08284,,,,,,,,,,,,,,,,,,,1988-02-03,F,,,,,02.0B,NAF1993,N,,,0,,,,,,
310977202,00012,31097720200012,O,,NN,,,,true,1,,,,LD,LES NEUVES FORGES,08500,LES MAZURES,,,08284,,,,,,,,,,,,,,,,,,,,F,,,,,62.46,NAP,N,4.589343,49.889095,0.59,street,Les Vieilles Forges 08500 Les Mazures,08284_B119,G,LES VIEILLES FORGES,
312089394,00026,31208939400026,O,1984-05-01,NN,,,2015-11-08T04:08:02,true,8,,,,RTE,DE SECHEVAL,08500,LES MAZURES,,,08284,,,,,,,,,,,,,,,,,,,2015-10-19,A,LE SAINT HUBERT,,,LE SAINT HIBERT,56.30Z,NAFRev2,N,4.629108,49.886063,0.83,street,Route de Secheval 08500 Les Mazures,08284_0052,G,ROUTE DE SECHEVAL,
316042076,00018,31604207600018,O,,,,,,true,1,,,,HAM,DES VIEILLES FORGES,08500,LES MAZURES,,,08284,,,,,,,,,,,,,,,,,,,1984-12-25,F,,,,,67.01,NAP,N,4.589343,49.889095,0.84,street,Les Vieilles Forges 08500 Les Mazures,08284_B119,G,LES VIEILLES FORGES,
317148682,00022,31714868200022,O,,NN,,,,true,1,,,,RUE,DE LA FONTINETTE,08500,LES MAZURES,,,08284,,,,,,,,,,,,,,,,,,,,F,,,,,55.71,NAP,N,4.626927,49.888623,0.94,street,Rue de la Fontinette 08500 Les Mazures,08284_0012,G,RUE DE LA FONTINETTE,
318624442,00014,31862444200014,O,,,,,,true,1,,,,,,08500,LES MAZURES,,,08284,,,,,,,,,,,,,,,,,,,1984-12-25,F,,,,,02.20,NAP,N,,,0,,,,,,
318764834,00012,31876483400012,O,,NN,,,,true,1,,29,,RTE,DE REVIN,08500,LES MAZURES,,,08284,,,,,,,,,,,,,,,,,,,1988-09-30,F,,,,,67.01,NAP,N,4.62558,49.891347,0.84,housenumber,29 Route de Revin 08500 Les Mazures,08284_0038_00029,G,29 ROUTE DE REVIN,
319589420,00011,31958942000011,O,1980-01-01,NN,,,,true,3,,,,,,08500,LES MAZURES,,,08284,,,,,,,,,,,,,,,,,,,1993-12-25,F,,,,,02.0B,NAF1993,N,,,0,,,,,,
319844627,00012,31984462700012,O,,,,,,true,1,,,,,LE BOCHET HAUT,08500,LES MAZURES,,,08284,,,,,,,,,,,,,,,,,,,1984-12-25,F,,,,,69.23,NAP,N,4.628453,49.890721,0.81,street,Rue du Bochet Haut 08500 Les Mazures,08284_0006,G,RUE DU BOCHET HAUT,
320423866,00013,32042386600013,O,1981-01-01,NN,,,2012-11-09T00:19:59,true,7,,37,,RTE,DE REVIN,08500,LES MAZURES,,,08284,,,,,,,,,,,,,,,,,,,2009-09-30,F,,,,,95.29Z,NAFRev2,N,4.625475,49.893631,0.84,housenumber,37 Route de Revin 08500 Les Mazures,08284_0038_00037,G,37 ROUTE DE REVIN,
320725302,00014,32072530200014,O,,NN,,,,true,1,,2,,RUE,SAINT MARTIN MARTHE,08500,LES MAZURES,,,08284,,,,,,,,,,,,,,,,,,,2002-08-31,F,,,,,50.1Z,NAF1993,O,4.626662,49.887818,0.7,housenumber,2 Rue Martin Marthe 08500 Les Mazures,08284_b109_00002,G,2 RUE MARTIN MARTHE,
321790198,00030,32179019800030,O,,NN,,,,true,1,,,,,,08500,LES MAZURES,,,08284,,,,,,,,,,,,,,,,,,,1987-09-01,F,,,,,62.46,NAP,N,,,0,,,,,,
322415084,00019,32241508400019,O,,,,,,true,1,,,,,ZONE INDUSTRIELLE,08500,LES MAZURES,,,08284,,,,,,,,,,,,,,,,,,,1987-05-19,F,,,,,24.08,NAP,N,5.0269111,45.7705982,0.92,poi.industrial,Zone Industrielle Meyzieu,https://osm.org/way/117589602,G,,
324701069,00019,32470106900019,O,,,,,,true,1,,,,,LES VIEILLES FORGES,08500,LES MAZURES,,,08284,,,,,,,,,,,,,,,,,,,1988-02-15,F,,,,,67.07,NAP,N,4.589343,49.889095,0.94,street,Les Vieilles Forges 08500 Les Mazures,08284_B119,G,LES VIEILLES FORGES,
325567600,00029,32556760000029,O,,NN,,,2013-10-15T03:26:59,true,1,,8,,PL,DE GAULLE,08500,LES MAZURES,,,08284,,,,,,,,,,,,,,,,,,,1988-12-25,F,,,,,55.70,NAP,N,4.627522,49.88734,0.7,housenumber,8 Rue Charles de Gaulle 08500 Les Mazures,08284_0008_00008,G,8 RUE CHARLES DE GAULLE,
327927620,00010,32792762000010,O,,,,,,true,1,,,,RTE,DE REVIN,08500,LES MAZURES,,,08284,,,,,,,,,,,,,,,,,,,1984-12-25,F,,,,,67.01,NAP,N,4.626094,49.890773,0.81,street,Route de Revin 08500 Les Mazures,08284_0038,G,ROUTE DE REVIN,
328403001,00014,32840300100014,O,1983-10-01,NN,,,2018-06-26T17:47:34,true,3,,,,,,08500,LES MAZURES,,,08284,,,,,,,,,,,,,,,,,,,2008-01-01,A,,,,,02.20Z,NAFRev2,N,,,0,,,,,,
328527866,00011,32852786600011,O,,NN,,,,true,1,,24,,RUE,CHARLES DE GAULLE,08500,LES MAZURES,,,08284,,,,,,,,,,,,,,,,,,,1988-08-30,F,,,,,02.20,NAP,N,4.62804,49.886816,0.95,housenumber,24 Rue Charles de Gaulle 08500 Les Mazures,08284_0008_00024,G,24 RUE CHARLES DE GAULLE,
328863691,00015,32886369100015,O,1983-12-08,NN,,,,true,3,,,,PL,DE LA MAIRIE,08500,LES MAZURES,,,08284,,,,,,,,,,,,,,,,,,,2003-12-30,F,,,,,52.1B,NAFRev1,N,4.626808,49.888774,0.49,street,Place de la Fontinette 08500 Les Mazures,08284_0013,G,PLACE DE LA FONTINETTE,
332392125,00016,33239212500016,O,,NN,,,,true,1,,5,,RUE,DU BLOCUS,08500,LES MAZURES,,,08284,,,,,,,,,,,,,,,,,,,,F,,,,,02.20,NAP,N,4.628425,49.889145,0.95,housenumber,5 Rue du Blocus 08500 Les Mazures,08284_0003_00005,G,5 RUE DU BLOCUS,
332570191,00020,33257019100020,O,2021-07-23,,,,2021-09-23T16:41:31,true,2,,,,,LES ETANGS DES NEUVES FORGES,08500,LES MAZURES,,,08284,,,,,,,,,,,,,,,,,,,2021-09-17,A,,,,LE DOMAINE DU PARADIS DES NEUVES FORGES,93.29Z,NAFRev2,N,,,0,,,,,,
332709997,00024,33270999700024,O,2020-11-19,,,5610CQ,2021-02-23T10:52:23,true,1,,2,,RUE,DES HAYETTES,08500,LES MAZURES,,,08284,,,,,,,,,,,,,,,,,,,2020-11-19,A,,,,LA STAR C EST DANS L ASSIETTE,56.21Z,NAFRev2,N,4.626733,49.889836,0.95,housenumber,2 Rue des Hayettes 08500 Les Mazures,08284_0018_00002,G,2 RUE DES HAYETTES,
332869056,00017,33286905600017,O,1985-01-01,NN,,,,true,1,,19,,RUE,MARTIN MARTHE,08500,LES MAZURES,,,08284,,,,,,,,,,,,,,,,,,,2002-06-30,F,,,,,55.3A,NAF1993,N,4.626829,49.888294,0.95,housenumber,19 Rue Martin Marthe 08500 Les Mazures,08284_b109_00019,G,19 RUE MARTIN MARTHE,
333278125,00013,33327812500013,O,,NN,,,,true,1,,2,,RUE,SAINT BERNARD,08500,LES MAZURES,,,08284,,,,,,,,,,,,,,,,,,,,F,,,,,64.43,NAP,N,4.626363,49.888362,0.95,housenumber,2 Rue Saint Bernard 08500 Les Mazures,08284_b110_00002,G,2 RUE SAINT BERNARD,
334440476,00037,33444047600037,O,1999-10-11,NN,,,2006-11-25T10:25:58,true,3,,,,,ZA DE LA BELLE VUE,08500,LES MAZURES,,BP 12,08284,,,,,,,,,,,,,,,,,,,2005-11-18,F,,,,,27.5G,NAFRev1,N,,,0,,,,,,
334671252,00024,33467125200024,O,,NN,,,,true,1,,5,,RUE,DU PETIT MARAIS,08500,LES MAZURES,,,08284,,,,,,,,,,,,,,,,,,,1987-02-28,F,,,,,64.25,NAP,N,4.62371,49.887878,0.95,housenumber,5 Rue du Petit Marais 08500 Les Mazures,08284_0033_00005,G,5 RUE DU PETIT MARAIS,
334771540,00013,33477154000013,O,,NN,,,,true,1,,,,RUE,DU BOCHET HAUT,08500,LES MAZURES,,,08284,,,,,,,,,,,,,,,,,,,1993-06-30,F,,,,,28.1A,NAF1993,N,4.628453,49.890721,0.95,street,Rue du Bochet Haut 08500 Les Mazures,08284_0006,G,RUE DU BOCHET HAUT,
334785912,00018,33478591200018,O,,NN,,,,true,1,,,,,,08500,LES MAZURES,,,08284,,,,,,,,,,,,,,,,,,,1986-06-23,F,,,,,01.80,NAP,N,,,0,,,,,,
343022794,00022,34302279400022,O,2006-03-25,NN,,,2021-02-23T10:58:23,true,3,,37,,RTE,DES VIEILLES FORGES,08500,LES MAZURES,,,08284,,,,,,,,,,,,,,,,,,,2012-12-31,A,,,,,02.40Z,NAFRev2,O,4.589343,49.889095,0.7,housenumber,37 Les Vieilles Forges 08500 Les Mazures,08284_b119_00037,G,37 LES VIEILLES FORGES,
343127742,00017,34312774200017,O,1987-06-22,,,,,true,4,,,,,,08500,LES MAZURES,,,08284,,,,,,,,,,,,,,,,,,,1992-12-25,F,,,,,28.3C,NAF1993,N,,,0,,,,,,
343735601,00019,34373560100019,O,1988-01-21,,,,,true,4,,1,,RUE,DES HAYETTES,08500,LES MAZURES,,,08284,,,,,,,,,,,,,,,,,,,1991-12-25,F,,,,,56.01,NAP,N,4.626729,49.890139,0.95,housenumber,1 Rue des Hayettes 08500 Les Mazures,08284_0018_00001,G,1 RUE DES HAYETTES,
345154199,00011,34515419900011,O,,NN,,,,true,1,,27,,RTE,DE REVIN,08500,LES MAZURES,,,08284,,,,,,,,,,,,,,,,,,,1989-12-31,F,,,,,02.20,NAP,N,4.626094,49.890773,0.84,housenumber,27 Route de Revin 08500 Les Mazures,08284_0038_00027,G,27 ROUTE DE REVIN,
348167925,00018,34816792500018,O,,,,,,true,1,,,,,LE CHAMP LECUY,08500,LES MAZURES,,,08284,,,,,,,,,,,,,,,,,,,1990-04-19,F,,,,,69.25,NAP,N,4.623187,49.890064,0.83,street,Champ Lecuy 08500 Les Mazures,08284_B017,G,CHAMP LECUY,
348168378,00027,34816837800027,O,1991-07-22,NN,,,2021-02-23T11:01:06,true,7,,22,,RUE,DES HAYETTES,08500,LES MAZURES,,,08284,,,,,,,,,,,,,,,,,,,2014-10-17,A,,,,,43.22A,NAFRev2,N,4.626934,49.890677,0.95,housenumber,22 Rue des Hayettes 08500 Les Mazures,08284_0018_00022,G,22 RUE DES HAYETTES,
349467423,00076,34946742300076,O,2014-04-22,01,2019,,2021-10-27T08:39:36,false,3,CAMPING LE LAC DES VIEILLES FORGES,,,,CAMPING LAC DES VIEILLES FORGE,08500,LES MAZURES,,,08284,,,,,,,,,,,,,,,,,,,2015-05-02,A,,,,IC ROK CAFE,56.10C,NAFRev2,O,4.589343,49.889095,0.53,street,Les Vieilles Forges 08500 Les Mazures,08284_B119,G,LES VIEILLES FORGES,
349708446,00274,34970844600274,O,2012-04-01,NN,,,2017-05-04T06:01:01,false,3,,,,,LE LAC DES VIEILLES FORGES,08500,LES MAZURES,,,08284,,,,,,,,,,,,,,,,,,,2015-09-30,F,,,,,55.30Z,NAFRev2,O,4.589343,49.889095,0.68,street,Les Vieilles Forges 08500 Les Mazures,08284_B119,G,LES VIEILLES FORGES,
350357661,00015,35035766100015,O,,NN,,,,true,1,,,,,LES NEUVES FORGES,08500,LES MAZURES,,,08284,,,,,,,,,,,,,,,,,,,1995-08-31,F,,,,,55.3A,NAF1993,N,4.589343,49.889095,0.59,street,Les Vieilles Forges 08500 Les Mazures,08284_B119,G,LES VIEILLES FORGES,
350359402,00020,35035940200020,O,2020-09-07,,,3316ZZ,2021-02-23T11:03:07,true,1,,6,,RUE,BOCHET HAUT,08500,LES MAZURES,,,08284,,,,,,,,,,,,,,,,,,,2020-09-07,A,,,,JP MAINTENANCE,33.16Z,NAFRev2,N,4.628785,49.890468,0.89,housenumber,6 Rue du Bochet Haut 08500 Les Mazures,08284_0006_00006,G,6 RUE DU BOCHET HAUT,
353167950,00016,35316795000016,O,,NN,,,,true,1,,,,RUE,SAINT BERNARD,08500,LES MAZURES,,,08284,,,,,,,,,,,,,,,,,,,1993-12-31,F,,,,,51.3J,NAF1993,O,4.625783,49.888423,0.95,street,Rue Saint Bernard 08500 Les Mazures,08284_B110,G,RUE SAINT BERNARD,
356000216,04414,35600021604414,O,1991-01-01,NN,,,2008-11-06T11:42:46,false,4,,,,RUE,MARTIN MARTHE,08500,LES MAZURES,,,08284,,,,,,,,,,,,,,,,,,,2008-10-28,F,BUREAU DE POSTE,,,,53.10Z,NAFRev2,O,4.626768,49.88803,0.95,street,Rue Martin Marthe 08500 Les Mazures,08284_B109,G,RUE MARTIN MARTHE,
378349278,00069,37834927800069,O,2014-12-29,,,,2016-01-10T04:33:16,false,2,ZONE ARTISANALE LA BELLE VUE,,,,,08500,LES MAZURES,,,08284,,,,,,,,,,,,,,,,,,,2015-12-11,F,,,,,25.62B,NAFRev2,N,,,0,,,,,,
379735442,00012,37973544200012,O,1988-05-26,,,,2006-11-25T11:27:41,false,3,,98,,RUE,VICTOR HUGO,08500,LES MAZURES,,,08284,,,,,,,,,,,,,,,,,,,1993-09-23,F,,,,,92.6C,NAF1993,N,2.3857612,48.819559,0.9,poi,Rue Victor Hugo (Pont) Ivry-sur-Seine,https://osm.org/way/40120403,G,,
379800972,00018,37980097200018,O,1990-10-01,NN,,,2008-11-08T00:36:30,false,4,,,,RTE,DE REVIN,08500,LES MAZURES,,,08284,,,,,,,,,,,,,,,,,,,1994-06-01,F,BATITHERM,,,,45.3E,NAF1993,N,4.626094,49.890773,0.81,street,Route de Revin 08500 Les Mazures,08284_0038,G,ROUTE DE REVIN,
380236679,00011,38023667900011,O,1990-06-06,NN,,,2008-01-04T21:40:02,true,3,,,,,LE PRE QUEQUET,08500,LES MAZURES,,BP 10,08284,,,,,,,,,,,,,,,,,,,2008-01-01,A,,,,,93.12Z,NAFRev2,N,4.633201,49.877276,0.34,street,Pré Drouart 08500 Les Mazures,08284_B070,G,PRE DROUART,
381089473,00023,38108947300023,O,2011-02-01,NN,,,2020-03-19T03:36:17,true,3,,,,,ZONE ARTISANALE LES BELLES VUES,08500,LES MAZURES,,,08284,,,,,,,,,,,,,,,,,,,2013-12-31,A,,,,,25.72Z,NAFRev2,N,,,0,,,,,,
381821065,00012,38182106500012,O,1991-04-01,NN,,,2018-09-29T12:10:28,true,5,,7,,RUE,DU BOCHET BAS,08500,LES MAZURES,,,08284,,,,,,,,,,,,,,,,,,,2016-12-31,A,,,,,85.51Z,NAFRev2,N,4.628707,49.885148,0.95,housenumber,7 Rue du Bochet Bas 08500 Les Mazures,08284_0005_00007,G,7 RUE DU BOCHET BAS,
382533750,00024,38253375000024,O,2007-10-01,NN,,,2021-02-23T11:10:51,true,4,HAMEAU DES VIEILLES FORGES,,,RUE,DU LAC,08500,LES MAZURES,,,08284,,,,,,,,,,,,,,,,,,,2016-01-31,A,,,,,68.20B,NAFRev2,N,4.590718,49.878829,0.95,street,Rue du Lac 08500 Les Mazures,08284_0023,G,RUE DU LAC,
383388154,00015,38338815400015,O,1991-10-14,NN,,,,true,3,,,,RUE,DU ROCHET HAUT,08500,LES MAZURES,,,08284,,,,,,,,,,,,,,,,,,,1994-12-25,F,,,,,45.4J,NAF1993,N,4.628453,49.890721,0.81,street,Rue du Bochet Haut 08500 Les Mazures,08284_0006,G,RUE DU BOCHET HAUT,
383991924,00010,38399192400010,O,1992-01-01,NN,,,2008-01-04T22:32:17,true,3,,6,,RUE,DU PETIT MARAIS,08500,LES MAZURES,,,08284,,,,,,,,,,,,,,,,,,,2008-01-01,A,,,,,70.10Z,NAFRev2,N,4.623925,49.887736,0.95,housenumber,6 Rue du Petit Marais 08500 Les Mazures,08284_0033_00006,G,6 RUE DU PETIT MARAIS,
384774204,00018,38477420400018,O,1992-02-01,NN,,,2014-08-01T03:53:35,true,3,,,,RUE,DU BOCHET HAUT,08500,LES MAZURES,,,08284,,,,,,,,,,,,,,,,,,,2008-01-01,A,,,,,41.10D,NAFRev2,N,4.628453,49.890721,0.95,street,Rue du Bochet Haut 08500 Les Mazures,08284_0006,G,RUE DU BOCHET HAUT,
384792768,00036,38479276800036,O,1998-06-01,NN,,,2006-11-25T11:46:52,false,4,,29,B,RTE,DE REVIN,08500,LES MAZURES,,,08284,,,,,,,,,,,,,,,,,,,2004-05-31,F,,,,,51.8A,NAFRev1,O,4.625371,49.892011,0.74,housenumber,29bis Route de Revin 08500 Les Mazures,08284_0038_00029_bis,G,29BIS ROUTE DE REVIN,
387695042,00011,38769504200011,O,1992-06-15,NN,,,2006-10-28T01:15:42,true,3,,6,,RUE,DU PETIT MARAIS,08500,LES MAZURES,,,08284,,,,,,,,,,,,,,,,,,,2004-07-22,F,,,,,50.1Z,NAFRev1,N,4.623925,49.887736,0.95,housenumber,6 Rue du Petit Marais 08500 Les Mazures,08284_0033_00006,G,6 RUE DU PETIT MARAIS,
388170219,00025,38817021900025,O,1992-11-01,NN,,,2006-11-25T11:52:02,false,3,,24,,RUE,DES CAPUCINES,08500,LES MAZURES,,,08284,,,,,,,,,,,,,,,,,,,1996-12-27,F,,,,,74.1G,NAF1993,N,4.625888,49.890013,0.95,housenumber,24 Rue des Capucines 08500 Les Mazures,08284_0007_00024,G,24 RUE DES CAPUCINES,
388850802,00017,38885080200017,O,1987-05-01,NN,,,2017-01-15T03:47:16,true,5,,3,,RUE,DU BOCHET BAS,08500,LES MAZURES,,,08284,,,,,,,,,,,,,,,,,,,2017-01-13,F,RUCHER DE MAGALIE,,,,01.49Z,NAFRev2,N,4.628795,49.885617,0.95,housenumber,3 Rue du Bochet Bas 08500 Les Mazures,08284_0005_00003,G,3 RUE DU BOCHET BAS,
388917882,00010,38891788200010,O,,NN,,,,true,1,,14,,RUE,DE LA FONTINETTE,08500,LES MAZURES,,,08284,,,,,,,,,,,,,,,,,,,1995-12-31,F,,,,,02.0A,NAF1993,N,4.626927,49.888623,0.84,street,Rue de la Fontinette 08500 Les Mazures,08284_0012,G,RUE DE LA FONTINETTE,
389005521,00015,38900552100015,O,,,,,,true,1,,12,,RUE,DAINT BERNARD,08500,LES MAZURES,,,08284,,,,,,,,,,,,,,,,,,,1996-12-31,F,,,,,93.0D,NAF1993,N,4.62524,49.888493,0.82,housenumber,12 Rue Saint Bernard 08500 Les Mazures,08284_b110_00012,G,12 RUE SAINT BERNARD,
390901361,00019,39090136100019,O,1992-01-01,NN,,,2020-03-11T19:36:59,true,4,,,,,,08500,LES MAZURES,,,08284,,,,,,,,,,,,,,,,,,,2020-03-31,F,,,,,01.42Z,NAFRev2,N,,,0,,,,,,
392353025,00019,39235302500019,O,1992-01-01,NN,,,2008-01-05T00:03:54,true,3,,,,,LA GRANDE TERRE,08500,LES MAZURES,,,08284,,,,,,,,,,,,,,,,,,,2008-01-01,A,,,,,01.11Z,NAFRev2,N,4.635677,49.887428,0.78,street,Grande Terre 08500 Les Mazures,08284_B049,G,GRANDE TERRE,
393082417,00014,39308241700014,O,1993-12-20,NN,,,,true,1,,2,B,RUE,SAINT BERNARD,08500,LES MAZURES,,,08284,,,,,,,,,,,,,,,,,,,1998-02-28,F,,,,,52.4R,NAF1993,O,4.625783,49.888423,0.83,street,Rue Saint Bernard 08500 Les Mazures,08284_B110,G,RUE SAINT BERNARD,
393881339,00021,39388133900021,O,1996-12-15,,,,,false,3,,2,,RUE,DES HAYETTES,08500,LES MAZURES,,,08284,,,,,,,,,,,,,,,,,,,1998-06-15,F,,,,,80.4C,NAF1993,N,4.626733,49.889836,0.95,housenumber,2 Rue des Hayettes 08500 Les Mazures,08284_0018_00002,G,2 RUE DES HAYETTES,
398397547,00041,39839754700041,O,,NN,,,,true,1,,,,,FERME DE LA GRANDE TERRE,08500,LES MAZURES,,,08284,,,,,,,,,,,,,,,,,,,2003-10-01,F,,,,,02.0D,NAFRev1,N,4.635677,49.887428,0.57,street,Grande Terre 08500 Les Mazures,08284_B049,G,GRANDE TERRE,
399532688,00013,39953268800013,O,1994-10-13,NN,,,2013-11-22T08:27:38,true,4,LES VIEILLES FORGES,,,RUE,DU LAC,08500,LES MAZURES,,,08284,,,,,,,,,,,,,,,,,,,2008-01-01,F,,,,,90.03B,NAFRev2,N,4.590718,49.878829,0.95,street,Rue du Lac 08500 Les Mazures,08284_0023,G,RUE DU LAC,
401011853,00017,40101185300017,O,1995-05-01,00,2019,,2021-10-27T08:27:22,true,8,,,,,ZONE ARTISANALE,08500,LES MAZURES,,,08284,,,,,,,,,,,,,,,,,,,2019-12-19,F,,,,,25.11Z,NAFRev2,N,2.7640352,42.6301915,0.9,poi.retail,Zone Artisanale (Zone commerciale) Thuir,https://osm.org/way/191039530,G,,
402475396,00014,40247539600014,O,1995-05-26,11,2019,,2021-10-27T08:28:45,true,5,CENTRE SOCIAL,,,RUE,DE L'EGLISE,08500,LES MAZURES,,,08284,,,,,,,,,,,,,,,,,,,2021-07-07,A,,,,,88.99B,NAFRev2,O,4.625494,49.888723,0.82,street,Rue du l’Eglise 08500 Les Mazures,08284_0011,G,RUE DU L EGLISE,
402531453,00015,40253145300015,O,1995-10-09,NN,,,2008-11-08T01:13:45,false,4,,4,,RUE,DU MARAIS,08500,LES MAZURES,,,08284,,,,,,,,,,,,,,,,,,,2001-09-10,F,RICHARD RENOVATION,,,,45.4J,NAF1993,N,4.623905,49.887767,0.88,housenumber,4 Rue du Petit Marais 08500 Les Mazures,08284_0033_00004,G,4 RUE DU PETIT MARAIS,
402813000,00013,40281300000013,O,1900-01-01,NN,,,2014-01-21T14:28:09,false,3,,,,RUE,DU LAC,08500,LES MAZURES,,,08284,,,,,,,,,,,,,,,,,,,1997-06-30,F,,,,,85.1G,NAF1993,N,4.590718,49.878829,0.95,street,Rue du Lac 08500 Les Mazures,08284_0023,G,RUE DU LAC,
404001737,00018,40400173700018,O,1995-05-18,NN,,,2008-01-04T20:32:45,true,3,,22,,RUE,DU GENERAL DE GAULLE,08500,LES MAZURES,,,08284,,,,,,,,,,,,,,,,,,,2008-01-01,A,,,,,94.99Z,NAFRev2,N,4.62793,49.886895,0.57,housenumber,22 Rue Charles de Gaulle 08500 Les Mazures,08284_0008_00022,G,22 RUE CHARLES DE GAULLE,
409440534,00090,40944053400090,O,2015-03-31,NN,,,2018-09-29T12:34:09,false,5,,,,,FERME DU PONT DES AULNES,08500,LES MAZURES,,,08284,,,,,,,,,,,,,,,,,,,2017-06-01,F,,,,,55.20Z,NAFRev2,O,,,0,,,,,,