siren,nic,siret,statutDiffusionEtablissement,dateCreationEtablissement,trancheEffectifsEtablissement,anneeEffectifsEtablissement,activitePrincipaleRegistreMetiersEtablissement,dateDernierTraitementEtablissement,etablissementSiege,nombrePeriodesEtablissement,complementAdresseEtablissement,numeroVoieEtablissement,indiceRepetitionEtablissement,typeVoieEtablissement,libelleVoieEtablissement,codePostalEtablissement,libelleCommuneEtablissement,libelleCommuneEtrangerEtablissement,distributionSpecialeEtablissement,codeCommuneEtablissement,codeCedexEtablissement,libelleCedexEtablissement,codePaysEtrangerEtablissement,libellePaysEtrangerEtablissement,complementAdresse2Etablissement,numeroVoie2Etablissement,indiceRepetition2Etablissement,typeVoie2Etablissement,libelleVoie2Etablissement,codePostal2Etablissement,libelleCommune2Etablissement,libelleCommuneEtranger2Etablissement,distributionSpeciale2Etablissement,codeCommune2Etablissement,codeCedex2Etablissement,libelleCedex2Etablissement,codePaysEtranger2Etablissement,libellePaysEtranger2Etablissement,dateDebut,etatAdministratifEtablissement,enseigne1Etablissement,enseigne2Etablissement,enseigne3Etablissement,denominationUsuelleEtablissement,activitePrincipaleEtablissement,nomenclatureActivitePrincipaleEtablissement,caractereEmployeurEtablissement,longitude,latitude,geo_score,geo_type,geo_adresse,geo_id,geo_ligne,geo_l4,geo_l5
180802514,00026,18080251400026,O,1983-03-16,NN,,,2019-11-14T14:00:16,false,4,,15,,RUE,DU CHATEAU B P 5,08000,VILLERS-SEMEUSE,,,08480,,,,,,,,,,,,,,,,,,,2008-01-01,A,SERVICE INFORMATIQUE,,,,74.30Z,NAFRev2,O,,,0,,,,,,
180802514,00034,18080251400034,O,1998-01-01,NN,,,2019-11-14T14:00:16,false,4,,13,,RUE,DU CHATEAU,08000,VILLERS-SEMEUSE,,BP 5,08480,,,,,,,,,,,,,,,,,,,2008-01-01,A,ETABLISSEMENT DEPARTEMENTAL DE L'ELEVAGE,,,,94.11Z,NAFRev2,O,4.753471,49.741105,0.95,housenumber,13 Rue du Chateau 08000 Villers-Semeuse,08480_0100_00013,G,13 RUE DU CHATEAU,
190810010,00016,19081001000016,O,1983-03-01,21,2019,,2021-10-27T08:04:42,true,4,,,,RUE,JULES FERRY,08000,VILLERS-SEMEUSE,,,08480,,,,,,,,,,,,,,,,,,,2009-02-22,A,,,,,85.31Z,NAFRev2,O,4.743198,49.743498,0.95,street,Rue Jules Ferry 08000 Villers-Semeuse,08480_0295,G,RUE JULES FERRY,
210804381,00015,21080438100015,O,1983-03-01,12,2019,,2021-10-27T08:06:37,true,4,,11,,RUE,FERDINANT BUISSON,08000,VILLERS-SEMEUSE,,,08480,,,,,,,,,,,,,,,,,,,2008-01-01,A,MAIRIE,,,,84.11Z,NAFRev2,O,4.746537,49.742421,0.85,housenumber,11 Rue Ferdinand Buisson 08000 Villers-Semeuse,08480_0180_00011,G,11 RUE FERDINAND BUISSON,
210804381,00023,21080438100023,O,1983-12-21,11,2019,,2021-10-27T08:06:37,false,3,,21,,RUE,ROGISSART,08000,VILLERS-SEMEUSE,,,08480,,,,,,,,,,,,,,,,,,,2008-01-01,A,ECOLE PRIMAIRE PUBLIQUE LE CHARME,,,,85.20Z,NAFRev2,N,4.741656,49.745284,0.9,housenumber,21 Rue Jean Rogissart 08000 Villers-Semeuse,08480_0280_00021,G,21 RUE JEAN ROGISSART,
210804381,00031,21080438100031,O,1983-12-21,12,2019,,2021-10-27T08:06:37,false,5,,11,,RUE,FERDINAND BUISSON,08000,VILLERS-SEMEUSE,,,08480,,,,,,,,,,,,,,,,,,,2015-09-01,A,ECOLE ELEMENTAIRE PUBLIQUE LE PLATEAU,,,,85.20Z,NAFRev2,N,4.746537,49.742421,0.96,housenumber,11 Rue Ferdinand Buisson 08000 Villers-Semeuse,08480_0180_00011,G,11 RUE FERDINAND BUISSON,
210804381,00049,21080438100049,O,1983-12-21,02,2019,,2021-10-27T08:06:37,false,3,,6,,RUE,GAMBETTA,08000,VILLERS-SEMEUSE,,,08480,,,,,,,,,,,,,,,,,,,2008-01-01,A,ECOLE MATERNELLE PUBLIQUE PLATEAU,,,,85.10Z,NAFRev2,N,4.750574,49.739396,0.96,housenumber,6 Rue Gambetta 08000 Villers-Semeuse,08480_0220_00006,G,6 RUE GAMBETTA,
210804381,00056,21080438100056,O,1983-12-21,03,2019,,2021-10-27T08:06:37,false,3,,23,,RUE,PIERRE CURIE,08000,VILLERS-SEMEUSE,,,08480,,,,,,,,,,,,,,,,,,,2008-01-01,A,ECOLE PRIMAIRE PUBLIQUE SEMEUSE,,,,85.20Z,NAFRev2,N,4.751847,49.748898,0.96,housenumber,23 Rue Pierre Curie 08000 Villers-Semeuse,08480_0480_00023,G,23 RUE PIERRE CURIE,
210804381,00064,21080438100064,O,1983-12-21,02,2019,,2021-10-27T08:06:37,false,3,,30,,RUE,CHARLES PREVOST,08000,VILLERS-SEMEUSE,,,08480,,,,,,,,,,,,,,,,,,,2008-01-01,A,ECOLE MATERNELLE PUBLIQUE LES CITES,,,,85.10Z,NAFRev2,N,4.739589,49.744321,0.96,housenumber,30 Rue Charles Prévost 08000 Villers-Semeuse,08480_0080_00030,G,30 RUE CHARLES PREVOST,
210804381,00072,21080438100072,O,1996-05-01,NN,,,2019-11-14T14:00:16,false,4,MAIRIE,11,,RUE,FERDINANT BUISSON,08000,VILLERS-SEMEUSE,,,08480,,,,,,,,,,,,,,,,,,,2012-12-25,F,SERVICE DES EAUX,,,,36.00Z,NAFRev2,N,4.746537,49.742421,0.85,housenumber,11 Rue Ferdinand Buisson 08000 Villers-Semeuse,08480_0180_00011,G,11 RUE FERDINAND BUISSON,
210804381,00080,21080438100080,O,1996-05-01,NN,,,2019-11-14T14:00:16,false,4,MAIRIE,11,,RUE,FERDINANT BUISSON,08000,VILLERS-SEMEUSE,,,08480,,,,,,,,,,,,,,,,,,,2012-12-25,F,SERVICE ASSAINISSEMENT,,,,37.00Z,NAFRev2,N,4.746537,49.742421,0.85,housenumber,11 Rue Ferdinand Buisson 08000 Villers-Semeuse,08480_0180_00011,G,11 RUE FERDINAND BUISSON,
220800049,00235,22080004900235,O,1999-08-30,11,2019,,2021-10-27T08:11:34,false,3,,13,,,CROIZAT,08000,VILLERS-SEMEUSE,,,08480,,,,,,,,,,,,,,,,,,,2008-01-01,A,CENTRE MEDICO SOCIAL,,,,88.99B,NAFRev2,N,4.745725,49.743352,0.85,housenumber,13 Rue Ambroise Croizat 08000 Villers-Semeuse,08480_0040_00013,G,13 RUE AMBROISE CROIZAT,
250800919,00012,25080091900012,O,1983-03-01,NN,,,2019-11-14T14:00:16,true,3,MAIRIE,11,,RUE,FERDINANT BUISSON,08000,VILLERS-SEMEUSE,,,08480,,,,,,,,,,,,,,,,,,,2006-06-16,F,,,,,41.0Z,NAFRev1,N,4.746537,49.742421,0.85,housenumber,11 Rue Ferdinand Buisson 08000 Villers-Semeuse,08480_0180_00011,G,11 RUE FERDINAND BUISSON,
260804364,00016,26080436400016,O,1983-03-01,NN,,,2019-11-14T14:00:16,true,3,MAIRIE,11,,RUE,FERDINANT BUISSON,08000,VILLERS-SEMEUSE,,,08480,,,,,,,,,,,,,,,,,,,2008-01-01,A,CCAS,,,,88.99B,NAFRev2,N,4.746537,49.742421,0.85,housenumber,11 Rue Ferdinand Buisson 08000 Villers-Semeuse,08480_0180_00011,G,11 RUE FERDINAND BUISSON,
270800311,00010,27080031100010,O,,,,,2019-11-14T14:00:16,true,1,,,,,,08000,VILLERS-SEMEUSE,,,08480,,,,,,,,,,,,,,,,,,,1995-12-25,F,,,,,90.0A,NAF1993,N,,,0,,,,,,
270802432,00012,27080243200012,O,,,,,2019-11-14T14:00:16,true,1,,,,,MAIRIE,08000,VILLERS-SEMEUSE,,,08480,,,,,,,,,,,,,,,,,,,1995-12-25,F,,,,,41.0Z,NAF1993,N,4.751849,49.748589,0.4,street,Rue Pierre Curie 08000 Villers-Semeuse,08480_0480,G,RUE PIERRE CURIE,
300515038,00051,30051503800051,O,,NN,,,2019-11-14T14:00:16,true,1,,,,,,08000,VILLERS-SEMEUSE,,,08480,,,,,,,,,,,,,,,,,,,1995-03-31,F,,,,,52.4Z,NAF1993,O,,,0,,,,,,
301058343,00023,30105834300023,O,2004-10-18,,,,2019-11-14T14:00:16,false,3,CLINIQUE DU DR L'HOSTE,33,,AV,JEAN JAURES,08000,VILLERS-SEMEUSE,,,08480,,,,,,,,,,,,,,,,,,,2004-12-25,F,,,,,85.1C,NAFRev1,N,4.743672,49.741227,0.86,housenumber,33 Avenue Jean Jaurés 08000 Villers-Semeuse,08480_0260_00033,G,33 AVENUE JEAN JAURES,
302752258,00020,30275225800020,O,1900-01-01,NN,,,2019-11-14T14:00:16,true,6,,17,,RUE,DU CHATEAU,08000,VILLERS-SEMEUSE,,,08480,08013,CHARLEVILLE MEZIERES CEDEX,,,,,,,,,,,,,,,,,2010-01-01,F,,,,,01.62Z,NAFRev2,O,4.753778,49.742626,0.95,housenumber,17 Rue du Chateau 08000 Villers-Semeuse,08480_0100_00017,G,17 RUE DU CHATEAU,
302752274,00035,30275227400035,O,1993-11-27,NN,,,2019-11-14T14:00:16,true,3,,71,,AV,JEAN JAURES,08000,VILLERS-SEMEUSE,,,08480,,,,,,,,,,,,,,,,,,,2008-01-01,A,,,,,01.62Z,NAFRev2,N,4.741017,49.742339,0.86,housenumber,71 Avenue Jean Jaurés 08000 Villers-Semeuse,08480_0260_00071,G,71 AVENUE JEAN JAURES,
302752381,00020,30275238100020,O,1900-01-01,,,,2019-11-14T14:00:16,false,4,,,,RUE,DU CHATEAU,08000,VILLERS-SEMEUSE,,BP 5,08480,,,,,,,,,,,,,,,,,,,2008-01-01,A,,,,,71.20B,NAFRev2,N,4.753769,49.741156,0.95,street,Rue du Chateau 08000 Villers-Semeuse,08480_0100,G,RUE DU CHATEAU,
303324008,00026,30332400800026,O,1975-01-01,NN,,,2019-11-14T14:00:16,true,7,,1,B,RUE,CAMILLE DIDIER,08000,VILLERS-SEMEUSE,,,08480,,,,,,,,,,,,,,,,,,,2009-02-15,F,,,,,70.10Z,NAFRev2,N,4.739104,49.741437,0.87,housenumber,1bis Rue Camille Didier 08000 Villers-Semeuse,08480_0075_00001_bis,G,1BIS RUE CAMILLE DIDIER,
303529622,00027,30352962200027,O,,NN,,,2019-11-14T14:00:16,true,1,,6,,RUE,JULES LOBET,08000,VILLERS-SEMEUSE,,,08480,,,,,,,,,,,,,,,,,,,1995-12-25,F,,,,,70.2C,NAF1993,N,4.740173,49.74747,0.96,housenumber,6 Rue Jules Lobet 08000 Villers-Semeuse,08480_0340_00006,G,6 RUE JULES LOBET,
303997480,00015,30399748000015,O,1900-01-01,NN,,,2019-11-14T14:00:16,true,5,,,,RUE,DU CHATEAU,08000,VILLERS-SEMEUSE,,,08480,,,,,,,,,,,,,,,,,,,2008-01-01,F,,,,,94.11Z,NAFRev2,O,4.753769,49.741156,0.95,street,Rue du Chateau 08000 Villers-Semeuse,08480_0100,G,RUE DU CHATEAU,
304581127,00038,30458112700038,O,,NN,,,2019-11-14T14:00:16,true,1,,1,B,RUE,CAMILLE DIDIER,08000,VILLERS-SEMEUSE,,,08480,,,,,,,,,,,,,,,,,,,1994-07-30,F,,,,,74.1J,NAF1993,N,4.739104,49.741437,0.87,housenumber,1bis Rue Camille Didier 08000 Villers-Semeuse,08480_0075_00001_bis,G,1BIS RUE CAMILLE DIDIER,
304854011,00018,30485401100018,O,,NN,,,2021-12-24T09:04:54,true,1,,112,,RUE,JEAN BAPTISTE CLEMENT,08000,VILLERS-SEMEUSE,,,08480,,,,,,,,,,,,,,,,,,,1988-12-25,F,,,,,64.14,NAP,N,4.739919,49.75014,0.96,housenumber,112 Rue Jean-Baptiste Clément 08000 Villers-Semeuse,08480_0240_00112,G,112 RUE JEAN BAPTISTE CLEMENT,
304901713,00012,30490171300012,O,1963-01-01,NN,,,2019-11-14T14:00:16,false,3,,26,,AV,JEAN JAURES,08000,VILLERS-SEMEUSE,,,08480,,,,,,,,,,,,,,,,,,,2008-01-01,A,,,,,68.20B,NAFRev2,N,4.744924,49.740822,0.86,housenumber,26 Avenue Jean Jaurés 08000 Villers-Semeuse,08480_0260_00026,G,26 AVENUE JEAN JAURES,
304955644,00022,30495564400022,O,1900-01-01,,,,2019-11-14T14:00:16,false,4,,87,,RTE,NATIONALE,08000,VILLERS-SEMEUSE,,,08480,,,,,,,,,,,,,,,,,,,2004-12-31,F,,,,,93.0D,NAFRev1,N,4.737874,49.742762,0.84,housenumber,87 Route Nationale 08000 Villers-Semeuse,08480_0420_00087,G,87 ROUTE NATIONALE,
305492845,00022,30549284500022,O,1994-06-06,NN,,,2019-11-14T14:00:16,false,4,ZI,,,RTE,DES AYVELLES,08000,VILLERS-SEMEUSE,,,08480,,,,,,,,,,,,,,,,,,,1995-12-25,F,DOMAINE SOL ET MUR,,,,52.4U,NAF1993,O,4.740274,49.740138,0.45,street,Rue des Erables 08000 Villers-Semeuse,08480_0145,G,RUE DES ERABLES,
305495541,00016,30549554100016,O,,NN,,,2019-11-14T14:00:16,true,1,,100,,RUE,JULES GUESDE,08000,VILLERS-SEMEUSE,,,08480,,,,,,,,,,,,,,,,,,,,F,,,,,60.09,NAP,N,4.740072,49.74718,0.96,housenumber,100 Rue Jules Guesde 08000 Villers-Semeuse,08480_0300_00100,G,100 RUE JULES GUESDE,
306251471,00034,30625147100034,O,1992-08-16,NN,,,2019-11-14T14:00:16,false,4,,2,,RUE,CHARLES PREVOST,08000,VILLERS-SEMEUSE,,,08480,,,,,,,,,,,,,,,,,,,1995-10-31,F,,,,,85.1G,NAF1993,N,4.737167,49.744931,0.96,housenumber,2 Rue Charles Prévost 08000 Villers-Semeuse,08480_0080_00002,G,2 RUE CHARLES PREVOST,
306251471,00042,30625147100042,O,1995-10-31,NN,,,2019-11-14T14:00:16,false,4,,1,,RUE,AMBROISE CROIZAT,08000,VILLERS-SEMEUSE,,,08480,,,,,,,,,,,,,,,,,,,2010-01-31,F,,,,,86.90D,NAFRev2,N,4.746035,49.742413,0.96,housenumber,1 Rue Ambroise Croizat 08000 Villers-Semeuse,08480_0040_00001,G,1 RUE AMBROISE CROIZAT,
306312992,00010,30631299200010,O,,NN,,,2019-11-14T14:00:16,true,1,,,,,MAIRIE,08000,VILLERS-SEMEUSE,,,08480,,,,,,,,,,,,,,,,,,,1989-12-25,F,,,,,96.25,NAP,N,4.751849,49.748589,0.4,street,Rue Pierre Curie 08000 Villers-Semeuse,08480_0480,G,RUE PIERRE CURIE,
306389255,00036,30638925500036,O,1983-05-05,NN,,,2019-11-14T14:00:16,false,3,,56,,AV,JEAN-JAURES,08000,VILLERS-SEMEUSE,,,08480,,,,,,,,,,,,,,,,,,,2002-07-15,F,,,,,85.1E,NAF1993,N,4.740151,49.742872,0.86,housenumber,56 Avenue Jean Jaurés 08000 Villers-Semeuse,08480_0260_00056,G,56 AVENUE JEAN JAURES,
306424649,00011,30642464900011,O,1900-01-01,NN,,,2019-11-14T14:00:16,true,3,,,,,MAIRIE,08000,VILLERS-SEMEUSE,,,08480,,,,,,,,,,,,,,,,,,,2008-01-01,A,,,,,93.12Z,NAFRev2,N,4.751849,49.748589,0.4,street,Rue Pierre Curie 08000 Villers-Semeuse,08480_0480,G,RUE PIERRE CURIE,
306447426,00041,30644742600041,O,2020-09-05,,,,2021-09-15T19:38:41,true,1,,7,,RUE,JULES ROCIPON,08000,VILLERS-SEMEUSE,,,08480,,,,,,,,,,,,,,,,,,,2020-09-05,A,,,,,93.12Z,NAFRev2,N,4.745104,49.747199,0.95,housenumber,7 Rue Jules Rocipon 08000 Villers-Semeuse,08480_0348_00007,G,7 RUE JULES ROCIPON,
306625898,00011,30662589800011,O,,NN,,,2019-11-14T14:00:16,true,1,,33,,AV,JEAN JAURES,08000,VILLERS-SEMEUSE,,,08480,,,,,,,,,,,,,,,,,,,,F,,,,,84.10,NAP,N,4.743672,49.741227,0.86,housenumber,33 Avenue Jean Jaurés 08000 Villers-Semeuse,08480_0260_00033,G,33 AVENUE JEAN JAURES,
307339705,00021,30733970500021,O,,NN,,,2019-11-14T14:00:16,true,1,,,,,CENTRE COMM LES AYVELLES,08000,VILLERS-SEMEUSE,,,08480,,,,,,,,,,,,,,,,,,,1989-03-31,F,,,,,64.46,NAP,N,6.4895945,43.451254,0.67,poi.mall,(Galerie marchande) Les Arcs,https://osm.org/way/266407136,G,,
308011097,00018,30801109700018,O,,,,,2019-11-14T14:00:16,true,1,,,,,CENT COMM DES AYVELLES,08000,VILLERS-SEMEUSE,,,08480,,,,,,,,,,,,,,,,,,,1984-12-25,F,,,,,64.47,NAP,N,2.3754641,48.9867916,0.65,poi.mall,(Galerie marchande) Sarcelles,https://osm.org/way/143323622,G,,
308396852,00151,30839685200151,O,2000-01-01,01,2019,,2021-10-27T08:16:27,false,3,,27,,RUE,DU CHATEAU,08000,VILLERS-SEMEUSE,,,08480,,,,,,,,,,,,,,,,,,,2008-01-01,A,,,,,37.00Z,NAFRev2,O,4.756531,49.741247,0.95,housenumber,27 Rue du Chateau 08000 Villers-Semeuse,08480_0100_00027,G,27 RUE DU CHATEAU,
308449024,07738,30844902407738,O,1989-10-14,NN,,,2019-11-14T14:00:16,false,4,LOT LE PRE DES TERRES LOT,,,CHE,DEPARTEMENTAL 764,08000,VILLERS-SEMEUSE,,,08480,,,,,,,,,,,,,,,,,,,1998-03-02,F,LA HALLE AUX CHAUSSURES,,,,52.4E,NAF1993,N,4.750812,49.732183,0.47,locality,Le Pre des Terres 08000 Villers-Semeuse,08480_B063,D,LE PRE DES TERRES,
308449024,15806,30844902415806,O,1997-08-28,,,,2019-11-14T14:00:16,false,3,MAGASIN NO 8109,,,,CTRE COMM DES AYVELLES,08000,VILLERS-SEMEUSE,,,08480,,,,,,,,,,,,,,,,,,,1998-03-02,F,LA HALLE AUX VETEMENTS,,,,52.4E,NAF1993,N,2.3754641,48.9867916,0.65,poi.mall,(Galerie marchande) Sarcelles,https://osm.org/way/143323622,G,,
308639012,00043,30863901200043,O,2001-01-01,NN,,,2019-11-14T14:00:16,false,4,,8,,RUE,JEAN ROGISSART,08000,VILLERS-SEMEUSE,,,08480,,,,,,,,,,,,,,,,,,,2003-01-01,F,,,,,45.3A,NAF1993,O,4.740058,49.744942,0.96,housenumber,8 Rue Jean Rogissart 08000 Villers-Semeuse,08480_0280_00008,G,8 RUE JEAN ROGISSART,
309022119,00031,30902211900031,O,,NN,,,2019-11-14T14:00:16,true,1,,,,,CTRE COMMERCIAL DES AYVELL,08000,VILLERS-SEMEUSE,,,08480,,,,,,,,,,,,,,,,,,,1993-12-30,F,,,,,74.1E,NAF1993,N,1.9559656,43.2987981,0.53,poi.mall,Galerie Marchandes Castelnaudary,https://osm.org/way/213131694,G,,
309177095,00010,30917709500010,O,,NN,,,2019-11-14T14:00:16,true,1,,,,,CLINIQUE L HOSTE,08000,VILLERS-SEMEUSE,,,08480,,,,,,,,,,,,,,,,,,,1988-12-25,F,,,,,84.10,NAP,N,4.746506,49.743806,0.52,street,Rue du Docteur l’Hoste 08000 Villers-Semeuse,08480_0110,G,RUE DU DOCTEUR L HOSTE,
309496230,00504,30949623000504,O,1995-10-01,NN,,,2019-11-14T14:00:16,false,3,,4,,RUE,JEAN BAPTISTE CLEMENT,08000,VILLERS-SEMEUSE,,,08480,,,,,,,,,,,,,,,,,,,1996-04-01,F,,,,,74.6Z,NAF1993,O,4.74938,49.749105,0.96,housenumber,4 Rue Jean-Baptiste Clément 08000 Villers-Semeuse,08480_0240_00004,G,4 RUE JEAN BAPTISTE CLEMENT,
309686970,01131,30968697001131,O,2000-07-31,NN,,,2019-11-14T14:00:16,false,5,,4,,RUE,JEAN BAPTISTE CLEMENT,08000,VILLERS-SEMEUSE,,,08480,,,,,,,,,,,,,,,,,,,2008-01-01,A,,,,,68.20B,NAFRev2,N,4.74938,49.749105,0.96,housenumber,4 Rue Jean-Baptiste Clément 08000 Villers-Semeuse,08480_0240_00004,G,4 RUE JEAN BAPTISTE CLEMENT,
309917417,00011,30991741700011,O,,,,,2019-11-14T14:00:16,true,1,,,,,CENTRE COMMERCIAL AYVELLES,08000,VILLERS-SEMEUSE,,,08480,,,,,,,,,,,,,,,,,,,1989-05-31,F,,,,,65.01,NAP,N,2.3754641,48.9867916,0.6,poi.mall,(Galerie marchande) Sarcelles,https://osm.org/way/143323622,G,,
310146170,00025,31014617000025,O,1989-04-13,NN,,,2019-11-14T14:00:16,true,3,,,,,CENTRE COMMERCIAL DES AYVE,08000,VILLERS-SEMEUSE,,,08480,,,,,,,,,,,,,,,,,,,2008-01-01,A,,,,,68.20B,NAFRev2,N,4.955779,45.9281763,0.64,poi.mall,Centre Commercial Les Millières (Galerie marchande) Saint-André-de-Corcy,https://osm.org/way/78176504,G,,
310214929,00013,31021492900013,O,1900-01-01,NN,,,2019-11-14T14:00:16,false,5,,21,,AV,JEAN JAURES,08000,VILLERS-SEMEUSE,,,08480,,,,,,,,,,,,,,,,,,,2010-10-21,F,,,,,86.21Z,NAFRev2,O,4.74564,49.7404,0.86,housenumber,21 Avenue Jean Jaurés 08000 Villers-Semeuse,08480_0260_00021,G,21 AVENUE JEAN JAURES,
310238969,00557,31023896900557,O,1988-01-30,NN,,,2019-11-14T14:00:16,false,4,ZONE INDUST LES AYVELLES,,,,,08000,VILLERS-SEMEUSE,,,08480,,,,,,,,,,,,,,,,,,,1999-08-15,F,VETAPRIX,,,,52.4C,NAF1993,N,,,0,,,,,,
310578638,00036,31057863800036,O,1986-02-01,11,2019,,2021-10-27T08:17:14,true,4,ZONE COMMERCIALE DES AYVEL,,,RTE,N 64,08000,VILLERS-SEMEUSE,,,08480,,,,,,,,,,,,,,,,,,,2008-01-01,A,,,,,46.73A,NAFRev2,O,4.738479,49.742806,0.32,street,Route Nationale 08000 Villers-Semeuse,08480_0420,G,ROUTE NATIONALE,
311244404,00100,31124440400100,O,1994-12-30,,,,2019-11-14T14:00:16,true,2,,,,,ZAC DES AYVELLES,08000,VILLERS-SEMEUSE,,,08480,,,,,,,,,,,,,,,,,,,1997-01-24,F,,,,,52.4C,NAF1993,N,,,0,,,,,,
311549240,00720,31154924000720,O,2000-10-01,NN,,,2019-11-14T14:00:16,false,4,,,,,ZAC DES AYVELLES,08000,VILLERS-SEMEUSE,,,08480,,,,,,,,,,,,,,,,,,,2013-06-19,F,FABIO LUCCI,,,,47.71Z,NAFRev2,O,,,0,,,,,,
311591192,00019,31159119200019,O,,,,,2019-11-14T14:00:16,true,1,,,,AV,JEAN JAURES,08000,VILLERS-SEMEUSE,,,08480,,,,,,,,,,,,,,,,,,,1984-12-25,F,,,,,84.10,NAP,N,4.742281,49.741836,0.84,street,Avenue Jean Jaurés 08000 Villers-Semeuse,08480_0260,G,AVENUE JEAN JAURES,
312141336,00064,31214133600064,O,2006-09-01,,,,2019-11-14T14:00:16,false,2,,,,,ZI LES AYVELLES,08000,VILLERS-SEMEUSE,,,08480,,,,,,,,,,,,,,,,,,,2008-01-01,A,,,,,71.12B,NAFRev2,N,,,0,,,,,,
312470594,00010,31247059400010,O,,,,,2019-11-14T14:00:16,true,1,,9,,RUE,PASTEUR,08000,VILLERS-SEMEUSE,,,08480,,,,,,,,,,,,,,,,,,,1985-12-25,F,,,,,81.21,NAP,N,4.749707,49.738668,0.95,housenumber,9 Rue Pasteur 08000 Villers-Semeuse,08480_0440_00009,G,9 RUE PASTEUR,
313055295,00015,31305529500015,O,,NN,,,2019-11-14T14:00:16,true,1,,106,,AV,JEAN JAURES,08000,VILLERS-SEMEUSE,,,08480,,,,,,,,,,,,,,,,,,,1986-02-12,F,,,,,81.11,NAP,N,4.742281,49.741836,0.66,street,Avenue Jean Jaurés 08000 Villers-Semeuse,08480_0260,G,AVENUE JEAN JAURES,
313226557,00012,31322655700012,O,,,,,2019-11-14T14:00:16,true,1,,10,,RUE,FERDINAND BUISSON,08000,VILLERS-SEMEUSE,,,08480,,,,,,,,,,,,,,,,,,,1984-12-25,F,,,,,67.05,NAP,N,4.746072,49.742266,0.96,housenumber,10 Rue Ferdinand Buisson 08000 Villers-Semeuse,08480_0180_00010,G,10 RUE FERDINAND BUISSON,
313412686,00047,31341268600047,O,2016-06-16,,,,2021-01-15T03:36:53,true,2,,1,B,RUE,CAMILLE DIDIER,08000,VILLERS-SEMEUSE,,,08480,,,,,,,,,,,,,,,,,,,2020-11-20,F,,,,,68.20B,NAFRev2,N,4.739104,49.741437,0.87,housenumber,1bis Rue Camille Didier 08000 Villers-Semeuse,08480_0075_00001_bis,G,1BIS RUE CAMILLE DIDIER,
314285255,00027,31428525500027,O,2001-09-26,NN,,,2019-11-14T14:00:16,true,4,,29,,AV,JEAN JAURES,08000,VILLERS-SEMEUSE,,,08480,,,,,,,,,,,,,,,,,,,2003-05-31,F,,,,,74.1J,NAFRev1,N,4.744538,49.740839,0.86,housenumber,29 Avenue Jean Jaurés 08000 Villers-Semeuse,08480_0260_00029,G,29 AVENUE JEAN JAURES,
314330358,00024,31433035800024,O,,NN,,,2019-11-14T14:00:16,true,1,,32,,RUE,JULES LOBET,08000,VILLERS-SEMEUSE,,,08480,,,,,,,,,,,,,,,,,,,1990-12-31,F,,,,,64.48,NAP,N,4.738218,49.746144,0.96,housenumber,32 Rue Jules Lobet 08000 Villers-Semeuse,08480_0340_00032,G,32 RUE JULES LOBET,
314358078,00025,31435807800025,O,1900-01-01,,,,2019-11-14T14:00:16,false,4,,,,RTE,N 6 CENT COMMERC CORA,08000,VILLERS-SEMEUSE,,,08480,,,,,,,,,,,,,,,,,,,1994-12-25,F,,,,,93.0B,NAF1993,N,,,0,,,,,,
314515206,00360,31451520600360,O,1996-10-31,03,2019,,2021-10-27T08:18:54,false,4,ZI,,,RTE,DES AYVELLES,08000,VILLERS-SEMEUSE,,,08480,,,,,,,,,,,,,,,,,,,2008-02-11,A,DEVIANNE,,,,47.71Z,NAFRev2,O,4.740274,49.740138,0.45,street,Rue des Erables 08000 Villers-Semeuse,08480_0145,G,RUE DES ERABLES,
315623868,00025,31562386800025,O,1983-01-01,NN,,,2019-11-14T14:00:16,true,3,,,,,CENTRE COMMERCIAL LES AYVE,08000,VILLERS-SEMEUSE,,,08480,,,,,,,,,,,,,,,,,,,2007-06-30,F,,,,,52.2P,NAFRev1,N,4.955779,45.9281763,0.69,poi.mall,Centre Commercial Les Millières (Galerie marchande) Saint-André-de-Corcy,https://osm.org/way/78176504,G,,
316361807,00027,31636180700027,O,1985-07-24,NN,,,2019-11-14T14:00:16,true,4,,56,,AV,JEAN JAURES,08000,VILLERS-SEMEUSE,,,08480,,,,,,,,,,,,,,,,,,,2011-12-31,F,,,,,86.90D,NAFRev2,N,4.740151,49.742872,0.86,housenumber,56 Avenue Jean Jaurés 08000 Villers-Semeuse,08480_0260_00056,G,56 AVENUE JEAN JAURES,
316916246,00036,31691624600036,O,1981-10-01,NN,,,2019-11-14T14:00:16,false,4,ZI,,,RTE,DES AYVELLES,08000,VILLERS-SEMEUSE,,,08480,,,,,,,,,,,,,,,,,,,1996-12-25,F,DEVIANNE,,,,52.4C,NAF1993,O,4.740274,49.740138,0.45,street,Rue des Erables 08000 Villers-Semeuse,08480_0145,G,RUE DES ERABLES,
316986389,00039,31698638900039,O,1997-03-19,,,,2019-11-14T14:00:16,false,3,ZAC DES AYVELLES,,,,,08000,VILLERS-SEMEUSE,,,08480,,,,,,,,,,,,,,,,,,,1997-12-25,F,ANTIC GALERIE,,,,52.5Z,NAF1993,N,,,0,,,,,,
317455459,00014,31745545900014,O,,NN,,,2019-11-14T14:00:16,true,1,,7,,RUE,MAYOT,08000,VILLERS-SEMEUSE,,,08480,,,,,,,,,,,,,,,,,,,1987-10-01,F,,,,,64.43,NAP,N,4.749381,49.747915,0.86,housenumber,7 Rue Roger Mayot 08000 Villers-Semeuse,08480_0486_00007,G,7 RUE ROGER MAYOT,
317558500,00011,31755850000011,O,,NN,,,2019-11-14T14:00:16,true,1,,83,,AV,JEAN JAURES,08000,VILLERS-SEMEUSE,,,08480,,,,,,,,,,,,,,,,,,,1990-03-31,F,,,,,84.12,NAP,N,4.739413,49.743053,0.86,housenumber,83 Avenue Jean Jaurés 08000 Villers-Semeuse,08480_0260_00083,G,83 AVENUE JEAN JAURES,
317838373,00023,31783837300023,O,1980-06-01,NN,,,2019-11-14T14:00:16,false,5,,,,,CENTRE COMM LES AYVELLES,08000,VILLERS-SEMEUSE,,BP 567,08480,,,,,,,,,,,,,,,,,,,2008-04-04,F,,,,,45.11Z,NAFRev2,O,6.4895945,43.451254,0.67,poi.mall,(Galerie marchande) Les Arcs,https://osm.org/way/266407136,G,,
318021714,00015,31802171400015,O,1900-01-01,,,,2019-11-14T14:00:16,true,4,,69,,AV,JEAN JAURES,08000,VILLERS-SEMEUSE,,,08480,,,,,,,,,,,,,,,,,,,1992-12-25,F,,,,,50.1Z,NAF1993,N,4.741048,49.742157,0.86,housenumber,69 Avenue Jean Jaurés 08000 Villers-Semeuse,08480_0260_00069,G,69 AVENUE JEAN JAURES,
318518719,00055,31851871900055,O,2009-09-01,NN,,,2019-11-14T14:00:16,false,3,,52,,AV,JEAN JAURES,08000,VILLERS-SEMEUSE,,,08480,,,,,,,,,,,,,,,,,,,2013-01-01,F,,,,,66.22Z,NAFRev2,O,4.740375,49.742776,0.86,housenumber,52 Avenue Jean Jaurés 08000 Villers-Semeuse,08480_0260_00052,G,52 AVENUE JEAN JAURES,
318556800,00049,31855680000049,O,1991-07-01,NN,,,2019-11-14T14:00:16,false,5,,,,RUE,LOUISE MICHEL,08000,VILLERS-SEMEUSE,,,08480,,,,,,,,,,,,,,,,,,,2003-06-30,F,RELAIS MERCURE CHARLEILLE-MEZIERES,,,,70.2C,NAFRev1,N,4.745396,49.737731,0.96,street,Rue Louise Michel 08000 Villers-Semeuse,08480_0360,G,RUE LOUISE MICHEL,
318745148,00011,31874514800011,O,1900-01-01,NN,,,2019-11-14T14:00:16,false,6,,,,,CENT COMM CORA RN 64,08000,VILLERS-SEMEUSE,,,08480,,,,,,,,,,,,,,,,,,,2009-02-01,F,,,,,47.77Z,NAFRev2,N,4.0534607,49.2148401,0.62,poi.mall,Centre Commercial Cora Cormontreuil (Galerie marchande) Cormontreuil,https://osm.org/way/86582185,G,,
318763802,00028,31876380200028,O,1990-09-01,NN,,,2019-11-14T14:00:16,true,5,,32,B,RUE,JULES LOBET,08000,VILLERS-SEMEUSE,,,08480,,,,,,,,,,,,,,,,,,,2013-06-30,F,,,,,43.21A,NAFRev2,O,4.738449,49.746303,0.87,housenumber,32bis Rue Jules Lobet 08000 Villers-Semeuse,08480_0340_00032_bis,G,32BIS RUE JULES LOBET,
319368577,00049,31936857700049,O,1989-02-01,NN,,,2019-11-14T14:00:16,true,5,,5,,RUE,J LOBET,08000,VILLERS-SEMEUSE,,,08480,,,,,,,,,,,,,,,,,,,2013-07-18,F,,,,,43.32B,NAFRev2,N,4.740904,49.747838,0.83,housenumber,5 Rue Jules Lobet 08000 Villers-Semeuse,08480_0340_00005,G,5 RUE JULES LOBET,
319724019,00017,31972401900017,O,,,,,2019-11-14T14:00:16,true,1,,7,,RUE,PASTEUR,08000,VILLERS-SEMEUSE,,,08480,,,,,,,,,,,,,,,,,,,,F,,,,,38.40,NAP,N,4.749799,49.738772,0.95,housenumber,7 Rue Pasteur 08000 Villers-Semeuse,08480_0440_00007,G,7 RUE PASTEUR,