siren,nic,siret,statutDiffusionEtablissement,dateCreationEtablissement,trancheEffectifsEtablissement,anneeEffectifsEtablissement,activitePrincipaleRegistreMetiersEtablissement,dateDernierTraitementEtablissement,etablissementSiege,nombrePeriodesEtablissement,complementAdresseEtablissement,numeroVoieEtablissement,indiceRepetitionEtablissement,typeVoieEtablissement,libelleVoieEtablissement,codePostalEtablissement,libelleCommuneEtablissement,libelleCommuneEtrangerEtablissement,distributionSpecialeEtablissement,codeCommuneEtablissement,codeCedexEtablissement,libelleCedexEtablissement,codePaysEtrangerEtablissement,libellePaysEtrangerEtablissement,complementAdresse2Etablissement,numeroVoie2Etablissement,indiceRepetition2Etablissement,typeVoie2Etablissement,libelleVoie2Etablissement,codePostal2Etablissement,libelleCommune2Etablissement,libelleCommuneEtranger2Etablissement,distributionSpeciale2Etablissement,codeCommune2Etablissement,codeCedex2Etablissement,libelleCedex2Etablissement,codePaysEtranger2Etablissement,libellePaysEtranger2Etablissement,dateDebut,etatAdministratifEtablissement,enseigne1Etablissement,enseigne2Etablissement,enseigne3Etablissement,denominationUsuelleEtablissement,activitePrincipaleEtablissement,nomenclatureActivitePrincipaleEtablissement,caractereEmployeurEtablissement,longitude,latitude,geo_score,geo_type,geo_adresse,geo_id,geo_ligne,geo_l4,geo_l5
212505713,00017,21250571300017,O,1983-03-01,03,2019,,2021-10-27T08:07:28,true,4,MAIRIE,2,,RUE,DE L'EGLISE,25470,TREVILLERS,,,25571,,,,,,,,,,,,,,,,,,,2008-01-01,A,,,,,84.11Z,NAFRev2,O,6.867115,47.282065,0.94,housenumber,2 Rue de l’Eglise 25470 Trévillers,25571_0041_00002,G,2 RUE DE L EGLISE,
212505713,00025,21250571300025,O,1983-12-21,03,2019,,2021-10-27T08:07:28,false,3,,6,,RUE,DE L EGLISE,25470,TREVILLERS,,,25571,,,,,,,,,,,,,,,,,,,2008-01-01,A,ECOLE PRIMAIRE PUBLIQUE,,,,85.20Z,NAFRev2,N,6.866644,47.281691,0.94,housenumber,6 Rue de l’Eglise 25470 Trévillers,25571_0041_00006,G,6 RUE DE L EGLISE,
212505713,00033,21250571300033,O,1996-12-25,NN,,,2008-01-04T18:29:19,false,2,MAIRIE,2,,RUE,DE L'EGLISE,25470,TREVILLERS,,,25571,,,,,,,,,,,,,,,,,,,2008-01-01,A,SERVICE EAU,,,,36.00Z,NAFRev2,N,6.867115,47.282065,0.94,housenumber,2 Rue de l’Eglise 25470 Trévillers,25571_0041_00002,G,2 RUE DE L EGLISE,
212505713,00041,21250571300041,O,1996-12-25,NN,,,2008-01-04T18:29:19,false,2,MAIRIE,2,,RUE,DE L'EGLISE,25470,TREVILLERS,,,25571,,,,,,,,,,,,,,,,,,,2008-01-01,A,SERVICE ASSAINISSEMENT,,,,37.00Z,NAFRev2,N,6.867115,47.282065,0.94,housenumber,2 Rue de l’Eglise 25470 Trévillers,25571_0041_00002,G,2 RUE DE L EGLISE,
212505713,00058,21250571300058,O,1997-12-01,NN,,,2008-01-04T18:29:19,false,3,MAIRIE,2,,RUE,DE L'EGLISE,25470,TREVILLERS,,,25571,,,,,,,,,,,,,,,,,,,2008-01-01,A,SERVICE LOTISSEMENT,,,,42.99Z,NAFRev2,N,6.867115,47.282065,0.94,housenumber,2 Rue de l’Eglise 25470 Trévillers,25571_0041_00002,G,2 RUE DE L EGLISE,
212505713,00066,21250571300066,O,1998-01-01,NN,,,2016-01-12T00:10:26,false,3,MAIRIE,2,,RUE,DE L'EGLISE,25470,TREVILLERS,,,25571,,,,,,,,,,,,,,,,,,,2008-01-01,A,SERVICE FORETS,,,,02.20Z,NAFRev2,N,6.867115,47.282065,0.94,housenumber,2 Rue de l’Eglise 25470 Trévillers,25571_0041_00002,G,2 RUE DE L EGLISE,
212505713,00074,21250571300074,O,1998-01-01,NN,,,2008-01-04T18:29:19,false,3,MAIRIE,2,,RUE,DE L'EGLISE,25470,TREVILLERS,,,25571,,,,,,,,,,,,,,,,,,,2008-01-01,A,SERVICE DISTILLATION,,,,42.99Z,NAFRev2,N,6.867115,47.282065,0.94,housenumber,2 Rue de l’Eglise 25470 Trévillers,25571_0041_00002,G,2 RUE DE L EGLISE,
212505713,00082,21250571300082,O,1999-01-01,NN,,,2008-01-04T18:29:19,false,4,MAIRIE,2,,RUE,DE L'EGLISE,25470,TREVILLERS,,,25571,,,,,,,,,,,,,,,,,,,2008-01-01,A,LOGEMENTS SOCIAUX,,,,68.20A,NAFRev2,N,6.867115,47.282065,0.94,housenumber,2 Rue de l’Eglise 25470 Trévillers,25571_0041_00002,G,2 RUE DE L EGLISE,
212505713,00090,21250571300090,O,2001-12-25,NN,,,2013-10-05T12:18:47,false,4,MAIRIE,2,,RUE,DE L'EGLISE,25470,TREVILLERS,,,25571,,,,,,,,,,,,,,,,,,,2012-12-25,F,SCE LOTISSEMENT LE CALVAIRE,,,,42.99Z,NAFRev2,N,6.867115,47.282065,0.94,housenumber,2 Rue de l’Eglise 25470 Trévillers,25571_0041_00002,G,2 RUE DE L EGLISE,
212505713,00108,21250571300108,O,2003-01-01,NN,,,2013-10-05T12:18:47,false,5,MAIRIE,2,,RUE,DE L'EGLISE,25470,TREVILLERS,,,25571,,,,,,,,,,,,,,,,,,,2012-12-25,F,LOTISSEMENT LE CALVAIRE 2EME TRANCH,,,,42.99Z,NAFRev2,N,6.867115,47.282065,0.94,housenumber,2 Rue de l’Eglise 25470 Trévillers,25571_0041_00002,G,2 RUE DE L EGLISE,
242504314,00012,24250431400012,O,2000-12-19,,,,2011-04-23T04:18:23,false,4,,,,,MAIRIE,25470,TREVILLERS,,,25571,,,,,,,,,,,,,,,,,,,2007-09-26,F,,,,,75.1A,NAFRev1,O,3.0709671,50.6304695,0.92,poi.townhall,Hôtel de Ville Lille,https://osm.org/way/40917078,G,,
242504314,00020,24250431400020,O,2007-09-26,NN,,,2011-04-23T04:18:23,true,3,,2,,RUE,DU JURA,25470,TREVILLERS,,,25571,,,,,,,,,,,,,,,,,,,2010-01-01,F,,,,,84.11Z,NAFRev2,O,6.868558,47.282068,0.95,housenumber,2 Rue du Jura 25470 Trévillers,25571_0077_00002,G,2 RUE DU JURA,
252505714,00011,25250571400011,O,,NN,,,,true,1,,,,,MAIRIE,25470,TREVILLERS,,,25571,,,,,,,,,,,,,,,,,,,1995-05-29,F,,,,,92.6A,NAF1993,N,3.0709671,50.6304695,0.92,poi.townhall,Hôtel de Ville Lille,https://osm.org/way/40917078,G,,
262501562,00017,26250156200017,O,1983-03-01,NN,,,2020-09-01T16:16:03,true,4,,,,,MAIRIE,25470,TREVILLERS,,,25571,,,,,,,,,,,,,,,,,,,2015-12-31,F,CCAS,,,,88.99B,NAFRev2,N,3.0709671,50.6304695,0.92,poi.townhall,Hôtel de Ville Lille,https://osm.org/way/40917078,G,,
272500711,00010,27250071100010,O,,,,,,true,1,,,,,,25470,TREVILLERS,,,25571,,,,,,,,,,,,,,,,,,,1995-12-25,F,,,,,41.0Z,NAF1993,N,,,0,,,,,,
272501222,00017,27250122200017,O,1994-01-01,NN,,,,true,1,,,,,MAIRIE,25470,TREVILLERS,,,25571,,,,,,,,,,,,,,,,,,,1998-12-25,F,,,,,90.0A,NAF1993,N,3.0709671,50.6304695,0.92,poi.townhall,Hôtel de Ville Lille,https://osm.org/way/40917078,G,,
292500915,00015,29250091500015,O,1985-12-10,NN,,,2010-09-28T15:00:30,true,4,,,,,MAIRIE,25470,TREVILLERS,,,25571,,,,,,,,,,,,,,,,,,,2008-01-01,F,,,,,42.99Z,NAFRev2,N,3.0709671,50.6304695,0.92,poi.townhall,Hôtel de Ville Lille,https://osm.org/way/40917078,G,,
306014143,00011,30601414300011,O,1900-01-01,NN,,,2010-07-07T14:58:43,true,4,,,,,,25470,TREVILLERS,,,25571,,,,,,,,,,,,,,,,,,,2009-12-25,F,,,,,68.20B,NAFRev2,N,,,0,,,,,,
306373788,00018,30637378800018,O,1976-01-01,NN,,,2010-07-30T11:11:47,true,4,,,,,,25470,TREVILLERS,,,25571,,,,,,,,,,,,,,,,,,,2009-12-25,F,,,,,55.10Z,NAFRev2,N,,,0,,,,,,
306374448,00018,30637444800018,O,1976-01-01,NN,,,2010-07-30T11:12:43,true,4,,,,,,25470,TREVILLERS,,,25571,,,,,,,,,,,,,,,,,,,2009-12-25,F,,,,,55.10Z,NAFRev2,N,,,0,,,,,,
306374455,00013,30637445500013,O,1976-01-01,NN,,,2010-07-30T11:13:31,true,4,,,,,,25470,TREVILLERS,,,25571,,,,,,,,,,,,,,,,,,,2009-12-25,F,,,,,55.10Z,NAFRev2,N,,,0,,,,,,
306374687,00011,30637468700011,O,1976-01-01,NN,,,,true,1,,,,,,25470,TREVILLERS,,,25571,,,,,,,,,,,,,,,,,,,1988-05-14,F,,,,,55.1A,NAF1993,N,,,0,,,,,,
306374695,00014,30637469500014,O,1976-01-01,NN,,,2010-07-30T11:14:06,true,4,,,,,,25470,TREVILLERS,,,25571,,,,,,,,,,,,,,,,,,,2009-12-25,F,,,,,55.10Z,NAFRev2,N,,,0,,,,,,
315635383,00013,31563538300013,O,,NN,,,,true,1,,,,,,25470,TREVILLERS,,,25571,,,,,,,,,,,,,,,,,,,1988-12-25,F,,,,,69.11,NAP,N,,,0,,,,,,
318683208,00025,31868320800025,O,2017-10-05,,,,2018-02-20T03:37:36,true,2,,24,,RUE,DU JURA,25470,TREVILLERS,,,25571,,,,,,,,,,,,,,,,,,,2017-11-30,F,,,,,73.11Z,NAFRev2,N,6.87622,47.280476,0.95,housenumber,24 Rue du Jura 25470 Trévillers,25571_0077_00024,G,24 RUE DU JURA,
320811904,00046,32081190400046,O,2000-02-01,NN,,,2006-10-27T01:10:51,true,3,,24,,RUE,DU JURA,25470,TREVILLERS,,,25571,,,,,,,,,,,,,,,,,,,2004-08-21,F,,,,,70.2C,NAFRev1,N,6.87622,47.280476,0.95,housenumber,24 Rue du Jura 25470 Trévillers,25571_0077_00024,G,24 RUE DU JURA,
320881097,00010,32088109700010,O,,NN,,,,true,1,,,,,ROBELIN,25470,TREVILLERS,,,25571,,,,,,,,,,,,,,,,,,,1989-04-19,F,,,,,01.00,NAP,N,6.877698,47.295728,0.33,locality,Clos du Moulin 25470 Trévillers,25571_B016,G,CLOS DU MOULIN,
323725366,00013,32372536600013,O,1973-01-01,NN,,,,true,1,,,,,,25470,TREVILLERS,,,25571,,,,,,,,,,,,,,,,,,,1998-11-05,F,,,,,00.0Z,NAF1993,N,,,0,,,,,,
325225027,00045,32522502700045,O,2011-09-04,,,,2013-02-14T11:41:30,true,2,,6,,RUE,DU CLOS GRAS,25470,TREVILLERS,,,25571,,,,,,,,,,,,,,,,,,,2013-02-01,F,,,,,47.91A,NAFRev2,N,6.8681,47.280244,0.94,housenumber,6 Rue du Clos Gras 25470 Trévillers,25571_0023_00006,G,6 RUE DU CLOS GRAS,
325530129,00015,32553012900015,O,,,,,,true,1,,,,,,25470,TREVILLERS,,,25571,,,,,,,,,,,,,,,,,,,1984-12-25,F,,,,,67.08,NAP,N,,,0,,,,,,
325897403,00011,32589740300011,O,,,,,,true,1,,,,,,25470,TREVILLERS,,,25571,,,,,,,,,,,,,,,,,,,1989-04-28,F,,,,,55.71,NAP,N,,,0,,,,,,
326319118,00013,32631911800013,O,1983-01-19,NN,,,2006-12-15T00:23:17,false,4,,,,,LES PLAINS ET GRANDS ESSAR,25470,TREVILLERS,,,25571,,,,,,,,,,,,,,,,,,,1992-12-25,F,,,,,02.0B,NAF1993,N,6.8922085,47.3033993,0.87,poi.school,(École) Les Plains-et-Grands-Essarts,https://osm.org/node/2889991219,G,,
326349487,00016,32634948700016,O,1983-01-05,NN,,,2018-04-24T08:38:59,true,5,LOT DE LA SEIGNE,20,,RUE,DU JURA,25470,TREVILLERS,,,25571,,,,,,,,,,,,,,,,,,,2003-12-31,F,,,,,74.1J,NAFRev1,N,6.874203,47.282002,0.95,housenumber,20 Rue du Jura 25470 Trévillers,25571_0077_00020,G,20 RUE DU JURA,
327958732,00015,32795873200015,O,1983-01-01,NN,,,,true,1,,,,,,25470,TREVILLERS,,,25571,,,,,,,,,,,,,,,,,,,1999-03-31,F,,,,,50.5Z,NAF1993,N,,,0,,,,,,
328351572,00016,32835157200016,O,,NN,,,,true,1,,,,,,25470,TREVILLERS,,,25571,,,,,,,,,,,,,,,,,,,1988-11-30,F,,,,,67.08,NAP,N,,,0,,,,,,
330388695,00026,33038869500026,O,2004-01-01,NN,,,2018-03-28T10:52:57,false,3,SARL MOBI TOIL,7,,RUE,DU COMTE,25470,TREVILLERS,,,25571,,,,,,,,,,,,,,,,,,,2005-09-10,F,,,,,74.1J,NAFRev1,N,6.865692,47.282489,0.94,housenumber,7 Rue du Comté 25470 Trévillers,25571_0022_00007,G,7 RUE DU COMTE,
334406444,00037,33440644400037,O,2012-06-06,,,,2018-10-06T04:28:16,true,4,,18,,RUE,DE LA CHAPELLE,25470,TREVILLERS,,,25571,,,,,,,,,,,,,,,,,,,2018-09-30,F,,,,,47.81Z,NAFRev2,N,6.859236,47.284119,0.95,housenumber,18 Rue de la Chapelle 25470 Trévillers,25571_0021_00018,G,18 RUE DE LA CHAPELLE,
341215416,00015,34121541600015,O,,,,,,true,1,,,,PL,DE L'EGLISE,25470,TREVILLERS,,,25571,,,,,,,,,,,,,,,,,,,1991-02-28,F,,,,,67.08,NAP,N,6.866521,47.281516,0.75,street,Rue de l’Eglise 25470 Trévillers,25571_0041,G,RUE DE L EGLISE,
342502960,00061,34250296000061,O,2003-05-20,NN,,,2008-01-04T22:04:25,true,3,,1,,RUE,DE LA SEIGNE,25470,TREVILLERS,,,25571,,,,,,,,,,,,,,,,,,,2008-01-01,A,,,,,90.03B,NAFRev2,N,6.872637,47.28219,0.95,housenumber,1 Rue de la Seigne 25470 Trévillers,25571_0115_00001,G,1 RUE DE LA SEIGNE,
344042189,00037,34404218900037,O,2014-08-01,,,,2019-10-04T10:42:14,true,1,,,,,,25470,TREVILLERS,,,25571,,,,,,,,,,,,,,,,,,,2014-08-01,A,,,,,02.10Z,NAFRev2,N,,,0,,,,,,
351395041,00012,35139504100012,O,1989-07-01,NN,,,2021-09-08T08:40:37,false,6,,5,,RUE,DE L'EGLISE,25470,TREVILLERS,,,25571,,,,,,,,,,,,,,,,,,,2021-06-13,F,,,,,47.11C,NAFRev2,N,6.86685,47.281734,0.94,housenumber,5 Rue de l’Eglise 25470 Trévillers,25571_0041_00005,G,5 RUE DE L EGLISE,
351395041,00038,35139504100038,O,2009-07-01,,,,2013-02-12T09:55:28,false,2,,5,,RUE,DE L'EGLISE,25470,TREVILLERS,,,25571,,,,,,,,,,,,,,,,,,,2009-07-01,F,,,,,47.11C,NAFRev2,N,6.86685,47.281734,0.94,housenumber,5 Rue de l’Eglise 25470 Trévillers,25571_0041_00005,G,5 RUE DE L EGLISE,
351954862,00014,35195486200014,O,1988-01-01,NN,,,,true,1,,,,,,25470,TREVILLERS,,,25571,,,,,,,,,,,,,,,,,,,2002-12-07,F,,,,,01.2A,NAF1993,N,,,0,,,,,,
352433924,00045,35243392400045,O,2011-10-01,,,,2013-02-26T08:31:35,false,2,,,,,,25470,TREVILLERS,,,25571,,,,,,,,,,,,,,,,,,,2012-12-31,F,,,,,02.20Z,NAFRev2,N,,,0,,,,,,
356000430,00575,35600043000575,O,1991-01-01,NN,,,2009-10-17T13:04:19,false,4,,,,,,25470,TREVILLERS,,,25571,,,,,,,,,,,,,,,,,,,2009-03-18,F,BUREAU DE POSTE,,,,53.10Z,NAFRev2,O,,,0,,,,,,
356000430,07612,35600043007612,O,2005-10-25,NN,,,2013-03-05T10:46:47,false,4,,4,,RUE,DU JURA,25470,TREVILLERS,,,25571,,,,,,,,,,,,,,,,,,,2011-12-31,F,CENTRE COURRIER,,,,53.10Z,NAFRev2,O,6.868865,47.282105,0.95,housenumber,4 Rue du Jura 25470 Trévillers,25571_0077_00004,G,4 RUE DU JURA,
379187271,00018,37918727100018,O,1990-08-01,NN,,,2017-10-15T03:13:49,true,3,,,,,,25470,TREVILLERS,,,25571,,,,,,,,,,,,,,,,,,,2001-06-30,F,,,,,60.2B,NAF1993,N,,,0,,,,,,
380299891,00016,38029989100016,O,1990-11-01,NN,,,2008-01-04T21:40:59,true,3,,12,,RUE,DU COMTE,25470,TREVILLERS,,,25571,,,,,,,,,,,,,,,,,,,2008-01-01,A,,,,,01.41Z,NAFRev2,N,6.864541,47.282653,0.94,housenumber,12 Rue du Comté 25470 Trévillers,25571_0022_00012,G,12 RUE DU COMTE,
381087865,00014,38108786500014,O,1973-03-01,NN,,,2008-01-04T21:51:16,true,3,,,,,MAIRIE,25470,TREVILLERS,,,25571,,,,,,,,,,,,,,,,,,,2008-01-01,A,,,,,93.12Z,NAFRev2,N,3.0709671,50.6304695,0.92,poi.townhall,Hôtel de Ville Lille,https://osm.org/way/40917078,G,,
381107663,00035,38110766300035,O,1999-04-01,NN,,,2019-06-24T13:10:56,true,4,,1,,RUE,DE L'EGLISE,25470,TREVILLERS,,,25571,,,,,,,,,,,,,,,,,,,2017-09-30,F,,,,,55.10Z,NAFRev2,O,6.867193,47.281937,0.94,housenumber,1 Rue de l’Eglise 25470 Trévillers,25571_0041_00001,G,1 RUE DE L EGLISE,
381412840,00013,38141284000013,O,,,,,,true,1,,,,PL,DE L'EGLISE,25470,TREVILLERS,,,25571,,,,,,,,,,,,,,,,,,,1993-05-07,F,,,,,55.1A,NAF1993,N,6.866521,47.281516,0.75,street,Rue de l’Eglise 25470 Trévillers,25571_0041,G,RUE DE L EGLISE,
382279552,00014,38227955200014,O,,NN,,,,true,1,,,,,,25470,TREVILLERS,,,25571,,,,,,,,,,,,,,,,,,,1995-12-31,F,,,,,01.2A,NAF1993,N,,,0,,,,,,
382652717,00010,38265271700010,O,1991-03-31,NN,,,2013-01-17T05:16:20,true,4,,,,,,25470,TREVILLERS,,,25571,,,,,,,,,,,,,,,,,,,2012-12-31,A,,,,,68.20B,NAFRev2,N,,,0,,,,,,
388451288,00012,38845128800012,O,1992-04-01,NN,,,2011-09-21T14:52:32,true,4,LA FROMAGERIE,,,,LES PLAINS,25470,TREVILLERS,,,25571,,,,,,,,,,,,,,,,,,,2008-01-01,F,,,,,47.11B,NAFRev2,N,6.875585,47.295962,0.34,street,Les Cerniers 25470 Trévillers,25571_daprll,G,LES CERNIERS,
388790255,00011,38879025500011,O,1992-10-01,NN,,4722ZB,2015-03-17T00:37:46,true,8,,,,,,25470,TREVILLERS,,,25571,,,,,,,,,,,,,,,,,,,2015-01-31,F,,,,,10.13B,NAFRev2,N,,,0,,,,,,
389699695,00018,38969969500018,O,1993-01-01,NN,,,2008-02-07T04:06:15,true,4,,,,,,25470,TREVILLERS,,,25571,,,,,,,,,,,,,,,,,,,2008-01-31,F,,,,,01.41Z,NAFRev2,N,,,0,,,,,,
389718354,00019,38971835400019,O,1982-09-01,NN,,,2008-01-04T23:28:49,true,5,,,,,,25470,TREVILLERS,,,25571,,,,,,,,,,,,,,,,,,,2008-01-01,A,,,,,68.20B,NAFRev2,N,,,0,,,,,,
389761255,00014,38976125500014,O,1985-01-01,NN,,,2009-06-29T11:15:06,true,4,LE CREPOND,,,,,25470,TREVILLERS,,,25571,,,,,,,,,,,,,,,,,,,2009-02-28,A,,,,,68.20B,NAFRev2,N,6.871089,47.277896,0.51,street,Rue du Crèpon 25470 Trévillers,25571_0024,D,RUE DU CREPON,
389761404,00018,38976140400018,O,1977-07-01,NN,,,2011-01-24T15:32:32,true,4,,,,,,25470,TREVILLERS,,,25571,,,,,,,,,,,,,,,,,,,2011-03-30,F,,,,,01.41Z,NAFRev2,N,,,0,,,,,,
389813478,00010,38981347800010,O,1986-01-01,NN,,,2018-09-29T12:17:21,true,4,,,,,,25470,TREVILLERS,,,25571,,,,,,,,,,,,,,,,,,,2018-03-15,F,,,,,01.41Z,NAFRev2,N,,,0,,,,,,
389814302,00011,38981430200011,O,,,,,,true,1,,,,,,25470,TREVILLERS,,,25571,,,,,,,,,,,,,,,,,,,1996-08-31,F,,,,,01.2A,NAF1993,N,,,0,,,,,,
389836511,00011,38983651100011,O,,,,,,true,1,,,,,,25470,TREVILLERS,,,25571,,,,,,,,,,,,,,,,,,,1995-09-30,F,,,,,01.2A,NAF1993,N,,,0,,,,,,
389875873,00017,38987587300017,O,1974-01-01,NN,,,,true,1,,,,,,25470,TREVILLERS,,,25571,,,,,,,,,,,,,,,,,,,1998-03-31,F,,,,,01.2A,NAF1993,N,,,0,,,,,,
390112076,00018,39011207600018,O,1979-10-15,NN,,,2013-02-25T02:33:12,true,4,,,,,,25470,TREVILLERS,,,25571,,,,,,,,,,,,,,,,,,,2012-12-31,F,,,,,01.41Z,NAFRev2,N,,,0,,,,,,
390213080,00018,39021308000018,O,,NN,,,,true,1,,,,,,25470,TREVILLERS,,,25571,,,,,,,,,,,,,,,,,,,1995-12-25,F,,,,,70.2B,NAF1993,N,,,0,,,,,,
390213254,00019,39021325400019,O,1971-01-01,NN,,,,true,1,,,,,,25470,TREVILLERS,,,25571,,,,,,,,,,,,,,,,,,,2001-09-30,F,,,,,01.2A,NAF1993,N,,,0,,,,,,
390213262,00012,39021326200012,O,1975-03-01,NN,,,2021-02-23T11:16:08,true,4,PRES CROLOTS,,,,,25470,TREVILLERS,,,25571,,,,,,,,,,,,,,,,,,,2008-01-01,A,,,,,68.20B,NAFRev2,N,6.857426,47.273062,0.57,street,Le Pré Crolot 25470 Trévillers,25571_B069,D,LE PRE CROLOT,
390213676,00013,39021367600013,O,1964-03-24,NN,,,2016-01-12T00:14:34,true,5,,,,,,25470,TREVILLERS,,,25571,,,,,,,,,,,,,,,,,,,2008-01-01,A,,,,,02.20Z,NAFRev2,N,,,0,,,,,,
390213700,00011,39021370000011,O,1988-10-01,NN,,,2009-06-27T07:00:04,true,4,,,,,,25470,TREVILLERS,,,25571,,,,,,,,,,,,,,,,,,,2008-01-01,F,,,,,01.41Z,NAFRev2,N,,,0,,,,,,
390213700,00029,39021370000029,O,1999-01-01,NN,,,2006-10-28T01:35:29,false,3,,,,,LES CERNIERS,25470,TREVILLERS,,,25571,,,,,,,,,,,,,,,,,,,2005-04-24,F,,,,,74.1J,NAFRev1,N,6.875585,47.295962,0.94,street,Les Cerniers 25470 Trévillers,25571_daprll,G,LES CERNIERS,
390219830,00010,39021983000010,O,1989-05-01,NN,,,2008-12-12T21:03:10,true,4,,,,,,25470,TREVILLERS,,,25571,,,,,,,,,,,,,,,,,,,2008-03-31,A,,,,,68.20B,NAFRev2,N,,,0,,,,,,
391573391,00011,39157339100011,O,1993-06-15,,,,2006-12-15T00:50:32,false,4,,,,PL,DE L'EGLISE,25470,TREVILLERS,,,25571,,,,,,,,,,,,,,,,,,,1998-03-13,F,,,,,55.1A,NAF1993,N,6.866521,47.281516,0.75,street,Rue de l’Eglise 25470 Trévillers,25571_0041,G,RUE DE L EGLISE,
401173851,00023,40117385100023,O,2005-07-25,NN,,,2021-10-20T08:48:55,true,5,,1,B,RUE,DU DOUBS,25470,TREVILLERS,,,25571,,,,,,,,,,,,,,,,,,,2014-08-24,F,,,,,86.23Z,NAFRev2,N,6.868188,47.282092,0.83,housenumber,1bis Rue du Doubs 25470 Trévillers,25571_0038_00001_bis,G,1BIS RUE DU DOUBS,
401554506,00014,40155450600014,O,1995-06-01,NN,,,2008-01-04T19:49:09,true,3,,,,,,25470,TREVILLERS,,,25571,,,,,,,,,,,,,,,,,,,2008-01-01,A,,,,,01.41Z,NAFRev2,N,,,0,,,,,,
403380496,00014,40338049600014,O,1996-01-02,NN,,,2015-05-27T03:40:56,false,4,,6,,RUE,DU DOUBS,25470,TREVILLERS,,,25571,,,,,,,,,,,,,,,,,,,2015-05-18,F,,,,,68.20B,NAFRev2,N,6.868272,47.281302,0.94,housenumber,6 Rue du Doubs 25470 Trévillers,25571_0038_00006,G,6 RUE DU DOUBS,
403669468,00015,40366946800015,O,1996-01-01,NN,,,2010-04-29T04:18:44,true,4,LE MOULIN,,,,,25470,TREVILLERS,,,25571,,,,,,,,,,,,,,,,,,,2010-03-31,F,,,,,01.41Z,NAFRev2,N,6.879434,47.294168,0.94,street,Le Moulin 25470 Trévillers,25571_93gyu8,D,LE MOULIN,
403897887,00010,40389788700010,O,1996-02-16,NN,,,,true,3,,1,,RUE,DE L'EGLISE,25470,TREVILLERS,,,25571,,,,,,,,,,,,,,,,,,,1998-03-13,F,,,,,55.1A,NAF1993,O,6.867193,47.281937,0.94,housenumber,1 Rue de l’Eglise 25470 Trévillers,25571_0041_00001,G,1 RUE DE L EGLISE,
404696346,00018,40469634600018,O,1995-01-01,NN,,,2008-01-18T03:48:31,true,4,,,,,,25470,TREVILLERS,,,25571,,,,,,,,,,,,,,,,,,,2008-01-01,F,,,,,02.20Z,NAFRev2,N,,,0,,,,,,
404715716,00043,40471571600043,O,2002-03-04,NN,,,2014-10-03T04:01:34,false,8,,6,,RUE,DES FLEURS,25470,TREVILLERS,,,25571,,,,,,,,,,,,,,,,,,,2014-09-01,F,,,,,45.40Z,NAFRev2,N,6.870563,47.284198,0.94,housenumber,6 Rue des Fleurs 25470 Trévillers,25571_0053_00006,G,6 RUE DES FLEURS,
404861684,00011,40486168400011,O,1996-04-01,03,2019,,2021-10-27T08:30:55,true,4,FROMAGERIE DE TREVILLERS,11,,RUE,DES FRUITIERES,25470,TREVILLERS,,,25571,,,,,,,,,,,,,,,,,,,2008-01-01,A,,,,,47.29Z,NAFRev2,N,6.869015,47.283768,0.95,housenumber,11 Rue des Fruitières 25470 Trévillers,25571_0058_00011,G,11 RUE DES FRUITIERES,
407783521,00013,40778352100013,O,1989-03-31,NN,,,2008-01-04T20:59:43,true,3,,,,,,25470,TREVILLERS,,,25571,,,,,,,,,,,,,,,,,,,2008-01-01,A,,,,,01.41Z,NAFRev2,N,,,0,,,,,,
408947794,00017,40894779400017,O,1996-09-01,NN,,,2008-01-04T21:18:51,true,3,,,,LD,DES CERNIERS,25470,TREVILLERS,,,25571,,,,,,,,,,,,,,,,,,,2008-01-01,A,,,,,01.41Z,NAFRev2,N,6.875585,47.295962,0.79,street,Les Cerniers 25470 Trévillers,25571_daprll,G,LES CERNIERS,
409022407,00012,40902240700012,O,1994-01-01,NN,,,,true,3,,,,,,25470,TREVILLERS,,,25571,,,,,,,,,,,,,,,,,,,1997-09-30,F,,,,,01.1A,NAF1993,N,,,0,,,,,,
411579261,00016,41157926100016,O,1997-04-01,NN,,,2017-05-04T06:07:30,true,3,,,,,FERME DE VERNOIS,25470,TREVILLERS,,,25571,,,,,,,,,,,,,,,,,,,2008-01-01,A,,,,,01.41Z,NAFRev2,N,6.893781,47.286021,0.53,street,Le Vernois 25470 Trévillers,25571_sirwzt,G,LE VERNOIS,
411664246,00013,41166424600013,O,1997-04-02,NN,,,,true,1,,2,,RUE,DE LA CHAPELLE,25470,TREVILLERS,,,25571,,,,,,,,,,,,,,,,,,,1997-04-02,F,,,,,02.0B,NAF1993,N,6.863599,47.283278,0.95,housenumber,2 Rue de la Chapelle 25470 Trévillers,25571_0021_00002,G,2 RUE DE LA CHAPELLE,
414093393,00018,41409339300018,O,1997-10-03,NN,,,2008-01-05T20:30:56,true,3,,6,,RUE,DE LA GARE,25470,TREVILLERS,,,25571,,,,,,,,,,,,,,,,,,,2008-01-01,A,,,,,68.20B,NAFRev2,N,6.867168,47.279695,0.95,housenumber,6 Rue de la Gare 25470 Trévillers,25571_0068_00006,G,6 RUE DE LA GARE,
419063268,00017,41906326800017,O,1998-04-01,NN,,,2008-10-12T04:52:33,true,4,,,,,LA CRAUTE,25470,TREVILLERS,,,25571,,,,,,,,,,,,,,,,,,,2008-09-30,F,,,,,01.46Z,NAFRev2,N,6.861008,47.264866,0.94,street,La Craute 25470 Trévillers,25571_qk2iuq,G,LA CRAUTE,
419063375,00010,41906337500010,O,1998-04-01,NN,,,2008-01-04T23:30:33,true,3,,,,,LA CRAUTE,25470,TREVILLERS,,,25571,,,,,,,,,,,,,,,,,,,2008-01-01,A,,,,,01.41Z,NAFRev2,N,6.861008,47.264866,0.94,street,La Craute 25470 Trévillers,25571_qk2iuq,G,LA CRAUTE,
421579475,00011,42157947500011,O,1999-01-01,NN,,,2008-11-19T07:47:16,false,4,,,,,LES CERNIERS,25470,TREVILLERS,,,25571,,,,,,,,,,,,,,,,,,,2008-07-31,F,,,,,64.20Z,NAFRev2,N,6.875585,47.295962,0.94,street,Les Cerniers 25470 Trévillers,25571_daprll,G,LES CERNIERS,
422700898,00014,42270089800014,O,1999-04-01,NN,,,2006-11-25T16:24:44,true,3,,,,,,25470,TREVILLERS,,,25571,,,,,,,,,,,,,,,,,,,2004-09-30,F,,,,,50.5Z,NAFRev1,N,,,0,,,,,,
423496439,00013,42349643900013,O,1999-06-15,NN,,,2013-01-23T10:39:42,false,3,,5,,RUE,DU JURA,25470,TREVILLERS,,,25571,,,,,,,,,,,,,,,,,,,2007-02-25,F,,,,,55.3A,NAFRev1,O,6.870024,47.282845,0.95,housenumber,5 Rue du Jura 25470 Trévillers,25571_0077_00005,G,5 RUE DU JURA,
428045280,00016,42804528000016,O,1991-02-16,NN,,,2006-10-31T00:33:35,true,3,,5,,RUE,DU JURA,25470,TREVILLERS,,,25571,,,,,,,,,,,,,,,,,,,2004-04-30,F,,,,,70.2C,NAFRev1,N,6.870024,47.282845,0.95,housenumber,5 Rue du Jura 25470 Trévillers,25571_0077_00005,G,5 RUE DU JURA,
428207815,00013,42820781500013,O,1999-12-11,NN,,,,true,4,,7,,RUE,DU COMTE,25470,TREVILLERS,,,25571,,,,,,,,,,,,,,,,,,,2001-05-15,F,,,,,92.3H,NAF1993,O,6.865692,47.282489,0.94,housenumber,7 Rue du Comté 25470 Trévillers,25571_0022_00007,G,7 RUE DU COMTE,
428609648,00012,42860964800012,O,1999-12-11,NN,,,2006-11-25T16:43:27,true,1,,7,,RUE,DU COMTE,25470,TREVILLERS,,,25571,,,,,,,,,,,,,,,,,,,2001-05-15,F,,,,,74.1J,NAF1993,N,6.865692,47.282489,0.94,housenumber,7 Rue du Comté 25470 Trévillers,25571_0022_00007,G,7 RUE DU COMTE,
429525819,00026,42952581900026,O,2000-06-27,NN,,,2008-01-05T01:40:20,true,3,,2,,RUE,DU JURA,25470,TREVILLERS,,,25571,,,,,,,,,,,,,,,,,,,2008-01-01,A,,,,,46.49Z,NAFRev2,N,6.868558,47.282068,0.95,housenumber,2 Rue du Jura 25470 Trévillers,25571_0077_00002,G,2 RUE DU JURA,
430445999,00013,43044599900013,O,1984-01-01,NN,,,2016-01-12T00:22:15,true,3,,,,RUE,DE LA SENOILLE,25470,TREVILLERS,,,25571,,,,,,,,,,,,,,,,,,,2008-01-01,A,,,,,01.41Z,NAFRev2,N,6.874193,47.281435,0.7,street,Rue de la Seigne 25470 Trévillers,25571_0115,G,RUE DE LA SEIGNE,
430609701,00015,43060970100015,O,1997-01-01,NN,,,2016-01-12T00:22:20,true,3,,,,,AU VILLAGE,25470,TREVILLERS,,,25571,,,,,,,,,,,,,,,,,,,2008-01-01,A,,,,,02.10Z,NAFRev2,N,-1.6854522,47.8876296,0.9,poi.cafe,Au Village (Café) Poligné,https://osm.org/node/4456269839,G,,
431859321,00025,43185932100025,O,2002-11-01,NN,,,2008-11-08T01:54:57,true,3,,12,,RUE,DU JURA,25470,TREVILLERS,,,25571,,,,,,,,,,,,,,,,,,,2005-03-31,F,,,,,52.4V,NAFRev1,N,6.870706,47.282488,0.95,housenumber,12 Rue du Jura 25470 Trévillers,25571_0077_00012,G,12 RUE DU JURA,