siren,nic,siret,statutDiffusionEtablissement,dateCreationEtablissement,trancheEffectifsEtablissement,anneeEffectifsEtablissement,activitePrincipaleRegistreMetiersEtablissement,dateDernierTraitementEtablissement,etablissementSiege,nombrePeriodesEtablissement,complementAdresseEtablissement,numeroVoieEtablissement,indiceRepetitionEtablissement,typeVoieEtablissement,libelleVoieEtablissement,codePostalEtablissement,libelleCommuneEtablissement,libelleCommuneEtrangerEtablissement,distributionSpecialeEtablissement,codeCommuneEtablissement,codeCedexEtablissement,libelleCedexEtablissement,codePaysEtrangerEtablissement,libellePaysEtrangerEtablissement,complementAdresse2Etablissement,numeroVoie2Etablissement,indiceRepetition2Etablissement,typeVoie2Etablissement,libelleVoie2Etablissement,codePostal2Etablissement,libelleCommune2Etablissement,libelleCommuneEtranger2Etablissement,distributionSpeciale2Etablissement,codeCommune2Etablissement,codeCedex2Etablissement,libelleCedex2Etablissement,codePaysEtranger2Etablissement,libellePaysEtranger2Etablissement,dateDebut,etatAdministratifEtablissement,enseigne1Etablissement,enseigne2Etablissement,enseigne3Etablissement,denominationUsuelleEtablissement,activitePrincipaleEtablissement,nomenclatureActivitePrincipaleEtablissement,caractereEmployeurEtablissement,longitude,latitude,geo_score,geo_type,geo_adresse,geo_id,geo_ligne,geo_l4,geo_l5
200063212,00019,20006321200019,O,2017-01-01,11,2019,,2021-10-27T08:05:56,true,1,,1,,,GRANDE RUE,39190,VAL-SONNETTE,,,39576,,,,,,,,,,,,,,,,,,,2017-01-01,A,MAIRIE,,,,84.11Z,NAFRev2,O,5.480229,46.600039,0.93,housenumber,1 Grande Rue (Vincelles) 39190 Val-Sonnette,39576_0050_00001,G,1 GRANDE RUE,VINCELLES
200063212,00027,20006321200027,O,2017-01-01,,,,2021-02-23T10:29:53,false,1,,250,,RUE,PRINCIPALE,39190,VAL-SONNETTE,,,39576,,,,,,,,,,,,,,,,,,,2017-01-01,A,COMMUNE DELEGUEE DE BONNAUD,,,,84.11Z,NAFRev2,N,5.428419,46.619422,0.95,housenumber,250 Rue Principale 39190 Val-Sonnette,39064_0020_00250,G,250 RUE PRINCIPALE,
200063212,00035,20006321200035,O,2017-01-01,,,,2021-02-23T10:29:53,false,1,,14,,RUE,ST ROCH,39190,VAL-SONNETTE,,,39576,,,,,,,,,,,,,,,,,,,2017-01-01,A,COMMUNE DELEGUEE DE GRUSSE,,,,84.11Z,NAFRev2,N,5.502166,46.59731,0.83,housenumber,14 Rue Saint-Roch 39190 Val-Sonnette,39264_0030_00014,G,14 RUE SAINT ROCH,
200063212,00043,20006321200043,O,2017-01-01,,,,2021-02-23T10:29:53,false,1,,5,,RUE,DU 19 MARS 1962,39190,VAL-SONNETTE,,,39576,,,,,,,,,,,,,,,,,,,2017-01-01,A,COMMUNE DELEGUEE DE VERCIA,,,,84.11Z,NAFRev2,N,5.455156,46.593548,0.95,housenumber,5 Rue du 19 Mars 1962 39190 Val-Sonnette,39549_0030_00005,G,5 RUE DU 19 MARS 1962,
200063212,00050,20006321200050,O,2017-01-01,,,,2021-02-23T10:29:53,false,1,,1,,,GRANDE RUE,39190,VAL-SONNETTE,,,39576,,,,,,,,,,,,,,,,,,,2017-01-01,A,COMMUNE DELEGUEE DE VINCELLES,,,,84.11Z,NAFRev2,N,5.480229,46.600039,0.93,housenumber,1 Grande Rue (Vincelles) 39190 Val-Sonnette,39576_0050_00001,G,1 GRANDE RUE,VINCELLES
200063212,00068,20006321200068,O,2017-01-01,03,2019,,2021-10-27T08:05:56,false,1,,,,RUE,DES TEPPES,39190,VAL-SONNETTE,,,39576,,,,,,,,,,,,,,,,,,,2017-01-01,A,ECOLE PRIMAIRE PUBLIQUE,,,,85.20Z,NAFRev2,N,5.46965,46.603684,0.95,street,Rue des Teppes 39190 Val-Sonnette,39576_0095,G,RUE DES TEPPES,
213900640,00011,21390064000011,O,1983-03-01,NN,,,2018-09-29T12:05:15,true,4,,,,,,39190,VAL-SONNETTE,,,39576,,,,,,,,,,,,,,,,,,,2017-01-01,F,MAIRIE,,,,84.11Z,NAFRev2,N,,,0,,,,,,
213902646,00016,21390264600016,O,1983-03-01,NN,,,2018-09-29T12:05:15,true,5,,14,,RUE,ST ROCH,39190,VAL-SONNETTE,,,39576,,,,,,,,,,,,,,,,,,,2017-01-01,F,MAIRIE,,,,84.11Z,NAFRev2,O,5.502166,46.59731,0.83,housenumber,14 Rue Saint-Roch 39190 Val-Sonnette,39264_0030_00014,G,14 RUE SAINT ROCH,
213905490,00016,21390549000016,O,1983-03-01,NN,,,2018-09-29T12:05:16,true,5,,,,,,39190,VAL-SONNETTE,,,39576,,,,,,,,,,,,,,,,,,,2017-01-01,F,MAIRIE,,,,84.11Z,NAFRev2,O,,,0,,,,,,
213905490,00024,21390549000024,O,1983-12-21,NN,,,2017-01-03T11:27:03,false,4,,,,,,39190,VAL-SONNETTE,,,39576,,,,,,,,,,,,,,,,,,,2001-12-31,F,ECOLE MATERNELLE PUBLIQUE,,,,80.1Z,NAF1993,N,,,0,,,,,,
213905490,00032,21390549000032,O,2003-04-24,NN,,,2017-02-12T14:21:16,false,4,,5,,RUE,19 MARS 1962,39190,VAL-SONNETTE,,,39576,,,,,,,,,,,,,,,,,,,2017-01-01,F,ASSAINISSEMENT,,,,37.00Z,NAFRev2,N,5.455156,46.593548,0.89,housenumber,5 Rue du 19 Mars 1962 39190 Val-Sonnette,39549_0030_00005,G,5 RUE DU 19 MARS 1962,
213905763,00016,21390576300016,O,1983-03-01,NN,,,2019-06-24T13:10:33,true,4,,,,,,39190,VAL-SONNETTE,,,39576,,,,,,,,,,,,,,,,,,,2017-01-01,F,MAIRIE,,,,84.11Z,NAFRev2,O,,,0,,,,,,
213905763,00024,21390576300024,O,1983-12-21,NN,,,2019-06-24T13:10:33,false,4,,3,,,GRANDE RUE,39190,VAL-SONNETTE,,,39576,,,,,,,,,,,,,,,,,,,2017-01-01,F,ECOLE MATERNELLE PUBLIQUE,,,,85.10Z,NAFRev2,N,5.480177,46.600069,0.93,housenumber,3 Grande Rue (Vincelles) 39190 Val-Sonnette,39576_0050_00003,G,3 GRANDE RUE,VINCELLES
213905763,00032,21390576300032,O,2005-03-18,,,,2017-02-12T14:21:18,false,3,MAIRIE,1,,,GRANDE RUE,39190,VAL-SONNETTE,,,39576,,,,,,,,,,,,,,,,,,,2017-01-01,F,SERVICE ASSAINISSEMENT,,,,37.00Z,NAFRev2,N,5.480229,46.600039,0.93,housenumber,1 Grande Rue (Vincelles) 39190 Val-Sonnette,39576_0050_00001,G,1 GRANDE RUE,VINCELLES
213905763,00040,21390576300040,O,2007-09-01,NN,,,2017-02-12T14:21:18,false,2,,,,RUE,TEPPES,39190,VAL-SONNETTE,,,39576,,,,,,,,,,,,,,,,,,,2017-01-01,F,ECOLE PRIMAIRE,,,,85.20Z,NAFRev2,N,5.46965,46.603684,0.86,street,Rue des Teppes 39190 Val-Sonnette,39576_0095,G,RUE DES TEPPES,
243901139,00010,24390113900010,O,2004-05-28,NN,,,2018-09-29T12:07:21,true,4,MAIRIE,1,,,GRANDE RUE,39190,VAL-SONNETTE,,,39576,,,,,,,,,,,,,,,,,,,2016-12-31,F,,,,,84.11Z,NAFRev2,O,5.480229,46.600039,0.93,housenumber,1 Grande Rue (Vincelles) 39190 Val-Sonnette,39576_0050_00001,G,1 GRANDE RUE,VINCELLES
253901482,00013,25390148200013,O,1983-03-01,NN,,,,true,1,,,,,MAIRIE,39190,VAL-SONNETTE,,,39576,,,,,,,,,,,,,,,,,,,2002-12-16,F,,,,,75.1C,NAF1993,O,5.455493,46.590904,0.39,street,Rue de la Fromagerie (Vercia) 39190 Val-Sonnette,39549_0045,G,RUE DE LA FROMAGERIE,VERCIA
263900649,00017,26390064900017,O,1983-03-01,NN,,,2017-02-12T14:25:04,true,4,,,,,MAIRIE,39190,VAL-SONNETTE,,,39576,,,,,,,,,,,,,,,,,,,2016-01-01,F,CCAS,,,,88.99B,NAFRev2,N,5.455493,46.590904,0.39,street,Rue de la Fromagerie (Vercia) 39190 Val-Sonnette,39549_0045,G,RUE DE LA FROMAGERIE,VERCIA
263902645,00013,26390264500013,O,1983-03-01,NN,,,2017-02-12T14:25:05,true,5,MAIRIE,14,,RUE,ST ROCH,39190,VAL-SONNETTE,,,39576,,,,,,,,,,,,,,,,,,,2017-01-01,F,,,,,88.99B,NAFRev2,N,5.502166,46.59731,0.83,housenumber,14 Rue Saint-Roch 39190 Val-Sonnette,39264_0030_00014,G,14 RUE SAINT ROCH,
263905499,00012,26390549900012,O,1983-03-01,NN,,,2017-02-12T14:25:08,true,4,,,,,MAIRIE,39190,VAL-SONNETTE,,,39576,,,,,,,,,,,,,,,,,,,2017-01-01,F,CCAS,,,,88.99B,NAFRev2,N,5.455493,46.590904,0.39,street,Rue de la Fromagerie (Vercia) 39190 Val-Sonnette,39549_0045,G,RUE DE LA FROMAGERIE,VERCIA
263905762,00013,26390576200013,O,1983-03-01,NN,,,2017-02-12T14:25:09,true,4,,,,,MAIRIE,39190,VAL-SONNETTE,,,39576,,,,,,,,,,,,,,,,,,,2017-01-01,F,CCAS,,,,88.99B,NAFRev2,N,5.455493,46.590904,0.39,street,Rue de la Fromagerie (Vercia) 39190 Val-Sonnette,39549_0045,G,RUE DE LA FROMAGERIE,VERCIA
293900601,00015,29390060100015,O,1984-03-20,NN,,,2017-01-03T11:34:32,true,3,,,,,MAIRIE,39190,VAL-SONNETTE,,,39576,,,,,,,,,,,,,,,,,,,2008-01-01,A,,,,,42.99Z,NAFRev2,N,5.455493,46.590904,0.39,street,Rue de la Fromagerie (Vercia) 39190 Val-Sonnette,39549_0045,G,RUE DE LA FROMAGERIE,VERCIA
293907622,00014,29390762200014,O,1997-11-24,NN,,,2008-01-04T19:06:37,true,3,,,,,MAIRIE,39190,VAL-SONNETTE,,,39576,,,,,,,,,,,,,,,,,,,2008-01-01,A,,,,,42.99Z,NAFRev2,N,5.455493,46.590904,0.39,street,Rue de la Fromagerie (Vercia) 39190 Val-Sonnette,39549_0045,G,RUE DE LA FROMAGERIE,VERCIA
293907911,00011,29390791100011,O,2004-05-24,,,,2008-01-04T19:06:38,true,3,MAIRIE,1,,,GRANDE RUE,39190,VAL-SONNETTE,,,39576,,,,,,,,,,,,,,,,,,,2008-01-01,A,,,,,42.99Z,NAFRev2,N,5.480229,46.600039,0.93,housenumber,1 Grande Rue (Vincelles) 39190 Val-Sonnette,39576_0050_00001,G,1 GRANDE RUE,VINCELLES
293907929,00013,29390792900013,O,2004-05-04,,,,2017-01-03T11:10:59,true,3,MAIRIE,14,,RUE,ST ROCH,39190,VAL-SONNETTE,,,39576,,,,,,,,,,,,,,,,,,,2008-01-01,A,,,,,42.99Z,NAFRev2,N,5.502166,46.59731,0.83,housenumber,14 Rue Saint-Roch 39190 Val-Sonnette,39264_0030_00014,G,14 RUE SAINT ROCH,
293907937,00016,29390793700016,O,2004-05-04,,,,2017-01-03T11:03:10,true,3,MAIRIE,,,RUE,PRINCIPALE,39190,VAL-SONNETTE,,,39576,,,,,,,,,,,,,,,,,,,2008-01-01,A,,,,,42.99Z,NAFRev2,N,5.428159,46.619243,0.95,street,Rue Principale 39190 Val-Sonnette,39064_0020,G,RUE PRINCIPALE,
301535324,00018,30153532400018,O,1900-01-01,NN,,,2017-01-03T11:34:33,false,4,,,,,PAISIA,39190,VAL-SONNETTE,,,39576,,,,,,,,,,,,,,,,,,,2008-06-30,F,,,,,56.10A,NAFRev2,N,5.456646,46.593483,0.91,street,Chemin de Paisia 39190 Val-Sonnette,39549_0053,G,CHEMIN DE PAISIA,
301535324,00026,30153532400026,O,2015-07-01,,,,2021-02-23T10:35:59,true,1,,5,,RTE,NATIONALE,39190,VAL-SONNETTE,,PAISIA,39576,,,,,,,,,,,,,,,,,,,2015-07-01,A,,,,,47.78B,NAFRev2,N,5.459666,46.59857,0.84,housenumber,5 Route Nationale 39190 Val-Sonnette,39549_0050_00005,G,5 ROUTE NATIONALE,
306210444,00023,30621044400023,O,1983-08-01,NN,,,2017-01-03T11:27:06,true,4,,,,,PAISIA,39190,VAL-SONNETTE,,,39576,,,,,,,,,,,,,,,,,,,2012-10-31,F,,,,,16.29Z,NAFRev2,N,5.456646,46.593483,0.91,street,Chemin de Paisia 39190 Val-Sonnette,39549_0053,G,CHEMIN DE PAISIA,
309112944,00025,30911294400025,O,,NN,,,,true,1,,,,,,39190,VAL-SONNETTE,,,39576,,,,,,,,,,,,,,,,,,,1990-09-06,F,,,,,60.10,NAP,N,,,0,,,,,,
309247757,00011,30924775700011,O,,,,,,true,1,,,,,,39190,VAL-SONNETTE,,,39576,,,,,,,,,,,,,,,,,,,1984-12-25,F,,,,,00.10,NAP,N,,,0,,,,,,
309247765,00014,30924776500014,O,,NN,,,,true,1,,,,,,39190,VAL-SONNETTE,,,39576,,,,,,,,,,,,,,,,,,,,F,,,,,65.06,NAP,N,,,0,,,,,,
311164958,00028,31116495800028,O,1987-01-01,NN,,,2008-01-04T20:05:51,true,3,,,,,PRE VAILLON,39190,VAL-SONNETTE,,,39576,,,,,,,,,,,,,,,,,,,2008-01-01,A,,,,,38.32Z,NAFRev2,N,5.479749,46.599497,0.41,street,Rue des Vaillant 39190 Val-Sonnette,39576_0105,G,RUE DES VAILLANT,
311960199,00017,31196019900017,O,1964-01-01,NN,,,,true,1,,,,,,39190,VAL-SONNETTE,,,39576,,,,,,,,,,,,,,,,,,,2001-09-21,F,,,,,45.2L,NAF1993,O,,,0,,,,,,
316109032,00011,31610903200011,O,1979-01-01,NN,,,2008-11-07T00:31:39,true,3,,,,,,39190,VAL-SONNETTE,,,39576,,,,,,,,,,,,,,,,,,,2005-07-31,F,,,,,45.4D,NAFRev1,N,,,0,,,,,,
320659576,00013,32065957600013,O,1981-01-02,NN,,,2017-01-03T11:18:55,true,4,,,,,,39190,VAL-SONNETTE,,,39576,,,,,,,,,,,,,,,,,,,2003-03-05,F,,,,,45.3A,NAFRev1,N,,,0,,,,,,
321585283,00013,32158528300013,O,1981-01-01,NN,,,2011-08-29T08:56:16,true,4,,,,,,39190,VAL-SONNETTE,,,39576,,,,,,,,,,,,,,,,,,,2005-11-30,F,,,,,01.1G,NAFRev1,N,,,0,,,,,,
322372822,00088,32237282200088,O,2007-08-09,00,2019,,2021-10-27T08:22:47,true,3,,40,,RUE,DES ORMOIS,39190,VAL-SONNETTE,,,39576,,,,,,,,,,,,,,,,,,,2016-10-21,A,,,,,82.30Z,NAFRev2,N,5.425937,46.617156,0.94,housenumber,40 Rue des Ormois 39190 Val-Sonnette,39064_0015_00040,G,40 RUE DES ORMOIS,
322932641,00028,32293264100028,O,1982-12-31,NN,,,2017-01-03T11:10:56,true,3,,,,,,39190,VAL-SONNETTE,,,39576,,,,,,,,,,,,,,,,,,,2002-12-31,F,,,,,01.2C,NAF1993,N,,,0,,,,,,
323987941,00032,32398794100032,O,1984-01-01,NN,,,2017-01-03T11:26:51,false,6,,4,,RUE,DE LA FROMAGERIE,39190,VAL-SONNETTE,,,39576,,,,,,,,,,,,,,,,,,,2008-10-01,F,,,,,27.90Z,NAFRev2,N,5.455634,46.590981,0.93,housenumber,4 Rue de la Fromagerie (Vercia) 39190 Val-Sonnette,39549_0045_00004,G,4 RUE DE LA FROMAGERIE,VERCIA
324288141,00017,32428814100017,O,1900-01-01,NN,,,2011-04-28T00:21:05,false,3,,,,,,39190,VAL-SONNETTE,,,39576,,,,,,,,,,,,,,,,,,,1994-08-31,F,,,,,52.2C,NAF1993,N,,,0,,,,,,
324635705,00027,32463570500027,O,1990-02-01,NN,,4520AA,2017-01-03T11:19:07,true,5,,,,,AUX ESSARDS,39190,VAL-SONNETTE,,,39576,,,,,,,,,,,,,,,,,,,2015-03-31,F,,,,,45.20A,NAFRev2,N,0.2936356,47.3422453,0.89,poi.track,Chemin de Restigné aux Essards Langeais,https://osm.org/way/219167587,G,,
327995205,00017,32799520500017,O,1968-09-01,NN,,,2017-01-03T11:10:58,true,7,,13,,,EN ROCHELLE,39190,VAL-SONNETTE,,,39576,,,,,,,,,,,,,,,,,,,2006-12-31,F,,,,,45.1A,NAFRev1,N,5.493235,46.598486,0.95,housenumber,13 En Rochelle 39190 Val-Sonnette,39264_b060_00013,G,13 EN ROCHELLE,
328683321,00017,32868332100017,O,1983-12-03,NN,,,2017-01-03T11:18:52,false,4,,14,,RUE,LES MARCHANDS,39190,VAL-SONNETTE,,,39576,,,,,,,,,,,,,,,,,,,2004-12-31,F,GUETTE JACKY PAYSAGISTE,,,,01.4B,NAFRev1,N,5.499668,46.597572,0.73,housenumber,14 Quartier les Marchands 39190 Val-Sonnette,39264_a020_00014,G,14 QUARTIER LES MARCHANDS,
328683321,00025,32868332100025,O,2004-12-31,01,2019,,2021-10-27T08:26:45,true,3,,12,,RUE,DES MARCHANDS,39190,VAL-SONNETTE,,,39576,,,,,,,,,,,,,,,,,,,2008-01-01,A,,,,,81.30Z,NAFRev2,N,5.499693,46.597643,0.65,housenumber,12 Quartier les Marchands 39190 Val-Sonnette,39264_a020_00012,G,12 QUARTIER LES MARCHANDS,
328750120,00029,32875012000029,O,2008-09-01,,,,2017-01-03T11:34:38,true,2,PAISIA,3,,RTE,NATIONALE,39190,VAL-SONNETTE,,,39576,,,,,,,,,,,,,,,,,,,2012-03-13,F,,,,,71.12B,NAFRev2,N,5.457748,46.596761,0.84,housenumber,3 Route Nationale 39190 Val-Sonnette,39549_0050_00003,G,3 ROUTE NATIONALE,
329293922,00053,32929392200053,O,2002-01-22,NN,,,2008-11-07T00:47:21,false,3,,19,,,GRANDE RUE,39190,VAL-SONNETTE,,,39576,,,,,,,,,,,,,,,,,,,2004-08-05,F,,,,,45.4J,NAFRev1,N,5.499255,46.599208,0.93,housenumber,19 Grande Rue (Grusse) 39190 Val-Sonnette,39264_0020_00019,G,19 GRANDE RUE,GRUSSE
332445535,00047,33244553500047,O,2002-10-01,,,,2017-01-03T11:11:06,false,3,,37,,RUE,ST ROCH,39190,VAL-SONNETTE,,,39576,,,,,,,,,,,,,,,,,,,2003-06-30,F,,,,,45.2V,NAFRev1,N,5.502412,46.597103,0.83,housenumber,37 Rue Saint-Roch 39190 Val-Sonnette,39264_0030_00037,G,37 RUE SAINT ROCH,
332445535,00054,33244553500054,O,2004-11-01,,,,2020-04-30T13:56:12,false,4,,,,,,39190,VAL-SONNETTE,,,39576,,,,,,,,,,,,,,,,,,,2014-04-01,F,,,,,01.49Z,NAFRev2,N,,,0,,,,,,
332543396,00011,33254339600011,O,,NN,,,,true,1,,,,,,39190,VAL-SONNETTE,,,39576,,,,,,,,,,,,,,,,,,,1987-06-30,F,,,,,51.1R,NAF1993,N,,,0,,,,,,
333765998,00013,33376599800013,O,,NN,,,,true,1,,8,,RUE,DES COURTILS,39190,VAL-SONNETTE,,,39576,,,,,,,,,,,,,,,,,,,1996-06-30,F,,,,,93.0D,NAF1993,N,5.478675,46.602445,0.95,housenumber,8 Rue des Courtils 39190 Val-Sonnette,39576_0030_00008,G,8 RUE DES COURTILS,
334543527,00025,33454352700025,O,1987-08-01,NN,,3109BA,2020-07-07T03:43:23,true,7,,,,,BONNAISOD,39190,VAL-SONNETTE,,,39576,,,,,,,,,,,,,,,,,,,2020-06-30,F,,,,,31.09B,NAFRev2,N,5.431714,46.613685,0.91,locality,Ham de Bonnaisod (Vincelles) 39190 Val-Sonnette,39576_B153,G,HAM DE BONNAISOD,VINCELLES
334714052,00019,33471405200019,O,,NN,,,,true,1,,,,,,39190,VAL-SONNETTE,,,39576,,,,,,,,,,,,,,,,,,,1990-08-31,F,,,,,69.22,NAP,N,,,0,,,,,,
338117625,00024,33811762500024,O,2011-11-02,,,,2021-02-23T10:54:46,true,1,,15,,RUE,DU PEROU,39190,VAL-SONNETTE,,,39576,,,,,,,,,,,,,,,,,,,2011-11-02,A,,,,,47.99A,NAFRev2,N,5.474781,46.600186,0.95,housenumber,15 Rue du Pérou 39190 Val-Sonnette,39576_0070_00015,G,15 RUE DU PEROU,
339658189,00016,33965818900016,O,1986-11-22,NN,,,2017-01-03T11:26:53,true,4,,,,,,39190,VAL-SONNETTE,,,39576,,,,,,,,,,,,,,,,,,,2009-09-30,F,,,,,90.03B,NAFRev2,N,,,0,,,,,,
340417195,00021,34041719500021,O,,NN,,,,true,1,,,,,,39190,VAL-SONNETTE,,,39576,,,,,,,,,,,,,,,,,,,1990-09-30,F,,,,,62.46,NAP,N,,,0,,,,,,
341335644,00025,34133564400025,O,2002-03-15,NN,,,2017-01-03T11:26:49,true,3,,8,,RTE,DE LA COMBE,39190,VAL-SONNETTE,,,39576,,,,,,,,,,,,,,,,,,,2008-01-01,A,,,,,41.10D,NAFRev2,N,5.456908,46.591159,0.85,housenumber,8 Route de la Combe 39190 Val-Sonnette,39549_0020_00008,G,8 ROUTE DE LA COMBE,
342411774,00025,34241177400025,O,1992-01-15,,,,,true,3,,,,,,39190,VAL-SONNETTE,,,39576,,,,,,,,,,,,,,,,,,,1996-11-13,F,,,,,65.2E,NAF1993,N,,,0,,,,,,
343138541,00010,34313854100010,O,1987-05-16,NN,,,2019-06-21T05:46:45,true,5,,,,LOT,DE L ETANG,39190,VAL-SONNETTE,,,39576,,,,,,,,,,,,,,,,,,,2019-05-02,A,,,,,90.03A,NAFRev2,N,5.459114,46.590503,0.69,street,Impasse de l’Etang 39190 Val-Sonnette,39549_0035,G,IMPASSE DE L ETANG,
343623807,00033,34362380700033,O,2002-02-01,NN,,,2008-04-25T00:19:16,false,3,,8,,RUE,DES VAILLANT,39190,VAL-SONNETTE,,,39576,,,,,,,,,,,,,,,,,,,2006-06-30,F,,,,,92.3A,NAFRev1,N,5.479524,46.59938,0.95,housenumber,8 Rue des Vaillant 39190 Val-Sonnette,39576_0105_00008,G,8 RUE DES VAILLANT,
344584990,00024,34458499000024,O,1989-06-28,NN,,,,true,4,,,,,,39190,VAL-SONNETTE,,,39576,,,,,,,,,,,,,,,,,,,2000-11-30,F,,,,,74.1J,NAF1993,N,,,0,,,,,,
348828450,00059,34882845000059,O,2003-09-01,NN,,,2009-12-16T11:13:43,false,4,,5,,RUE,DES VIGNES,39190,VAL-SONNETTE,,,39576,,,,,,,,,,,,,,,,,,,2008-05-01,F,,,,,96.02B,NAFRev2,N,5.480491,46.60067,0.95,housenumber,5 Rue des Vignes 39190 Val-Sonnette,39576_0125_00005,G,5 RUE DES VIGNES,
348874801,00015,34887480100015,O,1988-11-02,NN,,,,false,3,,,,,,39190,VAL-SONNETTE,,,39576,,,,,,,,,,,,,,,,,,,1993-03-26,F,,,,,51.2A,NAF1993,N,,,0,,,,,,
349580746,00023,34958074600023,O,1989-09-01,NN,,,2017-01-03T11:10:55,false,3,,,,,,39190,VAL-SONNETTE,,,39576,,,,,,,,,,,,,,,,,,,1994-08-01,F,,,,,45.3A,NAF1993,N,,,0,,,,,,
350115499,00013,35011549900013,O,1989-04-06,NN,,,2017-01-03T11:19:02,true,4,,1,,LD,EN VALOT,39190,VAL-SONNETTE,,,39576,,,,,,,,,,,,,,,,,,,2001-12-25,F,,,,,70.3A,NAF1993,N,5.497511,46.596218,0.76,housenumber,1 Quartier En Vallot 39190 Val-Sonnette,39264_a030_00001,G,1 QUARTIER EN VALLOT,
350798617,00014,35079861700014,O,1989-05-05,NN,,,,false,4,,,,,,39190,VAL-SONNETTE,,,39576,,,,,,,,,,,,,,,,,,,1996-08-12,F,,,,,70.1F,NAF1993,N,,,0,,,,,,
353050172,00041,35305017200041,O,2006-12-01,,,,2017-01-03T11:18:54,false,2,,12,,RUE,EN ROCHELLE,39190,VAL-SONNETTE,,,39576,,,,,,,,,,,,,,,,,,,2006-12-02,F,,,,,01.2G,NAFRev1,N,5.493226,46.598514,0.65,street,En Rochelle 39190 Val-Sonnette,39264_B060,G,EN ROCHELLE,
353050172,00058,35305017200058,O,2007-02-13,,,,2008-06-03T14:00:59,true,3,,6,,RUE,DES TEPPES,39190,VAL-SONNETTE,,,39576,,,,,,,,,,,,,,,,,,,2008-03-31,F,,,,,47.22Z,NAFRev2,N,5.471569,46.603376,0.95,housenumber,6 Rue des Teppes 39190 Val-Sonnette,39576_0095_00006,G,6 RUE DES TEPPES,
353477938,00016,35347793800016,O,1900-01-01,NN,,,2013-06-05T09:33:12,false,3,,,,,,39190,VAL-SONNETTE,,,39576,,,,,,,,,,,,,,,,,,,1994-12-31,F,,,,,52.2C,NAF1993,N,,,0,,,,,,
356000430,04106,35600043004106,O,1991-01-01,NN,,,2008-01-15T10:49:17,false,4,,2,,RUE,VERNOIS,39190,VAL-SONNETTE,,,39576,,,,,,,,,,,,,,,,,,,2008-01-07,F,BUREAU DE POSTE,,,,53.10Z,NAFRev2,O,5.480484,46.600581,0.87,housenumber,2 Rue du Vernois 39190 Val-Sonnette,39576_0115_00002,G,2 RUE DU VERNOIS,
377901137,00044,37790113700044,O,2005-10-14,,,,2017-01-03T11:26:49,false,2,,1,,IMP,DE L'ETANG,39190,VAL-SONNETTE,,,39576,,,,,,,,,,,,,,,,,,,2006-12-01,F,,,,,45.3F,NAFRev1,N,5.459402,46.590358,0.83,housenumber,1 Impasse de l’Etang 39190 Val-Sonnette,39549_0035_00001,G,1 IMPASSE DE L ETANG,
378265714,00055,37826571400055,O,2019-03-16,,,5610CQ,2021-02-23T11:07:00,true,2,VERCIA,3,,RUE,DES CRETS,39190,VAL-SONNETTE,,,39576,,,,,,,,,,,,,,,,,,,2020-03-06,A,,,,,56.10C,NAFRev2,N,5.458839,46.591696,0.65,housenumber,3 Chemin des Crets 39190 Val-Sonnette,39576_3ywxvc_00003,G,3 CHEMIN DES CRETS,
378811699,00016,37881169900016,O,1990-07-17,NN,,,2008-01-04T21:21:11,true,3,,,,,,39190,VAL-SONNETTE,,,39576,,,,,,,,,,,,,,,,,,,2008-01-01,A,,,,,68.20A,NAFRev2,N,,,0,,,,,,
378839005,00014,37883900500014,O,1990-07-01,NN,,,2017-01-03T11:19:01,true,4,,,,,,39190,VAL-SONNETTE,,,39576,,,,,,,,,,,,,,,,,,,1998-02-06,F,,,,,51.3J,NAF1993,O,,,0,,,,,,
379359029,00012,37935902900012,O,1990-08-01,NN,,,2009-10-13T14:32:49,true,4,,,,,CHATEAU DE ROCHELLE,39190,VAL-SONNETTE,,,39576,,,,,,,,,,,,,,,,,,,2009-12-25,F,,,,,85.59B,NAFRev2,N,5.493226,46.598514,0.48,street,En Rochelle 39190 Val-Sonnette,39264_B060,G,EN ROCHELLE,
381488394,00010,38148839400010,O,1991-02-01,NN,,,2017-05-04T02:20:52,false,5,,2,,,QUARTIER MINOTERIE,39190,VAL-SONNETTE,,,39576,,,,,,,,,,,,,,,,,,,2015-07-01,F,,,,,10.61A,NAFRev2,O,5.469682,46.599434,0.89,housenumber,2 Quartier de la Minoterie 39190 Val-Sonnette,39576_a005_00002,G,2 QUARTIER DE LA MINOTERIE,
381578954,00012,38157895400012,O,1991-04-09,NN,,,,true,1,,,,,,39190,VAL-SONNETTE,,,39576,,,,,,,,,,,,,,,,,,,1998-09-01,F,,,,,51.2A,NAF1993,O,,,0,,,,,,
381655653,00024,38165565300024,O,2006-10-03,,,,2017-01-03T11:34:34,false,5,PAISIA,,,RTE,DE LONGEVERNE,39190,VAL-SONNETTE,,,39576,,,,,,,,,,,,,,,,,,,2008-11-01,F,,,,,43.22A,NAFRev2,N,5.455488,46.59888,0.84,street,Route de Longeverne 39190 Val-Sonnette,39549_0048,G,ROUTE DE LONGEVERNE,
383329448,00039,38332944800039,O,2017-02-18,,,,2020-05-25T03:36:59,true,2,,14,,,LA DOYE,39190,VAL-SONNETTE,,,39576,,,,,,,,,,,,,,,,,,,2020-05-01,F,GEPAM FORMATION,,,,85.59B,NAFRev2,N,5.503429,46.593387,0.85,housenumber,14 Quartier la Doye 39190 Val-Sonnette,39264_a015_00014,G,14 QUARTIER LA DOYE,
383842820,00011,38384282000011,O,1991-11-27,NN,,,2017-01-03T11:03:14,false,3,,,,,,39190,VAL-SONNETTE,,,39576,,,,,,,,,,,,,,,,,,,1995-12-25,F,,,,,92.1C,NAF1993,O,,,0,,,,,,
383842820,00037,38384282000037,O,2009-10-15,,,,2017-01-03T11:03:14,true,2,CHEZ MR & MME COLIN,70,,RUE,DE LA FROMAGERIE,39190,VAL-SONNETTE,,,39576,,,,,,,,,,,,,,,,,,,2013-07-16,F,HOBERGE-COM ET LAROMANCE-NET,,,,82.99Z,NAFRev2,N,5.42636,46.616598,0.93,housenumber,70 Rue de la Fromagerie (Bonnaud) 39190 Val-Sonnette,39064_0010_00070,G,70 RUE DE LA FROMAGERIE,BONNAUD
384369146,00012,38436914600012,O,1992-01-01,NN,,,2021-02-23T11:12:32,true,6,,1,,RUE,DES VAILLANT,39190,VAL-SONNETTE,,,39576,,,,,,,,,,,,,,,,,,,2008-01-01,A,,,,,01.21Z,NAFRev2,N,5.479496,46.599605,0.95,housenumber,1 Rue des Vaillant 39190 Val-Sonnette,39576_0105_00001,G,1 RUE DES VAILLANT,
387747074,00046,38774707400046,O,2018-09-20,,,,2021-11-03T07:23:17,false,2,,1,T,RTE,LONGEVERNE,39190,VAL-SONNETTE,,,39576,,,,,,,,,,,,,,,,,,,2020-12-31,F,,,,,47.82Z,NAFRev2,N,5.453632,46.599272,0.84,housenumber,1t Route de Longeverne 39190 Val-Sonnette,39549_0048_00001_t,G,1T ROUTE DE LONGEVERNE,
389554551,00017,38955455100017,O,1992-11-02,NN,,,2017-01-03T11:11:05,true,5,MAIRIE DE GRUSSE,,,,,39190,VAL-SONNETTE,,,39576,,,,,,,,,,,,,,,,,,,2008-01-01,A,,,,,56.29B,NAFRev2,N,5.483157,46.600067,0.62,street,Route de Grusse 39190 Val-Sonnette,39576_0055,D,ROUTE DE GRUSSE,
391316809,00014,39131680900014,O,1993-06-01,NN,,,2017-01-06T11:36:17,true,7,,13,,,EN ROCHELLE,39190,VAL-SONNETTE,,,39576,,,,,,,,,,,,,,,,,,,2012-11-01,A,,,,,01.50Z,NAFRev2,N,5.493235,46.598486,0.95,housenumber,13 En Rochelle 39190 Val-Sonnette,39264_b060_00013,G,13 EN ROCHELLE,
392462362,00030,39246236200030,O,2018-08-03,,,1629ZA,2021-02-23T11:18:15,true,1,PAISIA,14,,CHE,DE LA BARDETTE,39190,VAL-SONNETTE,,,39576,,,,,,,,,,,,,,,,,,,2018-08-03,A,,,,,46.18Z,NAFRev2,O,5.461523,46.595681,0.74,housenumber,14 Quartier de la Bardette 39190 Val-Sonnette,39549_a005_00014,G,14 QUARTIER DE LA BARDETTE,
393032750,00019,39303275000019,O,1993-11-01,NN,,,2017-01-03T11:11:01,false,4,,,,,LA DOYE,39190,VAL-SONNETTE,,,39576,,,,,,,,,,,,,,,,,,,1995-12-25,F,,,,,45.3F,NAF1993,O,5.504489,46.594534,0.92,street,Quartier la Doye 39190 Val-Sonnette,39264_A015,G,QUARTIER LA DOYE,
393492327,00019,39349232700019,O,1994-01-03,NN,,,2011-12-30T10:06:28,false,4,,,,,,39190,VAL-SONNETTE,,,39576,,,,,,,,,,,,,,,,,,,2008-01-01,F,,,,,68.20B,NAFRev2,N,,,0,,,,,,
394047203,00028,39404720300028,O,1994-12-29,NN,,,,true,1,,144,,RTE,DE BONNAUD,39190,VAL-SONNETTE,,,39576,,,,,,,,,,,,,,,,,,,2000-12-31,F,,,,,92.3B,NAF1993,N,5.430711,46.613602,0.85,housenumber,144 Route de Bonnaud 39190 Val-Sonnette,39576_0020_00144,G,144 ROUTE DE BONNAUD,
398748673,00017,39874867300017,O,1994-10-24,NN,,,2008-11-08T01:05:22,false,4,,,,,,39190,VAL-SONNETTE,,,39576,,,,,,,,,,,,,,,,,,,2000-01-03,F,,,,,74.1J,NAF1993,N,,,0,,,,,,