siren,nic,siret,statutDiffusionEtablissement,dateCreationEtablissement,trancheEffectifsEtablissement,anneeEffectifsEtablissement,activitePrincipaleRegistreMetiersEtablissement,dateDernierTraitementEtablissement,etablissementSiege,nombrePeriodesEtablissement,complementAdresseEtablissement,numeroVoieEtablissement,indiceRepetitionEtablissement,typeVoieEtablissement,libelleVoieEtablissement,codePostalEtablissement,libelleCommuneEtablissement,libelleCommuneEtrangerEtablissement,distributionSpecialeEtablissement,codeCommuneEtablissement,codeCedexEtablissement,libelleCedexEtablissement,codePaysEtrangerEtablissement,libellePaysEtrangerEtablissement,complementAdresse2Etablissement,numeroVoie2Etablissement,indiceRepetition2Etablissement,typeVoie2Etablissement,libelleVoie2Etablissement,codePostal2Etablissement,libelleCommune2Etablissement,libelleCommuneEtranger2Etablissement,distributionSpeciale2Etablissement,codeCommune2Etablissement,codeCedex2Etablissement,libelleCedex2Etablissement,codePaysEtranger2Etablissement,libellePaysEtranger2Etablissement,dateDebut,etatAdministratifEtablissement,enseigne1Etablissement,enseigne2Etablissement,enseigne3Etablissement,denominationUsuelleEtablissement,activitePrincipaleEtablissement,nomenclatureActivitePrincipaleEtablissement,caractereEmployeurEtablissement,longitude,latitude,geo_score,geo_type,geo_adresse,geo_id,geo_ligne,geo_l4,geo_l5
214101347,00018,21410134700018,O,1983-03-01,03,2019,,2021-10-27T08:08:20,true,4,,24,,AV,GUILLAUME CHARRON,41500,MENARS,,,41134,,,,,,,,,,,,,,,,,,,2008-01-01,A,MAIRIE,,,,84.11Z,NAFRev2,O,1.407302,47.639898,0.87,housenumber,24 Avenue Guillaume Charron 41500 Menars,41134_0160_00024,G,24 AVENUE GUILLAUME CHARRON,
214101347,00026,21410134700026,O,1983-12-21,NN,,,,false,4,,,,,LE BOURG,41500,MENARS,,,41134,,,,,,,,,,,,,,,,,,,2003-08-31,F,ECOLE MATERNELLE PUBLIQUE,,,,80.1Z,NAFRev1,N,1.403569,47.646321,0.41,street,Le Courtois 41500 Menars,41134_rtcyvm,G,LE COURTOIS,
214101347,00034,21410134700034,O,1983-12-21,01,2019,,2021-10-27T08:08:20,false,3,,24,,AV,GUILLAUME CHARRON,41500,MENARS,,,41134,,,,,,,,,,,,,,,,,,,2008-01-01,A,ECOLE PRIMAIRE PUBLIQUE VICTOR HUGO,,,,85.20Z,NAFRev2,N,1.407302,47.639898,0.87,housenumber,24 Avenue Guillaume Charron 41500 Menars,41134_0160_00024,G,24 AVENUE GUILLAUME CHARRON,
214101347,00042,21410134700042,O,1995-01-01,NN,,,2013-10-05T12:22:26,false,4,,24,,AV,GUILLAUME CHARRON,41500,MENARS,,,41134,,,,,,,,,,,,,,,,,,,2012-12-25,F,SERVICE ASSAINISSEMENT,,,,37.00Z,NAFRev2,N,1.407302,47.639898,0.87,housenumber,24 Avenue Guillaume Charron 41500 Menars,41134_0160_00024,G,24 AVENUE GUILLAUME CHARRON,
214101347,00059,21410134700059,O,2000-02-08,NN,,,2013-10-05T12:22:26,false,4,MAIRIE,24,,AV,GUILLAUME CHARRON,41500,MENARS,,,41134,,,,,,,,,,,,,,,,,,,2012-12-25,F,LOTISSEMENT COMMUNAL,,,,42.99Z,NAFRev2,N,1.407302,47.639898,0.87,housenumber,24 Avenue Guillaume Charron 41500 Menars,41134_0160_00024,G,24 AVENUE GUILLAUME CHARRON,
214101347,00067,21410134700067,O,2002-03-22,NN,,,2013-03-30T12:01:43,false,4,MAIRIE,24,,AV,GUILLAUME CHARRON,41500,MENARS,,,41134,,,,,,,,,,,,,,,,,,,2008-03-03,F,LOTISSEMENT LE PARADIS,,,,42.99Z,NAFRev2,N,1.407302,47.639898,0.87,housenumber,24 Avenue Guillaume Charron 41500 Menars,41134_0160_00024,G,24 AVENUE GUILLAUME CHARRON,
244100244,00015,24410024400015,O,1991-06-28,NN,,,2006-01-26T15:03:58,false,4,MAIRIE,24,,AV,GUILLAUME CHARRON,41500,MENARS,,,41134,,,,,,,,,,,,,,,,,,,2002-01-30,F,,,,,75.1A,NAF1993,O,1.407302,47.639898,0.87,housenumber,24 Avenue Guillaume Charron 41500 Menars,41134_0160_00024,G,24 AVENUE GUILLAUME CHARRON,
244100244,00023,24410024400023,O,2000-11-03,NN,,,2006-11-25T09:08:35,false,4,MAIRIE,24,,AV,GUILLAUME CHARRON,41500,MENARS,,,41134,,,,,,,,,,,,,,,,,,,2002-01-30,F,LOGEMENT SOCIAL,,,,70.2A,NAF1993,N,1.407302,47.639898,0.87,housenumber,24 Avenue Guillaume Charron 41500 Menars,41134_0160_00024,G,24 AVENUE GUILLAUME CHARRON,
264102864,00016,26410286400016,O,1993-01-29,NN,,,2010-06-26T03:09:36,true,3,MAIRIE,24,,AV,GUILLAUME CHARRON,41500,MENARS,,,41134,,,,,,,,,,,,,,,,,,,2008-01-01,A,CCAS,,,,88.99B,NAFRev2,N,1.407302,47.639898,0.87,housenumber,24 Avenue Guillaume Charron 41500 Menars,41134_0160_00024,G,24 AVENUE GUILLAUME CHARRON,
294100342,00012,29410034200012,O,1983-09-27,NN,,,2006-10-26T23:46:22,true,3,MAIRIE,24,,AV,GUILLAUME CHARRON,41500,MENARS,,,41134,,,,,,,,,,,,,,,,,,,2005-02-18,F,,,,,70.1C,NAFRev1,N,1.407302,47.639898,0.87,housenumber,24 Avenue Guillaume Charron 41500 Menars,41134_0160_00024,G,24 AVENUE GUILLAUME CHARRON,
300407467,00012,30040746700012,O,,NN,,,,true,1,,42,,RUE,ROUBALLAY,41500,MENARS,,,41134,,,,,,,,,,,,,,,,,,,1996-12-31,F,,,,,45.4C,NAF1993,O,1.407217,47.64283,0.94,housenumber,42 Rue André Rouballay 41500 Menars,41134_0020_00042,G,42 RUE ANDRE ROUBALLAY,
300424454,00019,30042445400019,O,,,,,,true,1,,,,,LE CHATEAU,41500,MENARS,,,41134,,,,,,,,,,,,,,,,,,,1984-12-25,F,,,,,65.03,NAP,N,1.408897,47.640146,0.94,street,Le Chateau 41500 Menars,41134_oxyela,G,LE CHATEAU,
300646551,00014,30064655100014,O,,,,,,true,1,,,,RTE,NATIONALE,41500,MENARS,,,41134,,,,,,,,,,,,,,,,,,,1984-12-25,F,,,,,65.03,NAP,N,1.2279812,49.230352,0.77,poi,Route Nationale (Pont) Saint-Pierre-du-Vauvray,https://osm.org/way/95838375,G,,
302838065,00019,30283806500019,O,,NN,,,,true,1,,,,RUE,ROUBALLAY,41500,MENARS,,,41134,,,,,,,,,,,,,,,,,,,1989-06-30,F,,,,,55.71,NAP,N,1.407216,47.642512,0.94,street,Rue André Rouballay 41500 Menars,41134_0020,G,RUE ANDRE ROUBALLAY,
307956367,00055,30795636700055,O,1993-07-01,NN,,,,true,1,,1,,RUE,ROUBALLAY,41500,MENARS,,,41134,,,,,,,,,,,,,,,,,,,1999-12-30,F,,,,,70.2C,NAF1993,N,1.408613,47.640853,0.94,housenumber,1 Rue André Rouballay 41500 Menars,41134_0020_00001,G,1 RUE ANDRE ROUBALLAY,
308818962,00026,30881896200026,O,,NN,,,,true,1,,6,,RUE,DES CHAMPS HARDIS,41500,MENARS,,,41134,,,,,,,,,,,,,,,,,,,1991-08-30,F,,,,,77.08,NAP,N,1.406896,47.641052,0.94,housenumber,6 Rue des Champs Hardis 41500 Menars,41134_0040_00006,G,6 RUE DES CHAMPS HARDIS,
310999891,00032,31099989100032,O,1985-01-01,NN,,,,false,4,,70,,AV,GUILLAUME CHARRON,41500,MENARS,,,41134,,,,,,,,,,,,,,,,,,,1996-12-25,F,,,,,31.6D,NAF1993,O,1.404455,47.638608,0.87,housenumber,70 Avenue Guillaume Charron 41500 Menars,41134_0160_00070,G,70 AVENUE GUILLAUME CHARRON,
311215487,00019,31121548700019,O,,,,,,true,1,,21,,RUE,GUILLAUME CHARRON,41500,MENARS,,,41134,,,,,,,,,,,,,,,,,,,1988-07-18,F,,,,,67.01,NAP,N,1.406464,47.639409,0.84,housenumber,21 Avenue Guillaume Charron 41500 Menars,41134_0160_00021,G,21 AVENUE GUILLAUME CHARRON,
312316565,00018,31231656500018,O,1978-01-01,NN,,,,true,1,,54,,RUE,GUILLAUME CHARRON,41500,MENARS,,,41134,,,,,,,,,,,,,,,,,,,2000-07-01,F,,,,,85.1C,NAF1993,N,1.406339,47.639489,0.84,housenumber,54 Avenue Guillaume Charron 41500 Menars,41134_0160_00054,G,54 AVENUE GUILLAUME CHARRON,
312717903,00024,31271790300024,O,2007-11-16,,,,2008-01-04T20:17:20,true,2,,5,,RUE,DE PARADIS,41500,MENARS,,,41134,,,,,,,,,,,,,,,,,,,2007-12-15,F,,,,,80.4C,NAFRev1,N,1.405432,47.63771,0.78,housenumber,5 Rue du Paradis 41500 Menars,41134_0240_00005,G,5 RUE DU PARADIS,
314794959,00036,31479495900036,O,1992-07-01,,,,2008-11-07T00:30:11,true,4,,47,,RUE,MARIGNY,41500,MENARS,,,41134,,,,,,,,,,,,,,,,,,,1993-12-25,F,,,,,45.2V,NAF1993,N,1.407289,47.640201,0.94,housenumber,47 Rue de Marigny 41500 Menars,41134_0220_00047,G,47 RUE DE MARIGNY,
317088078,00025,31708807800025,O,,,,,,true,1,,27,,AV,GUILLAUME CHARRON,41500,MENARS,,,41134,,,,,,,,,,,,,,,,,,,1984-12-25,F,,,,,55.60,NAP,N,1.407117,47.639431,0.87,housenumber,27 Avenue Guillaume Charron 41500 Menars,41134_0160_00027,G,27 AVENUE GUILLAUME CHARRON,
317828838,00019,31782883800019,O,,NN,,,,true,1,,42,,AV,GUILLAUME CHARRON,41500,MENARS,,,41134,,,,,,,,,,,,,,,,,,,1987-08-31,F,,,,,67.07,NAP,N,1.407302,47.639898,0.87,housenumber,42 Avenue Guillaume Charron 41500 Menars,41134_0160_00042,G,42 AVENUE GUILLAUME CHARRON,
321656951,00019,32165695100019,O,1981-05-04,NN,,,2008-01-05T19:22:52,true,3,,,,,CLOS DES MARDELLES,41500,MENARS,,,41134,,,,,,,,,,,,,,,,,,,2008-01-01,A,,,,,68.20B,NAFRev2,N,1.409053,47.644318,0.68,street,Rue des Mardelles 41500 Menars,41134_0201,G,RUE DES MARDELLES,
321911687,00010,32191168700010,O,1977-01-01,,,,2006-01-10T15:56:37,true,4,,58,,AV,GUILLAUME CHARRON,41500,MENARS,,,41134,,,,,,,,,,,,,,,,,,,2002-12-31,F,,,,,67.2Z,NAF1993,N,1.406052,47.639316,0.87,housenumber,58 Avenue Guillaume Charron 41500 Menars,41134_0160_00058,G,58 AVENUE GUILLAUME CHARRON,
323432021,00026,32343202100026,O,1988-02-01,02,2019,4322AZ,2021-10-27T08:23:24,true,4,,78,,AV,GUILLAUME CHARRON,41500,MENARS,,,41134,,,,,,,,,,,,,,,,,,,2008-01-01,A,,,,,43.22A,NAFRev2,O,1.403149,47.638247,0.87,housenumber,78 Avenue Guillaume Charron 41500 Menars,41134_0160_00078,G,78 AVENUE GUILLAUME CHARRON,
323627786,00011,32362778600011,O,,,,,,true,1,,42,,AV,GUILLAUME CHARRON,41500,MENARS,,,41134,,,,,,,,,,,,,,,,,,,1984-12-25,F,,,,,69.23,NAP,N,1.407302,47.639898,0.87,housenumber,42 Avenue Guillaume Charron 41500 Menars,41134_0160_00042,G,42 AVENUE GUILLAUME CHARRON,
324123090,00023,32412309000023,O,,NN,,,,true,1,,28,,RUE,PIERRE ROBIN,41500,MENARS,,,41134,,,,,,,,,,,,,,,,,,,1995-12-31,F,,,,,67.2Z,NAF1993,N,1.409421,47.643933,0.95,housenumber,28 Rue Pierre Robin 41500 Menars,41134_0310_00028,G,28 RUE PIERRE ROBIN,
324759828,00035,32475982800035,O,2018-12-01,,,,2021-02-23T10:47:34,true,1,,16,,RUE,PIERRE ROBIN,41500,MENARS,,,41134,,,,,,,,,,,,,,,,,,,2018-12-01,A,,,,,82.99Z,NAFRev2,N,1.410133,47.643821,0.95,housenumber,16 Rue Pierre Robin 41500 Menars,41134_0310_00016,G,16 RUE PIERRE ROBIN,
324764349,00027,32476434900027,O,2007-09-24,,,,2014-07-08T00:29:18,false,3,,12,,RUE,PIERRE ROBIN,41500,MENARS,,,41134,,,,,,,,,,,,,,,,,,,2011-07-13,F,,,,,43.39Z,NAFRev2,N,1.410621,47.64361,0.95,housenumber,12 Rue Pierre Robin 41500 Menars,41134_0310_00012,G,12 RUE PIERRE ROBIN,
325955896,00015,32595589600015,O,,,,,,true,1,,27,,AV,GUILLAUME CHARRON,41500,MENARS,,,41134,,,,,,,,,,,,,,,,,,,1984-12-25,F,,,,,55.60,NAP,N,1.407117,47.639431,0.87,housenumber,27 Avenue Guillaume Charron 41500 Menars,41134_0160_00027,G,27 AVENUE GUILLAUME CHARRON,
326454139,00022,32645413900022,O,,NN,,,,true,1,,,,,ZONE ARTISANALE,41500,MENARS,,,41134,,,,,,,,,,,,,,,,,,,1996-03-31,F,,,,,28.5D,NAF1993,N,2.7640352,42.6301915,0.9,poi.retail,Zone Artisanale (Zone commerciale) Thuir,https://osm.org/way/191039530,G,,
326944600,00021,32694460000021,O,1983-03-31,01,2019,,2021-10-27T08:25:35,false,5,CIDES 0503,,,,CHATEAU DE MENARS,41500,MENARS,,,41134,,,,,,,,,,,,,,,,,,,2013-12-31,A,,,,,66.19A,NAFRev2,O,1.408897,47.640146,0.73,street,Le Chateau 41500 Menars,41134_oxyela,G,LE CHATEAU,
327137501,00018,32713750100018,O,,,,,,true,1,,,,,CHATEAU DE MENARS,41500,MENARS,,,41134,,,,,,,,,,,,,,,,,,,,F,,,,,67.08,NAP,N,1.408897,47.640146,0.73,street,Le Chateau 41500 Menars,41134_oxyela,G,LE CHATEAU,
327581393,00011,32758139300011,O,1983-04-01,NN,,,2018-09-29T12:23:31,true,4,,,,,MAIRIE,41500,MENARS,,,41134,,,,,,,,,,,,,,,,,,,2008-01-01,A,,,,,94.99Z,NAFRev2,O,3.0709671,50.6304695,0.92,poi.townhall,Hôtel de Ville Lille,https://osm.org/way/40917078,G,,
328011044,00018,32801104400018,O,,NN,,,,true,1,,28,,RES,PRIMEVERES,41500,MENARS,,,41134,,,,,,,,,,,,,,,,,,,,F,,,,,69.23,NAP,N,-1.1833292,46.7206156,0.88,poi.residential,Cité des Primevères (Zone résidentielle) Saint-Martin-des-Noyers,https://osm.org/way/328869763,G,,
328105176,00023,32810517600023,O,1998-06-05,NN,,,2006-11-25T10:07:03,true,3,,12,,RUE,DES GREVES,41500,MENARS,,,41134,,,,,,,,,,,,,,,,,,,2004-12-30,F,,,,,51.4S,NAFRev1,N,1.409463,47.643508,0.95,housenumber,12 Rue des Grèves 41500 Menars,41134_0140_00012,G,12 RUE DES GREVES,
328711270,00046,32871127000046,O,1990-11-05,NN,,,,false,3,,37,,RUE,MARIGNY,41500,MENARS,,,41134,,,,,,,,,,,,,,,,,,,1996-11-01,F,,,,,70.1D,NAF1993,N,1.404759,47.642337,0.94,housenumber,37 Rue de Marigny 41500 Menars,41134_0220_00037,G,37 RUE DE MARIGNY,
329479331,00012,32947933100012,O,1984-02-24,NN,,,2008-01-05T19:26:44,true,3,,,,,,41500,MENARS,,,41134,,,,,,,,,,,,,,,,,,,2008-01-01,A,,,,,68.20B,NAFRev2,N,,,0,,,,,,
330054719,00019,33005471900019,O,1984-06-01,NN,,,2013-07-04T11:10:32,false,4,,37,,RUE,DE MARIGNY,41500,MENARS,,,41134,,,,,,,,,,,,,,,,,,,2012-05-21,F,,,,,68.20B,NAFRev2,N,1.404759,47.642337,0.95,housenumber,37 Rue de Marigny 41500 Menars,41134_0220_00037,G,37 RUE DE MARIGNY,
330734385,00025,33073438500025,O,1989-09-09,NN,,,2006-11-25T10:14:47,true,4,,46,,RUE,ROUBALLAY,41500,MENARS,,CIDEX 508,41134,,,,,,,,,,,,,,,,,,,2004-12-31,F,,,,,52.6D,NAFRev1,N,1.40659,47.643176,0.94,housenumber,46 Rue André Rouballay 41500 Menars,41134_0020_00046,G,46 RUE ANDRE ROUBALLAY,
332627223,00016,33262722300016,O,1985-04-29,,,,,false,3,,22,,RUE,PIERRE ROBIN,41500,MENARS,,,41134,,,,,,,,,,,,,,,,,,,1997-11-01,F,,,,,70.2C,NAF1993,N,1.409764,47.64422,0.95,housenumber,22 Rue Pierre Robin 41500 Menars,41134_0310_00022,G,22 RUE PIERRE ROBIN,
334124674,00022,33412467400022,O,1986-06-01,NN,,9602AA,2016-04-26T03:18:48,true,5,,4,,PL,PRINCE DE CHIMAY,41500,MENARS,,,41134,,,,,,,,,,,,,,,,,,,2014-08-31,A,,,,,96.02A,NAFRev2,N,1.4085,47.640684,0.85,housenumber,4 Place du Prince de Chimay 41500 Menars,41134_0320_00004,G,4 PLACE DU PRINCE DE CHIMAY,
338012412,00023,33801241200023,O,2015-10-22,01,2019,,2021-10-27T08:31:38,true,1,,16,,RUE,CLOS BODEAU,41500,MENARS,,,41134,,,,,,,,,,,,,,,,,,,2015-10-22,A,,,,,70.22Z,NAFRev2,N,1.405208,47.637222,0.9,housenumber,16 Rue du Clos Bodeau 41500 Menars,41134_0060_00016,G,16 RUE DU CLOS BODEAU,
338083504,00021,33808350400021,O,1998-04-30,,,,,true,2,,41,,RUE,DE MARIGNY,41500,MENARS,,,41134,,,,,,,,,,,,,,,,,,,1998-12-25,F,,,,,01.1A,NAF1993,N,1.404563,47.642722,0.95,housenumber,41 Rue de Marigny 41500 Menars,41134_0220_00041,G,41 RUE DE MARIGNY,
338318538,00018,33831853800018,O,,NN,,,,true,1,,,,RUE,DE LA COUR DU PUITS,41500,MENARS,,,41134,,,,,,,,,,,,,,,,,,,,F,,,,,62.41,NAP,N,1.406674,47.645028,0.94,street,Rue de la Cour du Puits 41500 Menars,41134_0080,G,RUE DE LA COUR DU PUITS,
338318686,00015,33831868600015,O,,NN,,,,true,1,,,,RUE,DE LA COUR DU PUITS,41500,MENARS,,,41134,,,,,,,,,,,,,,,,,,,,F,,,,,62.41,NAP,N,1.406674,47.645028,0.94,street,Rue de la Cour du Puits 41500 Menars,41134_0080,G,RUE DE LA COUR DU PUITS,
338318744,00012,33831874400012,O,,NN,,,,true,1,,,,RUE,DE LA COUR DU PUITS,41500,MENARS,,,41134,,,,,,,,,,,,,,,,,,,,F,,,,,62.41,NAP,N,1.406674,47.645028,0.94,street,Rue de la Cour du Puits 41500 Menars,41134_0080,G,RUE DE LA COUR DU PUITS,
340566199,00030,34056619900030,O,2001-02-01,NN,,,2018-04-06T14:59:07,false,4,,15,,RUE,DE LA LOIRE,41500,MENARS,,,41134,,,,,,,,,,,,,,,,,,,2017-12-31,F,,,,,69.20Z,NAFRev2,N,1.407536,47.63867,0.94,housenumber,15 Rue de la Loire 41500 Menars,41134_0180_00015,G,15 RUE DE LA LOIRE,
340635366,00032,34063536600032,O,2003-06-01,NN,,,2014-06-14T03:25:48,true,4,,42,,AV,GUILLAUME CHARRON,41500,MENARS,,,41134,,,,,,,,,,,,,,,,,,,2012-02-14,F,,,,,56.30Z,NAFRev2,O,1.407302,47.639898,0.87,housenumber,42 Avenue Guillaume Charron 41500 Menars,41134_0160_00042,G,42 AVENUE GUILLAUME CHARRON,
341110534,00029,34111053400029,O,2001-05-31,NN,,,2009-06-12T04:19:28,true,5,,2,,RUE,DE LA FONTAINE,41500,MENARS,,,41134,,,,,,,,,,,,,,,,,,,2009-04-25,F,,,,,68.20B,NAFRev2,N,1.408222,47.640633,0.94,housenumber,2 Rue de la Fontaine 41500 Menars,41134_0120_00002,G,2 RUE DE LA FONTAINE,
341208882,00017,34120888200017,O,,NN,,,,true,1,,,,,AUTOROUTE A 10,41500,MENARS,,,41134,,,,,,,,,,,,,,,,,,,1988-02-15,F,,,,,50.5Z,NAF1993,N,0.690783,47.3087458,0.87,poi.motorway_junction,Échangeur entre A 10 et A 85 (Embranchement d'autoroute) Veigné,https://osm.org/node/85683961,G,,
341910008,00018,34191000800018,O,,NN,,,,true,1,,55,,RUE,ANDRE ROUBALLAY,41500,MENARS,,,41134,,,,,,,,,,,,,,,,,,,1994-01-01,F,,,,,70.2C,NAF1993,N,1.405757,47.643672,0.95,housenumber,55 Rue André Rouballay 41500 Menars,41134_0020_00055,G,55 RUE ANDRE ROUBALLAY,
342474491,00012,34247449100012,O,,NN,,,,true,1,,42,,AV,GUILLAUME CHARRON,41500,MENARS,,,41134,,,,,,,,,,,,,,,,,,,1996-10-18,F,,,,,55.4A,NAF1993,N,1.407302,47.639898,0.87,housenumber,42 Avenue Guillaume Charron 41500 Menars,41134_0160_00042,G,42 AVENUE GUILLAUME CHARRON,
343410775,00013,34341077500013,O,1987-10-01,NN,,,,true,1,,37,,RUE,DE MARIGNY,41500,MENARS,,,41134,,,,,,,,,,,,,,,,,,,2002-12-31,F,,,,,70.2C,NAF1993,N,1.404759,47.642337,0.95,housenumber,37 Rue de Marigny 41500 Menars,41134_0220_00037,G,37 RUE DE MARIGNY,
347749137,00019,34774913700019,O,1988-07-18,NN,,,,true,1,,,,,ROUTE NATIONALE 152,41500,MENARS,,,41134,,,,,,,,,,,,,,,,,,,2001-02-18,F,,,,,55.3A,NAF1993,O,,,0,,,,,,
348282484,00016,34828248400016,O,1988-10-03,NN,,,,true,4,,,,RUE,DES GREVES,41500,MENARS,,,41134,,,,,,,,,,,,,,,,,,,1991-12-25,F,,,,,76.00,NAP,N,1.409689,47.642741,0.95,street,Rue des Grèves 41500 Menars,41134_0140,G,RUE DES GREVES,
349344481,00016,34934448100016,O,1988-11-01,NN,,,,true,1,,50,,AV,GUILLAUME CHARRON,41500,MENARS,,,41134,,,,,,,,,,,,,,,,,,,2001-10-27,F,,,,,70.2C,NAF1993,N,1.406721,47.639669,0.87,housenumber,50 Avenue Guillaume Charron 41500 Menars,41134_0160_00050,G,50 AVENUE GUILLAUME CHARRON,
350043519,00015,35004351900015,O,1988-08-01,NN,,,,true,1,,29,,RUE,GUILLAUME CHARRON,41500,MENARS,,,41134,,,,,,,,,,,,,,,,,,,2000-12-31,F,,,,,70.2C,NAF1993,N,1.406975,47.639648,0.84,housenumber,29 Avenue Guillaume Charron 41500 Menars,41134_0160_00029,G,29 AVENUE GUILLAUME CHARRON,
351959879,00039,35195987900039,O,2000-05-11,NN,,,,true,4,,42,,AV,GUILLAUME CHARRON,41500,MENARS,,,41134,,,,,,,,,,,,,,,,,,,2003-06-01,F,,,,,55.4A,NAFRev1,N,1.407302,47.639898,0.87,housenumber,42 Avenue Guillaume Charron 41500 Menars,41134_0160_00042,G,42 AVENUE GUILLAUME CHARRON,
353635451,00027,35363545100027,O,,NN,,,,true,1,,37,,RUE,DE MARIGNY,41500,MENARS,,,41134,,,,,,,,,,,,,,,,,,,1995-12-30,F,,,,,70.3A,NAF1993,N,1.404759,47.642337,0.95,housenumber,37 Rue de Marigny 41500 Menars,41134_0220_00037,G,37 RUE DE MARIGNY,
353768096,00011,35376809600011,O,1989-10-01,NN,,,,true,4,,58,,AV,GUILLAUME CHARRON,41500,MENARS,,,41134,,,,,,,,,,,,,,,,,,,2003-09-30,F,,,,,67.2Z,NAFRev1,N,1.406052,47.639316,0.87,housenumber,58 Avenue Guillaume Charron 41500 Menars,41134_0160_00058,G,58 AVENUE GUILLAUME CHARRON,
356000240,05049,35600024005049,O,1991-01-01,NN,,,2009-10-17T12:20:11,false,4,,7,,RUE,MARIGNY,41500,MENARS,,,41134,,,,,,,,,,,,,,,,,,,2009-03-18,F,BUREAU DE POSTE,,,,53.10Z,NAFRev2,O,1.407214,47.640565,0.94,housenumber,7 Rue de Marigny 41500 Menars,41134_0220_00007,G,7 RUE DE MARIGNY,
377545488,00019,37754548800019,O,1990-03-30,NN,,,2014-10-23T03:10:44,false,3,,54,,RUE,GUILLAUME CHARRON,41500,MENARS,,,41134,,,,,,,,,,,,,,,,,,,2008-01-01,A,,,,,68.20B,NAFRev2,N,1.406339,47.639489,0.84,housenumber,54 Avenue Guillaume Charron 41500 Menars,41134_0160_00054,G,54 AVENUE GUILLAUME CHARRON,
377783048,00020,37778304800020,O,1990-06-25,NN,,,2018-03-22T03:55:15,true,3,,6,,RUE,DES CHAMPS HARDIS,41500,MENARS,,,41134,,,,,,,,,,,,,,,,,,,2008-01-01,A,,,,,68.20B,NAFRev2,N,1.406896,47.641052,0.94,housenumber,6 Rue des Champs Hardis 41500 Menars,41134_0040_00006,G,6 RUE DES CHAMPS HARDIS,
378035026,00038,37803502600038,O,1996-06-06,NN,,,2007-02-06T05:57:00,true,4,,4,,RUE,DES GREVES,41500,MENARS,,,41134,,,,,,,,,,,,,,,,,,,2003-07-15,F,,,,,70.2C,NAFRev1,N,1.410295,47.642301,0.95,housenumber,4 Rue des Grèves 41500 Menars,41134_0140_00004,G,4 RUE DES GREVES,
378491997,00011,37849199700011,O,1990-05-01,12,2019,2562BZ,2021-10-27T08:06:16,true,4,,,,,ZONE ARTISANALE,41500,MENARS,,,41134,,,,,,,,,,,,,,,,,,,2008-01-01,A,,,,,25.62B,NAFRev2,O,2.7640352,42.6301915,0.9,poi.retail,Zone Artisanale (Zone commerciale) Thuir,https://osm.org/way/191039530,G,,
378830566,00014,37883056600014,O,1990-07-01,NN,,,,true,4,,,,RTE,NATIONALE,41500,MENARS,,,41134,,,,,,,,,,,,,,,,,,,1999-01-15,F,,,,,50.1Z,NAF1993,O,1.2279812,49.230352,0.77,poi,Route Nationale (Pont) Saint-Pierre-du-Vauvray,https://osm.org/way/95838375,G,,
379105513,00012,37910551300012,O,1990-08-28,NN,,,,false,4,,70,,AV,GUILLAUME CHARRON,41500,MENARS,,,41134,,,,,,,,,,,,,,,,,,,1996-03-11,F,,,,,74.1J,NAF1993,N,1.404455,47.638608,0.87,housenumber,70 Avenue Guillaume Charron 41500 Menars,41134_0160_00070,G,70 AVENUE GUILLAUME CHARRON,
379455231,00694,37945523100694,O,1998-05-01,,,,2010-01-21T10:03:59,false,4,A10,,,,AIRE DE MENARS,41500,MENARS,,,41134,,,,,,,,,,,,,,,,,,,2008-01-01,A,POMME DE PAIN,,,,56.10A,NAFRev2,N,1.407238,47.639179,0.8,street,Rue de la Loire 41500 Menars,41134_0180,G,RUE DE LA LOIRE,
379461346,00015,37946134600015,O,1900-01-01,NN,,,2017-05-17T08:19:45,false,3,,6,,RUE,DES CHAMPS HARDIS,41500,MENARS,,,41134,,,,,,,,,,,,,,,,,,,1989-12-31,F,,,,,87.06,NAP,N,1.406896,47.641052,0.94,housenumber,6 Rue des Champs Hardis 41500 Menars,41134_0040_00006,G,6 RUE DES CHAMPS HARDIS,
379977077,00039,37997707700039,O,2011-10-01,,,,2021-02-23T11:08:30,true,1,,53,B,AV,GUILLAUME CHARRON,41500,MENARS,,,41134,,,,,,,,,,,,,,,,,,,2011-10-01,A,,,,,86.90D,NAFRev2,N,1.407341,47.639916,0.88,housenumber,53b Avenue Guillaume Charron 41500 Menars,41134_0160_00053_b,G,53B AVENUE GUILLAUME CHARRON,
380644807,00014,38064480700014,O,1991-01-16,NN,,,2014-10-01T08:38:35,false,4,,,,RUE,DU COURTOIS PROLONGEE,41500,MENARS,,,41134,,,,,,,,,,,,,,,,,,,2014-01-01,F,,,,,68.20B,NAFRev2,N,1.404579,47.645499,0.63,street,Rue du Courtois 41500 Menars,41134_0085,G,RUE DU COURTOIS,
382387199,00013,38238719900013,O,1989-01-01,NN,,,,true,1,,40,,AV,GUILLAUME CHARRON,41500,MENARS,,,41134,,,,,,,,,,,,,,,,,,,1998-12-31,F,,,,,01.3Z,NAF1993,N,1.407302,47.639898,0.87,housenumber,40 Avenue Guillaume Charron 41500 Menars,41134_0160_00040,G,40 AVENUE GUILLAUME CHARRON,
382540169,00036,38254016900036,O,2001-05-15,NN,,9529ZE,2016-03-29T04:10:02,false,4,,25,,RUE,ROUBALLAY,41500,MENARS,,,41134,,,,,,,,,,,,,,,,,,,2016-01-01,F,,,,,95.29Z,NAFRev2,N,1.407807,47.642306,0.94,housenumber,25 Rue André Rouballay 41500 Menars,41134_0020_00025,G,25 RUE ANDRE ROUBALLAY,
383869062,00018,38386906200018,O,1991-11-04,NN,,,2008-11-08T00:44:05,true,4,ZA,,,RUE,DU COURTOIS PROLONGEE,41500,MENARS,,,41134,,,,,,,,,,,,,,,,,,,2004-11-23,F,,,,,33.1B,NAFRev1,O,1.404579,47.645499,0.63,street,Rue du Courtois 41500 Menars,41134_0085,G,RUE DU COURTOIS,
384258497,00021,38425849700021,O,1997-07-15,NN,,4334ZC,2021-04-06T11:32:30,true,5,,21,,RUE,ROUBALLAY,41500,MENARS,,,41134,,,,,,,,,,,,,,,,,,,2021-03-01,A,,,,MARCHAND-DECOR,43.34Z,NAFRev2,N,1.408267,47.641713,0.94,housenumber,21 Rue André Rouballay 41500 Menars,41134_0020_00021,G,21 RUE ANDRE ROUBALLAY,
385231998,00019,38523199800019,O,1992-04-04,NN,,,2006-10-28T01:12:22,false,3,,47,,RUE,MARIGNY,41500,MENARS,,,41134,,,,,,,,,,,,,,,,,,,2004-04-06,F,,,,,70.2C,NAFRev1,N,1.407289,47.640201,0.94,housenumber,47 Rue de Marigny 41500 Menars,41134_0220_00047,G,47 RUE DE MARIGNY,
385231998,00027,38523199800027,O,2004-04-06,NN,,,2008-01-05T19:57:40,true,3,,42,,RUE,ANDRE ROUBALAY,41500,MENARS,,,41134,,,,,,,,,,,,,,,,,,,2008-01-01,A,,,,,68.20B,NAFRev2,N,1.407217,47.64283,0.91,housenumber,42 Rue André Rouballay 41500 Menars,41134_0020_00042,G,42 RUE ANDRE ROUBALLAY,
388941627,00076,38894162700076,O,2009-04-22,,,,2011-05-26T11:37:49,false,2,,47,,RUE,DE MARIGNY,41500,MENARS,,,41134,,,,,,,,,,,,,,,,,,,2010-10-31,F,,,,,43.32B,NAFRev2,N,1.407289,47.640201,0.95,housenumber,47 Rue de Marigny 41500 Menars,41134_0220_00047,G,47 RUE DE MARIGNY,
389367038,00020,38936703800020,O,1996-10-01,NN,,,,true,4,,,,RUE,DE LA LOIRE,41500,MENARS,,CIDEX 524,41134,,,,,,,,,,,,,,,,,,,2000-12-22,F,,,,,51.6K,NAF1993,O,1.407238,47.639179,0.94,street,Rue de la Loire 41500 Menars,41134_0180,G,RUE DE LA LOIRE,
389958653,00013,38995865300013,O,1993-01-05,NN,,,2014-07-08T01:16:58,false,4,,40,,RUE,GUILLAUME CHARRON,41500,MENARS,,,41134,,,,,,,,,,,,,,,,,,,2013-05-01,F,,,,,47.22Z,NAFRev2,N,1.407302,47.639898,0.84,housenumber,40 Avenue Guillaume Charron 41500 Menars,41134_0160_00040,G,40 AVENUE GUILLAUME CHARRON,