siren,nic,siret,statutDiffusionEtablissement,dateCreationEtablissement,trancheEffectifsEtablissement,anneeEffectifsEtablissement,activitePrincipaleRegistreMetiersEtablissement,dateDernierTraitementEtablissement,etablissementSiege,nombrePeriodesEtablissement,complementAdresseEtablissement,numeroVoieEtablissement,indiceRepetitionEtablissement,typeVoieEtablissement,libelleVoieEtablissement,codePostalEtablissement,libelleCommuneEtablissement,libelleCommuneEtrangerEtablissement,distributionSpecialeEtablissement,codeCommuneEtablissement,codeCedexEtablissement,libelleCedexEtablissement,codePaysEtrangerEtablissement,libellePaysEtrangerEtablissement,complementAdresse2Etablissement,numeroVoie2Etablissement,indiceRepetition2Etablissement,typeVoie2Etablissement,libelleVoie2Etablissement,codePostal2Etablissement,libelleCommune2Etablissement,libelleCommuneEtranger2Etablissement,distributionSpeciale2Etablissement,codeCommune2Etablissement,codeCedex2Etablissement,libelleCedex2Etablissement,codePaysEtranger2Etablissement,libellePaysEtranger2Etablissement,dateDebut,etatAdministratifEtablissement,enseigne1Etablissement,enseigne2Etablissement,enseigne3Etablissement,denominationUsuelleEtablissement,activitePrincipaleEtablissement,nomenclatureActivitePrincipaleEtablissement,caractereEmployeurEtablissement,longitude,latitude,geo_score,geo_type,geo_adresse,geo_id,geo_ligne,geo_l4,geo_l5
085570950,00015,08557095000015,O,,,,,,true,1,,,,,,45550,SAINT DENIS DE L'HOTEL,,,45273,,,,,,,,,,,,,,,,,,,1984-12-25,F,,,,,55.71,NAP,N,,,0,,,,,,
085574333,00010,08557433300010,O,,,,,,true,1,,5,,AV,D ORLEANS,45550,SAINT DENIS DE L'HOTEL,,,45273,,,,,,,,,,,,,,,,,,,1987-06-30,F,,,,,67.08,NAP,N,2.127511,47.872379,0.84,housenumber,5 Avenue d’Orléans 45550 Saint-Denis-de-l'Hôtel,45273_0420_00005,G,5 AVENUE D ORLEANS,
085581494,00011,08558149400011,O,1955-01-01,NN,,,2006-12-15T00:14:50,false,4,,,,,GRANDE RUE,45550,SAINT DENIS DE L'HOTEL,,BP 10,45273,,,,,,,,,,,,,,,,,,,2002-12-31,F,,,,,15.5A,NAF1993,O,2.125536,47.871621,0.96,street,Grande Rue 45550 Saint-Denis-de-l'Hôtel,45273_0480,G,GRANDE RUE,
085581494,00029,08558149400029,O,2002-12-16,41,2019,,2021-10-27T08:03:24,true,7,LES GRANDES BEAUGINES,10,,RTE,DE L AERODROME,45550,SAINT DENIS DE L'HOTEL,,,45273,,,,,,,,,,,,,,,,,,,2008-01-02,A,,,,,11.07B,NAFRev2,O,2.130228,47.883511,0.87,housenumber,10 Route de l’Aérodrome 45550 Saint-Denis-de-l'Hôtel,45273_0011_00010,G,10 ROUTE DE L AERODROME,
085672947,00018,08567294700018,O,,,,,,true,1,,,,RTE,DE FAY,45550,SAINT DENIS DE L'HOTEL,,,45273,,,,,,,,,,,,,,,,,,,1984-12-25,F,,,,,55.60,NAP,N,2.127363,47.884233,0.78,street,Route de Fay 45550 Saint-Denis-de-l'Hôtel,45273_0217,G,ROUTE DE FAY,
085770394,00022,08577039400022,O,,,,,,true,1,,,,RTE,NATIONALE,45550,SAINT DENIS DE L'HOTEL,,,45273,,,,,,,,,,,,,,,,,,,1984-12-25,F,,,,,64.24,NAP,N,2.128151,47.870377,0.3,street,Venelle de la Tête Verte 45550 Saint-Denis-de-l'Hôtel,45273_0551,G,VENELLE DE LA TETE VERTE,
085773810,00016,08577381000016,O,,NN,,,,true,1,,,,,GRANDE RUE,45550,SAINT DENIS DE L'HOTEL,,,45273,,,,,,,,,,,,,,,,,,,,F,,,,,62.43,NAP,N,2.125536,47.871621,0.96,street,Grande Rue 45550 Saint-Denis-de-l'Hôtel,45273_0480,G,GRANDE RUE,
085774164,00025,08577416400025,O,,,,,,true,1,,,,AV,DE LA TETE VERTE,45550,SAINT DENIS DE L'HOTEL,,,45273,,,,,,,,,,,,,,,,,,,1984-12-25,F,,,,,38.40,NAP,N,2.129061,47.870634,0.86,street,Avenue de la Tete Verte 45550 Saint-Denis-de-l'Hôtel,45273_0550,G,AVENUE DE LA TETE VERTE,
085774719,00018,08577471900018,O,1957-01-01,NN,,,2016-01-12T00:10:20,true,3,,,,RUE,DES JUIFS,45550,SAINT DENIS DE L'HOTEL,,,45273,,,,,,,,,,,,,,,,,,,2008-01-01,A,,,,,01.21Z,NAFRev2,N,2.129227,47.869788,0.95,street,Rue des Juifs 45550 Saint-Denis-de-l'Hôtel,45273_0320,G,RUE DES JUIFS,
085881126,00016,08588112600016,O,1958-01-01,NN,,,,true,1,,9,,RTE,DE CHENAILLES,45550,SAINT DENIS DE L'HOTEL,,,45273,,,,,,,,,,,,,,,,,,,1998-12-17,F,,,,,15.7A,NAF1993,O,2.134397,47.871416,0.86,housenumber,9 Route de Chenailles 45550 Saint-Denis-de-l'Hôtel,45273_0120_00009,G,9 ROUTE DE CHENAILLES,
085901965,00013,08590196500013,O,,,,,,true,1,,,,RTE,D ORLEANS,45550,SAINT DENIS DE L'HOTEL,,,45273,,,,,,,,,,,,,,,,,,,1990-02-01,F,,,,,65.06,NAP,N,2.120614,47.874061,0.76,street,Avenue d’Orléans 45550 Saint-Denis-de-l'Hôtel,45273_0420,G,AVENUE D ORLEANS,
086001682,00011,08600168200011,O,,,,,,true,1,,,,RTE,DE GIEN,45550,SAINT DENIS DE L'HOTEL,,,45273,,,,,,,,,,,,,,,,,,,1984-12-25,F,,,,,65.06,NAP,N,2.129061,47.870634,0.49,street,Avenue de la Tete Verte 45550 Saint-Denis-de-l'Hôtel,45273_0550,G,AVENUE DE LA TETE VERTE,
086002623,00014,08600262300014,O,,NN,,,,true,1,,,,RTE,D ORLEANS,45550,SAINT DENIS DE L'HOTEL,,,45273,,,,,,,,,,,,,,,,,,,1987-12-31,F,,,,,67.04,NAP,N,2.120614,47.874061,0.76,street,Avenue d’Orléans 45550 Saint-Denis-de-l'Hôtel,45273_0420,G,AVENUE D ORLEANS,
086078359,00014,08607835900014,O,,NN,,,,true,1,,20,,AV,D ORLEANS,45550,SAINT DENIS DE L'HOTEL,,,45273,,,,,,,,,,,,,,,,,,,,F,,,,,64.46,NAP,N,2.126424,47.872784,0.85,housenumber,20 Avenue d’Orléans 45550 Saint-Denis-de-l'Hôtel,45273_0420_00020,G,20 AVENUE D ORLEANS,
086172277,00013,08617227700013,O,,NN,,,,true,1,,33,,AV,D ORLEANS,45550,SAINT DENIS DE L'HOTEL,,,45273,,,,,,,,,,,,,,,,,,,1989-09-30,F,,,,,64.49,NAP,N,2.124923,47.873081,0.85,housenumber,33 Avenue d’Orléans 45550 Saint-Denis-de-l'Hôtel,45273_0420_00033,G,33 AVENUE D ORLEANS,
086172673,00013,08617267300013,O,,,,,,true,1,,,,,GRANDE RUE,45550,SAINT DENIS DE L'HOTEL,,,45273,,,,,,,,,,,,,,,,,,,1984-12-25,F,,,,,64.41,NAP,N,2.125536,47.871621,0.96,street,Grande Rue 45550 Saint-Denis-de-l'Hôtel,45273_0480,G,GRANDE RUE,
086373289,00015,08637328900015,O,,,,,,true,1,,,,RTE,D ORLEANS,45550,SAINT DENIS DE L'HOTEL,,,45273,,,,,,,,,,,,,,,,,,,1984-12-25,F,,,,,64.42,NAP,N,2.120614,47.874061,0.76,street,Avenue d’Orléans 45550 Saint-Denis-de-l'Hôtel,45273_0420,G,AVENUE D ORLEANS,
086473303,00013,08647330300013,O,,,,,,true,1,,,,,GRANDE RUE,45550,SAINT DENIS DE L'HOTEL,,,45273,,,,,,,,,,,,,,,,,,,1984-12-25,F,,,,,67.05,NAP,N,2.125536,47.871621,0.96,street,Grande Rue 45550 Saint-Denis-de-l'Hôtel,45273_0480,G,GRANDE RUE,
086573045,00019,08657304500019,O,,,,,,true,1,,,,RUE,DU CLOITRE,45550,SAINT DENIS DE L'HOTEL,,,45273,,,,,,,,,,,,,,,,,,,1984-12-25,F,,,,,67.07,NAP,N,2.128373,47.86984,0.76,street,Place du Cloître 45550 Saint-Denis-de-l'Hôtel,45273_0160,G,PLACE DU CLOITRE,
086670700,00011,08667070000011,O,,,,,,true,1,,53,,,GRANDE RUE,45550,SAINT DENIS DE L'HOTEL,,,45273,,,,,,,,,,,,,,,,,,,,F,,,,,64.25,NAP,N,2.125376,47.870965,0.96,housenumber,53 Grande Rue 45550 Saint-Denis-de-l'Hôtel,45273_0480_00053,G,53 GRANDE RUE,
086672136,00065,08667213600065,O,2000-12-15,NN,,,2006-11-25T09:06:09,false,3,,29,,RUE,ST NICOLAS,45550,SAINT DENIS DE L'HOTEL,,,45273,,,,,,,,,,,,,,,,,,,2004-09-24,F,,,,,52.5Z,NAFRev1,N,2.117914,47.872324,0.85,housenumber,29 Rue Saint Nicolas 45550 Saint-Denis-de-l'Hôtel,45273_0543_00029,G,29 RUE SAINT NICOLAS,
086770948,00015,08677094800015,O,,NN,,,,true,1,,,,,GRANDE RUE,45550,SAINT DENIS DE L'HOTEL,,,45273,,,,,,,,,,,,,,,,,,,,F,,,,,47.02,NAP,N,2.125536,47.871621,0.96,street,Grande Rue 45550 Saint-Denis-de-l'Hôtel,45273_0480,G,GRANDE RUE,
086771151,00015,08677115100015,O,,,,,,true,1,,,,,GRANDE RUE,45550,SAINT DENIS DE L'HOTEL,,,45273,,,,,,,,,,,,,,,,,,,1987-05-14,F,,,,,67.01,NAP,N,2.125536,47.871621,0.96,street,Grande Rue 45550 Saint-Denis-de-l'Hôtel,45273_0480,G,GRANDE RUE,
086971017,00107,08697101700107,O,2007-05-01,NN,,,2012-05-05T00:16:16,false,3,,7,,RUE,DE LA BORDE,45550,SAINT DENIS DE L'HOTEL,,,45273,,,,,,,,,,,,,,,,,,,2010-06-30,F,,,,,68.31Z,NAFRev2,O,2.128996,47.870944,0.95,housenumber,7 Rue de la Borde 45550 Saint-Denis-de-l'Hôtel,45273_0080_00007,G,7 RUE DE LA BORDE,
086971587,00018,08697158700018,O,,,,,,true,1,,,,LD,BEAUREGARD,45550,SAINT DENIS DE L'HOTEL,,,45273,,,,,,,,,,,,,,,,,,,1984-12-25,F,,,,,56.02,NAP,N,2.153354,47.867538,0.92,street,Lieu Dit Beauregard 45550 Saint-Denis-de-l'Hôtel,45273_msmlx7,G,LIEU DIT BEAUREGARD,
086973336,00018,08697333600018,O,,,,,,true,1,,11,,BD,DES CHESNIERS,45550,SAINT DENIS DE L'HOTEL,,,45273,,,,,,,,,,,,,,,,,,,1991-10-31,F,,,,,47.02,NAP,N,2.132176,47.871865,0.72,housenumber,11 Boulevard des Cheniers 45550 Saint-Denis-de-l'Hôtel,45273_0140_00011,G,11 BOULEVARD DES CHENIERS,
087071858,00010,08707185800010,O,1964-01-01,NN,,,,true,1,,56,,,GRANDE RUE,45550,SAINT DENIS DE L'HOTEL,,,45273,,,,,,,,,,,,,,,,,,,2001-09-30,F,,,,,15.1F,NAF1993,O,2.12516,47.87092,0.96,housenumber,56 Grande Rue 45550 Saint-Denis-de-l'Hôtel,45273_0480_00056,G,56 GRANDE RUE,
087072047,00027,08707204700027,O,1987-02-15,NN,,,,true,1,,,,RUE,DE L INDUSTRIE,45550,SAINT DENIS DE L'HOTEL,,,45273,,,,,,,,,,,,,,,,,,,1997-10-17,F,,,,,70.2C,NAF1993,N,2.132894,47.875684,0.96,street,Rue de l’Industrie 45550 Saint-Denis-de-l'Hôtel,45273_0300,G,RUE DE L INDUSTRIE,
087171856,00039,08717185600039,O,,NN,,,,true,1,,20,,BD,DU CHAPEAU ROUGE,45550,SAINT DENIS DE L'HOTEL,,,45273,,,,,,,,,,,,,,,,,,,2000-12-31,F,,,,,45.2B,NAF1993,O,2.123802,47.87451,0.87,housenumber,20 Boulevard du Chapeau Rouge 45550 Saint-Denis-de-l'Hôtel,45273_0110_00020,G,20 BOULEVARD DU CHAPEAU ROUGE,
087272241,00024,08727224100024,O,1990-09-28,NN,,,2008-11-07T00:16:25,false,3,,31,,AV,DE LA TETE VERTE,45550,SAINT DENIS DE L'HOTEL,,,45273,,,,,,,,,,,,,,,,,,,1994-02-12,F,,,,,52.7C,NAF1993,N,2.127842,47.870767,0.87,housenumber,31 Avenue de la Tete Verte 45550 Saint-Denis-de-l'Hôtel,45273_0550_00031,G,31 AVENUE DE LA TETE VERTE,
214502734,00012,21450273400012,O,1983-03-01,12,2019,,2021-10-27T08:08:31,true,4,,30,,AV,DU STADE,45550,SAINT DENIS DE L'HOTEL,,,45273,,,,,,,,,,,,,,,,,,,2008-01-01,A,MAIRIE,,,,84.11Z,NAFRev2,O,2.128446,47.872261,0.83,housenumber,30 Avenue du Stade 45550 Saint-Denis-de-l'Hôtel,45273_0520_00030,G,30 AVENUE DU STADE,
214502734,00020,21450273400020,O,1983-12-21,11,2019,,2021-10-27T08:08:31,false,3,,,,AV,DE LA TETE VERTE,45550,SAINT DENIS DE L'HOTEL,,,45273,,,,,,,,,,,,,,,,,,,2008-01-01,A,ECOLE PRIMAIRE DU CLOS D'OR,,,,85.20Z,NAFRev2,N,2.129061,47.870634,0.86,street,Avenue de la Tete Verte 45550 Saint-Denis-de-l'Hôtel,45273_0550,G,AVENUE DE LA TETE VERTE,
214502734,00038,21450273400038,O,1983-12-21,03,2019,,2021-10-27T08:08:31,false,3,,,,AV,DE LA TETE VERTE,45550,SAINT DENIS DE L'HOTEL,,,45273,,,,,,,,,,,,,,,,,,,2008-01-01,A,ECOLE MATERNELLE PUBLIQUE,,,,85.10Z,NAFRev2,N,2.129061,47.870634,0.86,street,Avenue de la Tete Verte 45550 Saint-Denis-de-l'Hôtel,45273_0550,G,AVENUE DE LA TETE VERTE,
214502734,00046,21450273400046,O,1992-01-01,01,2019,,2021-10-27T08:08:31,false,3,MAIRIE,30,,AV,DU STADE,45550,SAINT DENIS DE L'HOTEL,,,45273,,,,,,,,,,,,,,,,,,,2008-01-01,A,SERVICE ASSAINISSEMENT,,,,37.00Z,NAFRev2,N,2.128446,47.872261,0.83,housenumber,30 Avenue du Stade 45550 Saint-Denis-de-l'Hôtel,45273_0520_00030,G,30 AVENUE DU STADE,
214502734,00053,21450273400053,O,1994-01-01,01,2019,,2021-10-27T08:08:31,false,3,MAIRIE,30,,AV,DU STADE,45550,SAINT DENIS DE L'HOTEL,,,45273,,,,,,,,,,,,,,,,,,,2008-01-01,A,SERVICE EAU,,,,36.00Z,NAFRev2,N,2.128446,47.872261,0.83,housenumber,30 Avenue du Stade 45550 Saint-Denis-de-l'Hôtel,45273_0520_00030,G,30 AVENUE DU STADE,
214502734,00079,21450273400079,O,2002-09-04,03,2019,,2021-10-27T08:08:31,false,1,,,,RTE,DE CHENAILLES,45550,SAINT DENIS DE L'HOTEL,,,45273,,,,,,,,,,,,,,,,,,,2002-09-04,A,PLANETE LOISIRS,,,,93.29Z,NAFRev2,O,2.141188,47.872043,0.85,street,Route de Chenailles 45550 Saint-Denis-de-l'Hôtel,45273_0120,G,ROUTE DE CHENAILLES,
214502734,00087,21450273400087,O,2011-09-06,03,2019,,2021-10-27T08:08:31,false,1,,12,,RUE,DU CLOS D'OR,45550,SAINT DENIS DE L'HOTEL,,,45273,,,,,,,,,,,,,,,,,,,2011-09-06,A,ACCUEIL PERISCOLAIRE,,,,88.91A,NAFRev2,O,2.131669,47.870687,0.95,housenumber,12 Rue du Clos d’Or 45550 Saint-Denis-de-l'Hôtel,45273_0180_00012,G,12 RUE DU CLOS D OR,
214502734,00095,21450273400095,O,2005-09-01,02,2019,,2021-10-27T08:08:31,false,1,,,,IMP,CROQUE-NOTES,45550,SAINT DENIS DE L'HOTEL,,,45273,,,,,,,,,,,,,,,,,,,2005-09-01,A,RESTAURANT SCOLAIRE,,,,56.29B,NAFRev2,O,,,0,,,,,,
254500226,00058,25450022600058,O,2007-06-12,NN,,,2010-04-18T03:16:46,false,3,,,,,LE PETIT BUISSON,45550,SAINT DENIS DE L'HOTEL,,,45273,,,,,,,,,,,,,,,,,,,2008-03-17,F,,,,,38.11Z,NAFRev2,O,2.182035,47.905134,0.94,street,Le Petit Buisson 45550 Saint-Denis-de-l'Hôtel,45273_B059,G,LE PETIT BUISSON,
254502404,00018,25450240400018,O,1992-04-06,02,2019,,2021-10-27T08:12:13,true,5,MAIRIE,30,,AV,DU STADE,45550,SAINT DENIS DE L'HOTEL,,,45273,,,,,,,,,,,,,,,,,,,2010-01-17,A,,,,,36.00Z,NAFRev2,O,2.128446,47.872261,0.83,housenumber,30 Avenue du Stade 45550 Saint-Denis-de-l'Hôtel,45273_0520_00030,G,30 AVENUE DU STADE,
254502818,00019,25450281800019,O,1997-10-03,02,2019,,2021-10-27T08:12:13,true,4,MAIRIE,30,,AV,DU STADE,45550,SAINT DENIS DE L'HOTEL,,,45273,,,,,,,,,,,,,,,,,,,2012-01-29,A,,,,,84.11Z,NAFRev2,O,2.128446,47.872261,0.83,housenumber,30 Avenue du Stade 45550 Saint-Denis-de-l'Hôtel,45273_0520_00030,G,30 AVENUE DU STADE,
264500042,00264,26450004200264,O,1999-01-01,02,2019,,2021-10-27T08:12:56,false,1,,,,BD,DES CHENATS,45550,SAINT DENIS DE L'HOTEL,,,45273,,,,,,,,,,,,,,,,,,,1999-01-01,A,CENTRE DE JOUR SAINT DENIS DE L'HOTEL,,,,56.29B,NAFRev2,N,2.115981,47.876245,0.82,street,Boulevard des Chenats 45550 Saint-Denis-de-l'Hôtel,45273_0130,G,BOULEVARD DES CHENATS,
264508920,00016,26450892000016,O,1993-02-01,NN,,,2020-11-10T15:03:23,true,4,MAIRIE,,,,,45550,SAINT DENIS DE L'HOTEL,,,45273,,,,,,,,,,,,,,,,,,,2008-01-01,F,CDE,,,,88.99B,NAFRev2,N,2.112243,47.875114,0.4,street,Impasse des Poiriers 45550 Saint-Denis-de-l'Hôtel,45273_0437,D,IMPASSE DES POIRIERS,
264508938,00018,26450893800018,O,1993-02-02,NN,,,2010-06-26T03:10:11,true,3,MAIRIE,30,,AV,DU STADE,45550,SAINT DENIS DE L'HOTEL,,,45273,,,,,,,,,,,,,,,,,,,2008-01-01,A,CCAS,,,,88.99B,NAFRev2,N,2.128446,47.872261,0.83,housenumber,30 Avenue du Stade 45550 Saint-Denis-de-l'Hôtel,45273_0520_00030,G,30 AVENUE DU STADE,
274500859,00013,27450085900013,O,,,,,,true,1,,,,,,45550,SAINT DENIS DE L'HOTEL,,,45273,,,,,,,,,,,,,,,,,,,1995-12-25,F,,,,,41.0Z,NAF1993,N,,,0,,,,,,
294500640,00015,29450064000015,O,1983-09-27,NN,,,2010-08-13T10:16:31,true,4,MAIRIE,30,,AV,DU STADE,45550,SAINT DENIS DE L'HOTEL,,,45273,,,,,,,,,,,,,,,,,,,2010-07-08,F,,,,,42.99Z,NAFRev2,N,2.128446,47.872261,0.83,housenumber,30 Avenue du Stade 45550 Saint-Denis-de-l'Hôtel,45273_0520_00030,G,30 AVENUE DU STADE,
300013109,00024,30001310900024,O,,,,,,true,1,,,,AV,DE LA TETE,45550,SAINT DENIS DE L'HOTEL,,,45273,,,,,,,,,,,,,,,,,,,1985-12-25,F,,,,,69.23,NAP,N,2.129061,47.870634,0.82,street,Avenue de la Tete Verte 45550 Saint-Denis-de-l'Hôtel,45273_0550,G,AVENUE DE LA TETE VERTE,
301347662,00027,30134766200027,O,,,,,,true,1,,14,,BD,DU CHAPEAU ROUGE,45550,SAINT DENIS DE L'HOTEL,,,45273,,,,,,,,,,,,,,,,,,,1997-03-31,F,,,,,45.2V,NAF1993,N,2.125575,47.874272,0.87,housenumber,14 Boulevard du Chapeau Rouge 45550 Saint-Denis-de-l'Hôtel,45273_0110_00014,G,14 BOULEVARD DU CHAPEAU ROUGE,
301583910,00015,30158391000015,O,,,,,,true,1,,28,,BD,DES DORD,45550,SAINT DENIS DE L'HOTEL,,,45273,,,,,,,,,,,,,,,,,,,1985-12-25,F,,,,,55.73,NAP,N,2.134296,47.867986,0.83,housenumber,28 Boulevard des Dords 45550 Saint-Denis-de-l'Hôtel,45273_0200_00028,G,28 BOULEVARD DES DORDS,
301955266,00012,30195526600012,O,,,,,,true,1,,49,,,GRANDE RUE,45550,SAINT DENIS DE L'HOTEL,,,45273,,,,,,,,,,,,,,,,,,,1984-12-25,F,,,,,67.08,NAP,N,2.125502,47.871076,0.96,housenumber,49 Grande Rue 45550 Saint-Denis-de-l'Hôtel,45273_0480_00049,G,49 GRANDE RUE,
302304068,00042,30230406800042,O,1984-12-01,03,2019,,2021-10-27T08:14:18,false,5,,46,,RUE,DE L'INDUSTRIE,45550,SAINT DENIS DE L'HOTEL,,,45273,,,,,,,,,,,,,,,,,,,2020-10-31,F,,,,,82.92Z,NAFRev2,O,2.132894,47.875684,0.96,housenumber,46 Rue de l’Industrie 45550 Saint-Denis-de-l'Hôtel,45273_0300_00046,G,46 RUE DE L INDUSTRIE,
302430913,00053,30243091300053,O,1995-03-01,NN,,,,false,3,,,,CHE,DES BELLEBATS,45550,SAINT DENIS DE L'HOTEL,,,45273,,,,,,,,,,,,,,,,,,,1999-12-31,F,,,,,51.6K,NAF1993,O,2.114961,47.874449,0.45,street,Chemin des Petites Vernelles 45550 Saint-Denis-de-l'Hôtel,45273_0430,G,CHEMIN DES PETITES VERNELLES,
302862644,00010,30286264400010,O,,NN,,,,true,1,,38,,,GRANDE RUE,45550,SAINT DENIS DE L'HOTEL,,,45273,,,,,,,,,,,,,,,,,,,2001-07-18,F,,,,,70.2A,NAF1993,N,2.125536,47.871621,0.96,street,Grande Rue 45550 Saint-Denis-de-l'Hôtel,45273_0480,G,GRANDE RUE,
303971766,00025,30397176600025,O,,NN,,,,true,1,,,,RUE,DE L INDUSTRIE,45550,SAINT DENIS DE L'HOTEL,,,45273,,,,,,,,,,,,,,,,,,,2000-12-31,F,,,,,74.1J,NAF1993,N,2.132894,47.875684,0.96,street,Rue de l’Industrie 45550 Saint-Denis-de-l'Hôtel,45273_0300,G,RUE DE L INDUSTRIE,
304002439,00061,30400243900061,O,1997-05-07,NN,,,2011-04-28T00:11:29,false,4,,,,,CTRE CCIAL DES DORDS,45550,SAINT DENIS DE L'HOTEL,,,45273,,,,,,,,,,,,,,,,,,,2001-07-10,F,,,,,74.4B,NAF1993,N,2.133647,47.868219,0.48,street,Boulevard des Dords 45550 Saint-Denis-de-l'Hôtel,45273_0200,G,BOULEVARD DES DORDS,
304577588,02454,30457758802454,O,2007-05-01,NN,,,2019-06-24T13:15:44,false,3,,,,BD,DES CHENATS,45550,SAINT DENIS DE L'HOTEL,,,45273,,,,,,,,,,,,,,,,,,,2017-06-30,F,,,,,78.20Z,NAFRev2,O,2.115981,47.876245,0.82,street,Boulevard des Chenats 45550 Saint-Denis-de-l'Hôtel,45273_0130,G,BOULEVARD DES CHENATS,
304620636,00015,30462063600015,O,,,,,,true,1,,,,,CENTRE COMMERC DES DORDS,45550,SAINT DENIS DE L'HOTEL,,,45273,,,,,,,,,,,,,,,,,,,1992-02-10,F,,,,,52.3A,NAF1993,N,2.133647,47.868219,0.43,street,Boulevard des Dords 45550 Saint-Denis-de-l'Hôtel,45273_0200,G,BOULEVARD DES DORDS,
304729544,00029,30472954400029,O,1990-05-25,,,,,false,4,,23,,AV,DE LA TETE VERTE,45550,SAINT DENIS DE L'HOTEL,,,45273,,,,,,,,,,,,,,,,,,,1993-12-25,F,,,,,93.0D,NAF1993,N,2.128115,47.870718,0.87,housenumber,23 Avenue de la Tete Verte 45550 Saint-Denis-de-l'Hôtel,45273_0550_00023,G,23 AVENUE DE LA TETE VERTE,
305057119,00011,30505711900011,O,,NN,,,,true,1,,,,LD,LES GRANDES BORDES,45550,SAINT DENIS DE L'HOTEL,,,45273,,,,,,,,,,,,,,,,,,,,F,,,,,01.63,NAP,N,2.136221,47.896483,0.94,street,Les Grandes Bordes 45550 Saint-Denis-de-l'Hôtel,45273_B045,G,LES GRANDES BORDES,
305227233,00015,30522723300015,O,1976-01-01,NN,,,,true,1,,1,,RUE,DE LA SOLAIE,45550,SAINT DENIS DE L'HOTEL,,,45273,,,,,,,,,,,,,,,,,,,1999-12-31,F,,,,,70.2C,NAF1993,O,2.126947,47.872891,0.96,housenumber,1 Rue de la Solaie 45550 Saint-Denis-de-l'Hôtel,45273_0500_00001,G,1 RUE DE LA SOLAIE,
305436255,00015,30543625500015,O,1964-01-01,NN,,,2008-11-07T00:21:11,true,3,,24,,AV,D ORLEANS,45550,SAINT DENIS DE L'HOTEL,,,45273,,,,,,,,,,,,,,,,,,,2007-03-31,F,,,,,93.0D,NAFRev1,N,2.126112,47.87291,0.85,housenumber,24 Avenue d’Orléans 45550 Saint-Denis-de-l'Hôtel,45273_0420_00024,G,24 AVENUE D ORLEANS,
305726010,00039,30572601000039,O,2010-01-04,NN,,,2013-05-18T02:32:45,false,2,,44,,QUAI,DE LA CRECHE,45550,SAINT DENIS DE L'HOTEL,,,45273,,,,,,,,,,,,,,,,,,,2011-06-09,F,,,,,43.34Z,NAFRev2,O,2.12747,47.869997,0.95,housenumber,44 Quai de la Crèche 45550 Saint-Denis-de-l'Hôtel,45273_0190_00044,G,44 QUAI DE LA CRECHE,
305726010,00047,30572601000047,O,2011-06-09,NN,,,2019-06-24T13:16:03,false,3,,36,A,BD,DU GRAND CLOS,45550,SAINT DENIS DE L'HOTEL,,,45273,,,,,,,,,,,,,,,,,,,2017-07-24,F,,,,,43.34Z,NAFRev2,N,2.145359,47.864338,0.86,housenumber,36a Boulevard du Grand Clos 45550 Saint-Denis-de-l'Hôtel,45273_0280_00036_a,G,36A BOULEVARD DU GRAND CLOS,
306552910,00045,30655291000045,O,1996-01-01,11,2019,,2021-10-27T08:16:00,false,3,,10,,BD,DU CHAPEAU ROUGE,45550,SAINT DENIS DE L'HOTEL,,,45273,,,,,,,,,,,,,,,,,,,2008-01-01,A,SLTE SA,,,,43.21A,NAFRev2,O,2.126094,47.874284,0.87,housenumber,10 Boulevard du Chapeau Rouge 45550 Saint-Denis-de-l'Hôtel,45273_0110_00010,G,10 BOULEVARD DU CHAPEAU ROUGE,
307546242,00016,30754624200016,O,1900-01-01,NN,,,2008-01-04T19:47:11,true,4,,,,,,45550,SAINT DENIS DE L'HOTEL,,,45273,,,,,,,,,,,,,,,,,,,2008-01-01,A,,,,,94.20Z,NAFRev2,O,,,0,,,,,,
308699719,00024,30869971900024,O,1982-01-01,,,,,true,3,,17,,AV,DE LA GARE,45550,SAINT DENIS DE L'HOTEL,,,45273,,,,,,,,,,,,,,,,,,,1993-12-25,F,,,,,74.8K,NAF1993,N,2.128513,47.873451,0.84,housenumber,17 Avenue de la Gare 45550 Saint-Denis-de-l'Hôtel,45273_0220_00017,G,17 AVENUE DE LA GARE,
309196624,00022,30919662400022,O,2004-04-08,NN,,,2006-11-25T09:24:12,true,3,,35,B,AV,DE LA TETE VERTE,45550,SAINT DENIS DE L'HOTEL,,,45273,,,,,,,,,,,,,,,,,,,2006-02-04,F,,,,,52.6E,NAFRev1,N,2.128017,47.870785,0.8,housenumber,35bis Avenue de la Tete Verte 45550 Saint-Denis-de-l'Hôtel,45273_0550_00035_bis,G,35BIS AVENUE DE LA TETE VERTE,
309325116,00031,30932511600031,O,1989-10-31,NN,,,2010-04-18T03:33:00,true,5,,118,,AV,ORLEANS,45550,SAINT DENIS DE L'HOTEL,,,45273,,,,,,,,,,,,,,,,,,,2008-03-31,F,,,,,43.99C,NAFRev2,O,2.114533,47.875678,0.83,housenumber,118 Avenue d’Orléans 45550 Saint-Denis-de-l'Hôtel,45273_0420_00118,G,118 AVENUE D ORLEANS,
309364677,00026,30936467700026,O,2020-10-15,,,,2021-03-25T08:52:34,true,1,,,,,BAJIN,45550,SAINT DENIS DE L'HOTEL,,,45273,,,,,,,,,,,,,,,,,,,2020-10-15,A,BOIS DES BAJINS,,,,02.10Z,NAFRev2,N,2.147233,47.896648,0.91,locality,La Mothe Bajin 45550 Saint-Denis-de-l'Hôtel,45273_B056,G,LA MOTHE BAJIN,
309426823,00014,30942682300014,O,,NN,,,,true,1,,,,LD,LES GRANDES BORDES,45550,SAINT DENIS DE L'HOTEL,,,45273,,,,,,,,,,,,,,,,,,,1989-10-01,F,,,,,81.21,NAP,N,2.136221,47.896483,0.94,street,Les Grandes Bordes 45550 Saint-Denis-de-l'Hôtel,45273_B045,G,LES GRANDES BORDES,
309590677,00014,30959067700014,O,,NN,,,,true,1,,,,AV,DE LA TETE VERTE LES DORDS,45550,SAINT DENIS DE L'HOTEL,,,45273,,,,,,,,,,,,,,,,,,,1991-06-30,F,,,,,64.11,NAP,N,2.129061,47.870634,0.64,street,Avenue de la Tete Verte 45550 Saint-Denis-de-l'Hôtel,45273_0550,G,AVENUE DE LA TETE VERTE,
309614469,00034,30961446900034,O,1981-10-01,NN,,,,true,1,,2,,AV,D ORLEANS,45550,SAINT DENIS DE L'HOTEL,,,45273,,,,,,,,,,,,,,,,,,,1998-09-30,F,,,,,52.6G,NAF1993,N,2.128049,47.872363,0.84,housenumber,2 Avenue d’Orléans 45550 Saint-Denis-de-l'Hôtel,45273_0420_00002,G,2 AVENUE D ORLEANS,
310847686,00022,31084768600022,O,,NN,,,,true,1,,42,,GR,LE CYGNE,45550,SAINT DENIS DE L'HOTEL,,,45273,,,,,,,,,,,,,,,,,,,1995-05-31,F,,,,,55.1A,NAF1993,O,2.125383,47.871419,0.36,housenumber,42 Grande Rue 45550 Saint-Denis-de-l'Hôtel,45273_0480_00042,G,42 GRANDE RUE,
310987763,00011,31098776300011,O,,,,,,true,1,,,,AV,DE LA TETE VERTE,45550,SAINT DENIS DE L'HOTEL,,,45273,,,,,,,,,,,,,,,,,,,,F,,,,,87.01,NAP,N,2.129061,47.870634,0.86,street,Avenue de la Tete Verte 45550 Saint-Denis-de-l'Hôtel,45273_0550,G,AVENUE DE LA TETE VERTE,
311047492,00013,31104749200013,O,,,,,,true,1,,,,HAM,DE FAUX JUIF,45550,SAINT DENIS DE L'HOTEL,,,45273,,,,,,,,,,,,,,,,,,,,F,,,,,60.09,NAP,N,2.149215,47.863238,0.94,street,Rue de Faux-Juif 45550 Saint-Denis-de-l'Hôtel,45273_0215,G,RUE DE FAUX JUIF,
311137913,00027,31113791300027,O,,NN,,,,true,1,,,,AV,DE LA TETE VERTE,45550,SAINT DENIS DE L'HOTEL,,,45273,,,,,,,,,,,,,,,,,,,1986-03-18,F,,,,,80.04,NAP,N,2.129061,47.870634,0.86,street,Avenue de la Tete Verte 45550 Saint-Denis-de-l'Hôtel,45273_0550,G,AVENUE DE LA TETE VERTE,
311810022,00047,31181002200047,O,1995-12-29,NN,,,,true,1,,,,LD,ST NICOLAS,45550,SAINT DENIS DE L'HOTEL,,,45273,,,,,,,,,,,,,,,,,,,1999-06-30,F,,,,,51.6L,NAF1993,N,2.118437,47.883186,0.92,locality,Terres de St Nicolas 45550 Saint-Denis-de-l'Hôtel,45273_B071,G,TERRES DE ST NICOLAS,
312249808,00022,31224980800022,O,,,,,,true,1,,,,CHE,DES PICHONS,45550,SAINT DENIS DE L'HOTEL,,,45273,,,,,,,,,,,,,,,,,,,1984-12-25,F,,,,,47.04,NAP,N,2.118355,47.873854,0.77,street,Rue des Pichons 45550 Saint-Denis-de-l'Hôtel,45273_0433,G,RUE DES PICHONS,
312608573,00019,31260857300019,O,,NN,,,,true,1,,5,,AV,D ORLEANS,45550,SAINT DENIS DE L'HOTEL,,,45273,,,,,,,,,,,,,,,,,,,1989-01-26,F,,,,,67.08,NAP,N,2.127511,47.872379,0.84,housenumber,5 Avenue d’Orléans 45550 Saint-Denis-de-l'Hôtel,45273_0420_00005,G,5 AVENUE D ORLEANS,