siren,nic,siret,statutDiffusionEtablissement,dateCreationEtablissement,trancheEffectifsEtablissement,anneeEffectifsEtablissement,activitePrincipaleRegistreMetiersEtablissement,dateDernierTraitementEtablissement,etablissementSiege,nombrePeriodesEtablissement,complementAdresseEtablissement,numeroVoieEtablissement,indiceRepetitionEtablissement,typeVoieEtablissement,libelleVoieEtablissement,codePostalEtablissement,libelleCommuneEtablissement,libelleCommuneEtrangerEtablissement,distributionSpecialeEtablissement,codeCommuneEtablissement,codeCedexEtablissement,libelleCedexEtablissement,codePaysEtrangerEtablissement,libellePaysEtrangerEtablissement,complementAdresse2Etablissement,numeroVoie2Etablissement,indiceRepetition2Etablissement,typeVoie2Etablissement,libelleVoie2Etablissement,codePostal2Etablissement,libelleCommune2Etablissement,libelleCommuneEtranger2Etablissement,distributionSpeciale2Etablissement,codeCommune2Etablissement,codeCedex2Etablissement,libelleCedex2Etablissement,codePaysEtranger2Etablissement,libellePaysEtranger2Etablissement,dateDebut,etatAdministratifEtablissement,enseigne1Etablissement,enseigne2Etablissement,enseigne3Etablissement,denominationUsuelleEtablissement,activitePrincipaleEtablissement,nomenclatureActivitePrincipaleEtablissement,caractereEmployeurEtablissement,longitude,latitude,geo_score,geo_type,geo_adresse,geo_id,geo_ligne,geo_l4,geo_l5
216207167,00018,21620716700018,O,1983-03-01,02,2019,,2021-10-27T08:09:36,true,4,,60,,RUE,DU CHATEAU DE COLVEDE,62610,RODELINGHEM,,,62716,,,,,,,,,,,,,,,,,,,2008-01-01,A,MAIRIE,,,,84.11Z,NAFRev2,O,1.930488,50.838019,0.94,housenumber,60 Rue du Chateau de Colvede 62610 Rodelinghem,62716_0109_00060,G,60 RUE DU CHATEAU DE COLVEDE,
216207167,00026,21620716700026,O,1983-12-21,01,2019,,2021-10-27T08:09:36,false,3,,60,,RUE,DU CHATEAU DU COLVEDE,62610,RODELINGHEM,,,62716,,,,,,,,,,,,,,,,,,,2008-01-01,A,ECOLE MATERNELLE PUBLIQUE,,,,85.10Z,NAFRev2,N,1.930488,50.838019,0.94,housenumber,60 Rue du Chateau de Colvede 62610 Rodelinghem,62716_0109_00060,G,60 RUE DU CHATEAU DE COLVEDE,
266207166,00015,26620716600015,O,1983-03-01,NN,,,2010-06-26T03:13:25,true,3,MAIRIE,,,,,62610,RODELINGHEM,,,62716,,,,,,,,,,,,,,,,,,,2008-01-01,A,CCAS,,,,88.99B,NAFRev2,N,,,0,,,,,,
296202831,00016,29620283100016,O,1986-05-06,NN,,,2018-09-29T12:08:59,true,3,MAIRIE,60,,RUE,DU CHATEAU DE COLVEDE,62610,RODELINGHEM,,,62716,,,,,,,,,,,,,,,,,,,2008-01-01,A,,,,,42.99Z,NAFRev2,N,1.930488,50.838019,0.94,housenumber,60 Rue du Chateau de Colvede 62610 Rodelinghem,62716_0109_00060,G,60 RUE DU CHATEAU DE COLVEDE,
305985210,00015,30598521000015,O,,NN,,,,true,1,,,,,,62610,RODELINGHEM,,,62716,,,,,,,,,,,,,,,,,,,1988-10-01,F,,,,,01.1A,NAF1993,N,,,0,,,,,,
315255687,00016,31525568700016,O,1979-01-01,NN,,,2008-04-05T00:16:02,true,3,,343,,RUE,DU CAMP DU DRAP D OR,62610,RODELINGHEM,,,62716,,,,,,,,,,,,,,,,,,,2008-01-01,A,,,,,01.13Z,NAFRev2,N,1.930718,50.84078,0.95,housenumber,343 Rue du Camp du Drap d’Or 62610 Rodelinghem,62716_0102_00343,G,343 RUE DU CAMP DU DRAP D OR,
315373233,00016,31537323300016,O,,,,,,true,1,,399,,RUE,DU CHATEAU DU COLVEDE,62610,RODELINGHEM,,,62716,,,,,,,,,,,,,,,,,,,1993-12-25,F,,,,,01.2G,NAF1993,N,1.934647,50.836213,0.94,housenumber,399 Rue du Chateau de Colvede 62610 Rodelinghem,62716_0109_00399,G,399 RUE DU CHATEAU DE COLVEDE,
321586752,00016,32158675200016,O,,,,,,true,1,,239,,,LES ARRETS,62610,RODELINGHEM,,,62716,,,,,,,,,,,,,,,,,,,1984-12-25,F,,,,,84.12,NAP,N,1.93035,50.839981,0.75,housenumber,239 Lotissement les Abrets 62610 Rodelinghem,62716_0019_00239,G,239 LOTISSEMENT LES ABRETS,
324279843,00019,32427984300019,O,1900-01-01,NN,,,2014-07-08T00:28:53,true,5,,714,,RUE,DES CROISETTES,62610,RODELINGHEM,,,62716,,,,,,,,,,,,,,,,,,,2012-03-30,F,,,,,31.09B,NAFRev2,N,1.924715,50.832561,0.95,housenumber,714 Rue des Croisettes 62610 Rodelinghem,62716_0113_00714,G,714 RUE DES CROISETTES,
324535806,00016,32453580600016,O,1982-03-29,01,2019,,2021-10-27T08:24:04,true,4,,,,,,62610,RODELINGHEM,,,62716,,,,,,,,,,,,,,,,,,,2012-12-31,A,,,,,02.40Z,NAFRev2,O,,,0,,,,,,
328063516,00012,32806351600012,O,1983-09-01,,,,,true,1,,399,,RUE,DU CHATEAU COLVEDE,62610,RODELINGHEM,,,62716,,,,,,,,,,,,,,,,,,,2001-02-08,F,,,,,01.1A,NAF1993,N,1.934647,50.836213,0.94,housenumber,399 Rue du Chateau de Colvede 62610 Rodelinghem,62716_0109_00399,G,399 RUE DU CHATEAU DE COLVEDE,
338380298,00012,33838029800012,O,1986-07-01,NN,,,2008-11-07T00:57:30,true,4,,34,,RUE,DES CROISETTES,62610,RODELINGHEM,,,62716,,,,,,,,,,,,,,,,,,,2005-12-31,F,,,,,29.3C,NAFRev1,O,1.929025,50.838,0.95,housenumber,34 Rue des Croisettes 62610 Rodelinghem,62716_0113_00034,G,34 RUE DES CROISETTES,
340541374,00013,34054137400013,O,,,,,,true,1,,279,,LOT,LES ABRETS,62610,RODELINGHEM,,,62716,,,,,,,,,,,,,,,,,,,1988-08-09,F,,,,,69.12,NAP,N,1.930436,50.840317,0.89,housenumber,279 Lotissement les Abrets 62610 Rodelinghem,62716_0019_00279,G,279 LOTISSEMENT LES ABRETS,
348528506,00010,34852850600010,O,,,,,,true,1,,41,,RUE,D'ECOTTES,62610,RODELINGHEM,,,62716,,,,,,,,,,,,,,,,,,,1994-09-30,F,,,,,01.1A,NAF1993,N,1.932764,50.832371,0.94,housenumber,41 Rue d’Ecottes 62610 Rodelinghem,62716_0133_00041,G,41 RUE D ECOTTES,
350226452,00018,35022645200018,O,1989-03-04,NN,,,,true,1,,,,RUE,D ECOTTES,62610,RODELINGHEM,,,62716,,,,,,,,,,,,,,,,,,,1999-12-16,F,,,,,15.3E,NAF1993,O,1.932313,50.832533,0.94,street,Rue d’Ecottes 62610 Rodelinghem,62716_0133,G,RUE D ECOTTES,
378330443,00011,37833044300011,O,1990-05-10,NN,,,2009-09-24T20:30:32,true,5,,625,,RUE,DE JERUSALEM,62610,RODELINGHEM,,,62716,,,,,,,,,,,,,,,,,,,2008-01-01,F,,,,,01.11Z,NAFRev2,N,1.932449,50.83332,0.95,housenumber,625 Rue de Jérusalem 62610 Rodelinghem,62716_0260_00625,G,625 RUE DE JERUSALEM,
381413038,00013,38141303800013,O,1991-03-29,NN,,,2006-10-28T00:42:24,false,4,,57,,RUE,DES BERCEAUX,62610,RODELINGHEM,,,62716,,,,,,,,,,,,,,,,,,,2004-12-27,F,,,,,71.4B,NAFRev1,O,1.928185,50.838513,0.95,housenumber,57 Rue des Berceaux 62610 Rodelinghem,62716_0047_00057,G,57 RUE DES BERCEAUX,
384234969,00069,38423496900069,O,2013-12-19,,,,2021-02-23T11:12:23,true,1,,276,,RUE,DES LEUX,62610,RODELINGHEM,,,62716,,,,,,,,,,,,,,,,,,,2013-12-19,A,,,,,47.82Z,NAFRev2,N,1.929705,50.833541,0.95,housenumber,276 Rue des Leux 62610 Rodelinghem,62716_0165_00276,G,276 RUE DES LEUX,
388783730,00012,38878373000012,O,,NN,,,,true,1,,156,,RUE,DES BERCEAUX,62610,RODELINGHEM,,,62716,,,,,,,,,,,,,,,,,,,1993-01-12,F,,,,,02.0B,NAF1993,N,1.927462,50.838993,0.95,housenumber,156 Rue des Berceaux 62610 Rodelinghem,62716_0047_00156,G,156 RUE DES BERCEAUX,
389613126,00025,38961312600025,O,2002-11-01,,,,2018-05-07T10:30:11,false,3,,794,,RUE,DES CROISETTES,62610,RODELINGHEM,,,62716,,,,,,,,,,,,,,,,,,,2004-09-30,F,,,,,01.1A,NAFRev1,O,1.924189,50.831755,0.95,housenumber,794 Rue des Croisettes 62610 Rodelinghem,62716_0113_00794,G,794 RUE DES CROISETTES,
389613126,00033,38961312600033,O,2018-05-01,,,,2018-05-07T10:30:11,true,1,,115,,RUE,DES LEUX,62610,RODELINGHEM,,,62716,,,,,,,,,,,,,,,,,,,2018-05-01,A,,,,,68.20A,NAFRev2,N,1.927932,50.834719,0.95,housenumber,115 Rue des Leux 62610 Rodelinghem,62716_0165_00115,G,115 RUE DES LEUX,
391892684,00013,39189268400013,O,1993-06-01,NN,,,2014-11-24T02:42:19,true,4,,408,,RUE,DES BERCEAUX,62610,RODELINGHEM,,,62716,,,,,,,,,,,,,,,,,,,2014-10-01,F,,,,,01.13Z,NAFRev2,N,1.925425,50.840527,0.95,housenumber,408 Rue des Berceaux 62610 Rodelinghem,62716_0047_00408,G,408 RUE DES BERCEAUX,
392665956,00018,39266595600018,O,,,,,,true,1,,156,,RUE,DES BERCEAUX,62610,RODELINGHEM,,,62716,,,,,,,,,,,,,,,,,,,1994-09-30,F,,,,,02.0B,NAF1993,N,1.927462,50.838993,0.95,housenumber,156 Rue des Berceaux 62610 Rodelinghem,62716_0047_00156,G,156 RUE DES BERCEAUX,
398749036,00016,39874903600016,O,1994-10-01,NN,,,,true,1,,,,RUE,D'ECOTTES,62610,RODELINGHEM,,,62716,,,,,,,,,,,,,,,,,,,2000-11-30,F,,,,,01.3Z,NAF1993,N,1.932313,50.832533,0.94,street,Rue d’Ecottes 62610 Rodelinghem,62716_0133,G,RUE D ECOTTES,
399375914,00013,39937591400013,O,1970-04-01,NN,,,2008-01-04T19:08:14,true,3,,794,,RUE,DES CROISETTES,62610,RODELINGHEM,,,62716,,,,,,,,,,,,,,,,,,,2008-01-01,A,,,,,01.50Z,NAFRev2,N,1.924189,50.831755,0.95,housenumber,794 Rue des Croisettes 62610 Rodelinghem,62716_0113_00794,G,794 RUE DES CROISETTES,
399553999,00018,39955399900018,O,1995-01-06,NN,,,2008-01-04T19:11:49,true,3,,343,,RUE,DU CAMP DU DRAP D'OR,62610,RODELINGHEM,,,62716,,,,,,,,,,,,,,,,,,,2008-01-01,A,,,,,68.20A,NAFRev2,N,1.930718,50.84078,0.95,housenumber,343 Rue du Camp du Drap d’Or 62610 Rodelinghem,62716_0102_00343,G,343 RUE DU CAMP DU DRAP D OR,
401550959,00019,40155095900019,O,1995-06-01,NN,,,2006-10-28T02:59:20,true,3,,367,,RUE,DES CROISETTES,62610,RODELINGHEM,,,62716,,,,,,,,,,,,,,,,,,,2004-12-31,F,,,,,01.3Z,NAFRev1,N,1.926931,50.83525,0.95,housenumber,367 Rue des Croisettes 62610 Rodelinghem,62716_0113_00367,G,367 RUE DES CROISETTES,
402621635,00018,40262163500018,O,,NN,,,,true,1,,69,,RUE,DES CROISETTES,62610,RODELINGHEM,,,62716,,,,,,,,,,,,,,,,,,,1996-11-15,F,,,,,55.4B,NAF1993,N,1.929137,50.837507,0.95,housenumber,69 Rue des Croisettes 62610 Rodelinghem,62716_0113_00069,G,69 RUE DES CROISETTES,
403277908,00030,40327790800030,O,2007-09-01,,,,2011-11-30T04:56:51,false,3,,276,,RUE,DES LEUX,62610,RODELINGHEM,,,62716,,,,,,,,,,,,,,,,,,,2011-08-16,F,WUILMART,,,,01.43Z,NAFRev2,N,1.929705,50.833541,0.95,housenumber,276 Rue des Leux 62610 Rodelinghem,62716_0165_00276,G,276 RUE DES LEUX,
408798692,00013,40879869200013,O,1980-12-20,NN,,,2010-03-31T10:16:10,true,4,,,,,,62610,RODELINGHEM,,,62716,,,,,,,,,,,,,,,,,,,2008-12-31,F,,,,,01.50Z,NAFRev2,N,,,0,,,,,,
410561658,00015,41056165800015,O,1997-01-02,NN,,,2008-11-08T01:23:31,true,4,,379,,RUE,DES LEUX,62610,RODELINGHEM,,,62716,,,,,,,,,,,,,,,,,,,1999-03-18,F,,,,,45.2B,NAF1993,O,1.93081,50.833111,0.95,housenumber,379 Rue des Leux 62610 Rodelinghem,62716_0165_00379,G,379 RUE DES LEUX,
414687137,00045,41468713700045,O,2009-04-01,,,,2012-11-09T01:08:32,false,2,,381,B,RUE,DE JERUSALEM,62610,RODELINGHEM,,,62716,,,,,,,,,,,,,,,,,,,2010-06-30,F,,,,,01.62Z,NAFRev2,N,1.934026,50.835372,0.87,housenumber,381bis Rue de Jérusalem 62610 Rodelinghem,62716_0260_00381_bis,G,381BIS RUE DE JERUSALEM,
414803494,00015,41480349400015,O,1997-02-01,NN,,,2008-01-04T22:54:15,true,3,,869,,RUE,DES BERCEAUX,62610,RODELINGHEM,,,62716,,,,,,,,,,,,,,,,,,,2008-01-01,A,,,,,68.20A,NAFRev2,N,1.922652,50.844082,0.95,housenumber,869 Rue des Berceaux 62610 Rodelinghem,62716_0047_00869,G,869 RUE DES BERCEAUX,
418334025,00016,41833402500016,O,1997-12-01,NN,,,2006-11-25T15:57:29,false,4,,57,,RUE,DES BERCEAUX,62610,RODELINGHEM,,,62716,,,,,,,,,,,,,,,,,,,2002-02-09,F,,,,,70.2C,NAF1993,N,1.928185,50.838513,0.95,housenumber,57 Rue des Berceaux 62610 Rodelinghem,62716_0047_00057,G,57 RUE DES BERCEAUX,
419030945,00028,41903094500028,O,1998-11-15,,,,,false,3,,287,,LOT,LES ADRETS,62610,RODELINGHEM,,,62716,,,,,,,,,,,,,,,,,,,2000-08-01,F,SARL DACHICOURT,,,,74.1J,NAF1993,N,1.930467,50.840394,0.75,housenumber,287 Lotissement les Abrets 62610 Rodelinghem,62716_0019_00287,G,287 LOTISSEMENT LES ABRETS,
419503347,00017,41950334700017,O,1998-07-08,NN,,,2006-11-30T11:26:02,true,4,,2,,RUE,D'ECOTTES,62610,RODELINGHEM,,,62716,,,,,,,,,,,,,,,,,,,2000-06-15,F,,,,,24.6E,NAF1993,O,1.931862,50.832694,0.94,housenumber,2 Rue d’Ecottes 62610 Rodelinghem,62716_0133_00002,G,2 RUE D ECOTTES,
420739526,00010,42073952600010,O,1998-11-15,NN,,,,true,1,,287,,,LOTISSEMENT LES ABRETS,62610,RODELINGHEM,,,62716,,,,,,,,,,,,,,,,,,,2000-03-30,F,,,,,60.2M,NAF1993,O,1.930467,50.840394,0.95,housenumber,287 Lotissement les Abrets 62610 Rodelinghem,62716_0019_00287,G,287 LOTISSEMENT LES ABRETS,
420929275,00014,42092927500014,O,1998-11-10,NN,,,2008-01-04T23:59:40,true,3,MME HADDAD-SMITH CATHERINE,720,,RUE,DE JERUSALEM,62610,RODELINGHEM,,,62716,,,,,,,,,,,,,,,,,,,2008-01-01,A,,,,,68.20A,NAFRev2,N,1.931852,50.832799,0.95,housenumber,720 Rue de Jérusalem 62610 Rodelinghem,62716_0260_00720,G,720 RUE DE JERUSALEM,
422943043,00014,42294304300014,O,1999-03-19,NN,,,2008-01-05T00:30:20,true,3,MAIRIE,60,,RUE,DU CHATEAU DE COLUEDE,62610,RODELINGHEM,,,62716,,,,,,,,,,,,,,,,,,,2008-01-01,A,,,,,94.99Z,NAFRev2,N,1.930488,50.838019,0.85,housenumber,60 Rue du Chateau de Colvede 62610 Rodelinghem,62716_0109_00060,G,60 RUE DU CHATEAU DE COLVEDE,
423146661,00016,42314666100016,O,1983-09-02,NN,,,2008-01-05T00:33:17,true,3,MAIRIE,60,,RUE,DU CHATEAU DE COLVEDE,62610,RODELINGHEM,,,62716,,,,,,,,,,,,,,,,,,,2008-01-01,A,,,,,94.99Z,NAFRev2,N,1.930488,50.838019,0.94,housenumber,60 Rue du Chateau de Colvede 62610 Rodelinghem,62716_0109_00060,G,60 RUE DU CHATEAU DE COLVEDE,
428084040,00016,42808404000016,O,1999-11-01,NN,,,2009-06-27T09:29:46,false,5,,469,,RUE,DE JERUSALEM,62610,RODELINGHEM,,,62716,,,,,,,,,,,,,,,,,,,2007-05-07,F,,,,,92.3A,NAFRev1,O,1.933634,50.834738,0.95,housenumber,469 Rue de Jérusalem 62610 Rodelinghem,62716_0260_00469,G,469 RUE DE JERUSALEM,
428808679,00016,42880867900016,O,1999-12-21,NN,,,,true,1,,379,,RUE,DES LEUX,62610,RODELINGHEM,,,62716,,,,,,,,,,,,,,,,,,,2002-07-04,F,,,,,45.2V,NAF1993,O,1.93081,50.833111,0.95,housenumber,379 Rue des Leux 62610 Rodelinghem,62716_0165_00379,G,379 RUE DES LEUX,
434396719,00016,43439671900016,O,2000-12-01,03,2019,,2021-10-27T08:14:34,true,3,,2,,RUE,D'ECOTTES,62610,RODELINGHEM,,,62716,,,,,,,,,,,,,,,,,,,2008-01-01,A,,,,,01.11Z,NAFRev2,N,1.931862,50.832694,0.94,housenumber,2 Rue d’Ecottes 62610 Rodelinghem,62716_0133_00002,G,2 RUE D ECOTTES,
434619698,00013,43461969800013,O,2001-02-01,NN,,,2016-04-26T02:46:48,true,5,,406,,RUE,DU CHATEAU DE COLUEDE,62610,RODELINGHEM,,,62716,,,,,,,,,,,,,,,,,,,2014-02-01,F,,,,,01.11Z,NAFRev2,O,1.934453,50.836225,0.85,housenumber,406 Rue du Chateau de Colvede 62610 Rodelinghem,62716_0109_00406,G,406 RUE DU CHATEAU DE COLVEDE,
434714788,00016,43471478800016,O,2001-01-01,NN,,,2012-05-05T07:49:19,true,5,,2,,RUE,D ECOTTES,62610,RODELINGHEM,,,62716,,,,,,,,,,,,,,,,,,,2010-12-31,F,,,,,47.75Z,NAFRev2,O,1.931862,50.832694,0.94,housenumber,2 Rue d’Ecottes 62610 Rodelinghem,62716_0133_00002,G,2 RUE D ECOTTES,
438979833,00011,43897983300011,O,2001-09-01,NN,,,,false,4,,70,,RUE,DU CAMP DU DRAP D'OR,62610,RODELINGHEM,,,62716,,,,,,,,,,,,,,,,,,,2003-02-01,F,,,,,70.1C,NAFRev1,N,1.929993,50.838581,0.95,housenumber,70 Rue du Camp du Drap d’Or 62610 Rodelinghem,62716_0102_00070,G,70 RUE DU CAMP DU DRAP D OR,
443265848,00012,44326584800012,O,2002-10-01,NN,,,2011-11-16T10:39:00,true,4,,1150,,RUE,JERUSALEM,62610,RODELINGHEM,,,62716,,,,,,,,,,,,,,,,,,,2011-10-01,F,,,,,47.89Z,NAFRev2,N,1.92768,50.829816,0.94,housenumber,1150 Rue de Jérusalem 62610 Rodelinghem,62716_0260_01150,G,1150 RUE DE JERUSALEM,
449481472,00016,44948147200016,O,2003-07-04,NN,,,2006-10-31T23:43:26,false,3,,57,,RUE,DES BERCEAUX,62610,RODELINGHEM,,,62716,,,,,,,,,,,,,,,,,,,2004-12-27,F,,,,,70.2A,NAFRev1,N,1.928185,50.838513,0.95,housenumber,57 Rue des Berceaux 62610 Rodelinghem,62716_0047_00057,G,57 RUE DES BERCEAUX,
451223945,00028,45122394500028,O,2005-09-01,03,2019,,2021-10-27T08:06:57,true,3,,57,,RUE,DES BERCEAUX,62610,RODELINGHEM,,,62716,,,,,,,,,,,,,,,,,,,2008-01-01,A,,,,,33.20B,NAFRev2,O,1.928185,50.838513,0.95,housenumber,57 Rue des Berceaux 62610 Rodelinghem,62716_0047_00057,G,57 RUE DES BERCEAUX,
453307902,00016,45330790200016,O,2004-04-01,NN,,,2007-04-04T04:08:56,true,3,,350,,RUE,DES CROISETTES,62610,RODELINGHEM,,,62716,,,,,,,,,,,,,,,,,,,2007-02-28,F,,,,,01.1A,NAFRev1,N,1.927038,50.835424,0.95,housenumber,350 Rue des Croisettes 62610 Rodelinghem,62716_0113_00350,G,350 RUE DES CROISETTES,
453860207,00019,45386020700019,O,2004-06-07,NN,,,2019-10-16T04:05:14,true,3,,238,,RUE,DES CROISETTES,62610,RODELINGHEM,,,62716,,,,,,,,,,,,,,,,,,,2008-01-01,A,,,,,68.20A,NAFRev2,N,1.928207,50.836227,0.95,housenumber,238 Rue des Croisettes 62610 Rodelinghem,62716_0113_00238,G,238 RUE DES CROISETTES,
479484636,00010,47948463600010,O,2004-10-01,01,2019,,2021-10-27T08:14:37,true,3,,794,,RUE,DES CROISETTES,62610,RODELINGHEM,,,62716,,,,,,,,,,,,,,,,,,,2008-01-01,A,,,,,01.11Z,NAFRev2,O,1.924189,50.831755,0.95,housenumber,794 Rue des Croisettes 62610 Rodelinghem,62716_0113_00794,G,794 RUE DES CROISETTES,
480096429,00018,48009642900018,O,2004-12-16,NN,,,2008-01-05T21:44:11,true,3,,341,,RUE,DES BERCEAUX,62610,RODELINGHEM,,,62716,,,,,,,,,,,,,,,,,,,2008-01-01,A,,,,,68.20B,NAFRev2,N,1.925497,50.839975,0.95,housenumber,341 Rue des Berceaux 62610 Rodelinghem,62716_0047_00341,G,341 RUE DES BERCEAUX,
480906890,00011,48090689000011,O,2005-01-01,NN,,,2012-01-31T14:23:42,true,3,,367,,RUE,DES CROISETTES,62610,RODELINGHEM,,,62716,,,,,,,,,,,,,,,,,,,2012-01-01,F,,,,,01.11Z,NAFRev2,O,1.926931,50.83525,0.95,housenumber,367 Rue des Croisettes 62610 Rodelinghem,62716_0113_00367,G,367 RUE DES CROISETTES,
482705134,00013,48270513400013,O,2005-05-23,,,,2008-01-05T00:53:26,true,2,,51,,RUE,DES BERCEAUX,62610,RODELINGHEM,,,62716,,,,,,,,,,,,,,,,,,,2008-01-01,A,,,,,68.20A,NAFRev2,N,1.925077,50.84091,0.83,street,Rue des Berceaux 62610 Rodelinghem,62716_0047,G,RUE DES BERCEAUX,
490576907,00011,49057690700011,O,2006-06-17,,,,2008-01-05T03:35:46,true,2,,176,,RUE,DU MOULIN DE LANDRETHUN,62610,RODELINGHEM,,,62716,,,,,,,,,,,,,,,,,,,2008-01-01,A,,,,,55.20Z,NAFRev2,N,1.946259,50.83074,0.94,housenumber,176 Rue du Moulin de Landrethun 62610 Rodelinghem,62716_0173_00176,G,176 RUE DU MOULIN DE LANDRETHUN,
492576061,00047,49257606100047,O,2020-11-01,,,4399CZ,2021-07-23T13:46:52,false,2,N.146A,,,RUE,DU MOULIN DE LANDRETHUN,62610,RODELINGHEM,,,62716,,,,,,,,,,,,,,,,,,,2021-07-01,F,,,,,43.99C,NAFRev2,N,1.94596,50.830571,0.94,street,Rue du Moulin de Landrethun 62610 Rodelinghem,62716_0173,G,RUE DU MOULIN DE LANDRETHUN,
495148553,00011,49514855300011,O,2007-03-01,02,2019,,2021-10-27T08:35:07,true,3,,350,,RUE,DES CROISETTES,62610,RODELINGHEM,,,62716,,,,,,,,,,,,,,,,,,,2012-12-31,A,,,,,01.11Z,NAFRev2,O,1.927038,50.835424,0.95,housenumber,350 Rue des Croisettes 62610 Rodelinghem,62716_0113_00350,G,350 RUE DES CROISETTES,
497699983,00019,49769998300019,O,2007-04-23,01,2019,,2021-10-27T08:35:48,true,2,,367,,RUE,DES CROISETTES,62610,RODELINGHEM,,,62716,,,,,,,,,,,,,,,,,,,2008-01-01,A,,,,,01.50Z,NAFRev2,O,1.926931,50.83525,0.95,housenumber,367 Rue des Croisettes 62610 Rodelinghem,62716_0113_00367,G,367 RUE DES CROISETTES,
499630002,00024,49963000200024,O,2009-05-25,,,,2011-10-11T04:10:33,false,2,APPT 5,869,,RUE,DES BERCEAUX,62610,RODELINGHEM,,,62716,,,,,,,,,,,,,,,,,,,2011-07-31,F,,,,,71.12B,NAFRev2,N,1.922652,50.844082,0.95,housenumber,869 Rue des Berceaux 62610 Rodelinghem,62716_0047_00869,G,869 RUE DES BERCEAUX,
500697925,00013,50069792500013,O,2007-10-22,,,,2008-01-05T01:48:28,true,2,,276,,RUE,DES LEUX,62610,RODELINGHEM,,,62716,,,,,,,,,,,,,,,,,,,2008-01-01,A,,,,,68.20B,NAFRev2,N,1.929705,50.833541,0.95,housenumber,276 Rue des Leux 62610 Rodelinghem,62716_0165_00276,G,276 RUE DES LEUX,
508055167,00029,50805516700029,O,2009-01-01,,,,2011-01-04T04:30:33,false,2,,238,,RUE,DES CROISETTES,62610,RODELINGHEM,,,62716,,,,,,,,,,,,,,,,,,,2010-06-01,F,,,,,86.90D,NAFRev2,N,1.928207,50.836227,0.95,housenumber,238 Rue des Croisettes 62610 Rodelinghem,62716_0113_00238,G,238 RUE DES CROISETTES,
515027100,00012,51502710000012,O,2009-08-01,01,2019,,2021-10-27T08:23:00,true,3,,625,,RUE,DE JERUSALEM,62610,RODELINGHEM,,,62716,,,,,,,,,,,,,,,,,,,2021-06-30,F,,,,,01.11Z,NAFRev2,O,1.932449,50.83332,0.95,housenumber,625 Rue de Jérusalem 62610 Rodelinghem,62716_0260_00625,G,625 RUE DE JERUSALEM,
524494325,00029,52449432500029,O,2017-12-01,,,,2021-02-23T15:41:31,true,1,,540,,RUE,BERCEAUX,62610,RODELINGHEM,,,62716,,,,,,,,,,,,,,,,,,,2017-12-01,A,,,,,68.31Z,NAFRev2,N,1.924387,50.841615,0.89,housenumber,540 Rue des Berceaux 62610 Rodelinghem,62716_0047_00540,G,540 RUE DES BERCEAUX,
524892403,00022,52489240300022,O,2016-08-18,,,,2021-02-23T15:42:20,true,1,,317,,RUE,DES CROISETTES,62610,RODELINGHEM,,,62716,,,,,,,,,,,,,,,,,,,2016-08-18,A,,,,,85.51Z,NAFRev2,N,1.927336,50.835546,0.95,housenumber,317 Rue des Croisettes 62610 Rodelinghem,62716_0113_00317,G,317 RUE DES CROISETTES,
528076078,00021,52807607800021,O,2018-09-04,,,,2019-07-27T03:55:25,true,2,LOTISSEMENT LES ADRETS,209,,RUE,DU CAMP DU DRAP D OR,62610,RODELINGHEM,,,62716,,,,,,,,,,,,,,,,,,,2019-03-31,F,,,,,47.89Z,NAFRev2,N,1.930416,50.840029,0.82,street,Rue du Camp du Drap d’Or 62610 Rodelinghem,62716_0102,G,RUE DU CAMP DU DRAP D OR,
531508125,00014,53150812500014,O,2011-04-01,,,9609ZP,2014-12-18T03:09:42,false,2,,230,,RUE,DES CROISETTES,62610,RODELINGHEM,,,62716,,,,,,,,,,,,,,,,,,,2013-01-01,F,,,,,96.09Z,NAFRev2,N,1.928076,50.83624,0.95,housenumber,230 Rue des Croisettes 62610 Rodelinghem,62716_0113_00230,G,230 RUE DES CROISETTES,
534749114,00029,53474911400029,O,2016-09-27,02,2019,4329AZ,2021-10-27T08:42:48,true,1,,230,,RUE,CROISETTES,62610,RODELINGHEM,,,62716,,,,,,,,,,,,,,,,,,,2016-09-27,A,,,,COTE D'OPALE ISOLATION ERIC,43.29A,NAFRev2,O,1.928076,50.83624,0.9,housenumber,230 Rue des Croisettes 62610 Rodelinghem,62716_0113_00230,G,230 RUE DES CROISETTES,
535216139,00019,53521613900019,O,2011-10-10,,,,2011-10-12T03:56:37,true,1,,225,,RUE,DES LEUX,62610,RODELINGHEM,,,62716,,,,,,,,,,,,,,,,,,,2011-10-10,A,,,,,68.20B,NAFRev2,N,1.929143,50.833937,0.95,housenumber,225 Rue des Leux 62610 Rodelinghem,62716_0165_00225,G,225 RUE DES LEUX,
539959312,00015,53995931200015,O,2012-02-01,01,2019,4120BB,2021-10-27T08:46:09,true,2,,140,,RUE,DU CAMP DU DRAP D'OR,62610,RODELINGHEM,,,62716,,,,,,,,,,,,,,,,,,,2013-08-19,A,,,,,41.20A,NAFRev2,O,1.930382,50.839054,0.95,housenumber,140 Rue du Camp du Drap d’Or 62610 Rodelinghem,62716_0102_00140,G,140 RUE DU CAMP DU DRAP D OR,
576671465,00010,57667146500010,O,,NN,,,,true,1,,,,,,62610,RODELINGHEM,,,62716,,,,,,,,,,,,,,,,,,,,F,,,,,67.04,NAP,N,,,0,,,,,,
577270762,00013,57727076200013,O,,NN,,,,true,1,,7,,,LA PLACE,62610,RODELINGHEM,,,62716,,,,,,,,,,,,,,,,,,,1994-03-31,F,,,,,55.4B,NAF1993,N,1.929219,50.83795,0.94,housenumber,7 La Place 62610 Rodelinghem,62716_5cskdi_00007,G,7 LA PLACE,
577371537,00017,57737153700017,O,,,,,,true,1,,34,,RUE,DES CROISETTES,62610,RODELINGHEM,,,62716,,,,,,,,,,,,,,,,,,,,F,,,,,21.01,NAP,N,1.929025,50.838,0.95,housenumber,34 Rue des Croisettes 62610 Rodelinghem,62716_0113_00034,G,34 RUE DES CROISETTES,
750985624,00022,75098562400022,O,2018-01-01,,,,2021-02-23T16:06:11,true,1,,620,,RUE,DE JERUSALEM,62610,RODELINGHEM,,,62716,,,,,,,,,,,,,,,,,,,2018-01-01,A,,,,,01.11Z,NAFRev2,N,1.932535,50.833482,0.95,housenumber,620 Rue de Jérusalem 62610 Rodelinghem,62716_0260_00620,G,620 RUE DE JERUSALEM,
783958028,00020,78395802800020,O,,NN,,,,true,1,,,,,,62610,RODELINGHEM,,,62716,,,,,,,,,,,,,,,,,,,1989-09-04,F,,,,,55.60,NAP,N,,,0,,,,,,
784065294,00018,78406529400018,O,,,,,,true,1,,,,,,62610,RODELINGHEM,,,62716,,,,,,,,,,,,,,,,,,,1989-03-29,F,,,,,01.80,NAP,N,,,0,,,,,,
784065310,00012,78406531000012,O,,,,,,true,1,,,,,,62610,RODELINGHEM,,,62716,,,,,,,,,,,,,,,,,,,1997-12-25,F,,,,,91.3E,NAF1993,N,,,0,,,,,,
789082864,00016,78908286400016,O,2012-10-30,,,,2015-03-11T08:42:56,true,2,,187,,,LOTISSEMENT LES ABRETS,62610,RODELINGHEM,,,62716,,,,,,,,,,,,,,,,,,,2015-03-09,F,,,,,62.01Z,NAFRev2,N,1.930428,50.839482,0.95,housenumber,187 Lotissement les Abrets 62610 Rodelinghem,62716_0019_00187,G,187 LOTISSEMENT LES ABRETS,
793604851,00022,79360485100022,O,2015-01-01,,,9602AB,2021-02-23T16:22:04,true,1,,249,,,LOTISSEMENT LES ABRETS,62610,RODELINGHEM,,,62716,,,,,,,,,,,,,,,,,,,2015-01-01,A,,,,LORANNE COIFFURE,96.02A,NAFRev2,N,1.930367,50.840048,0.95,housenumber,249 Lotissement les Abrets 62610 Rodelinghem,62716_0019_00249,G,249 LOTISSEMENT LES ABRETS,
797999489,00033,79799948900033,O,2014-09-01,,,4120BB,2016-04-26T06:15:47,false,2,,14,,RUE,DES BERCEAUX,62610,RODELINGHEM,,,62716,,,,,,,,,,,,,,,,,,,2015-01-01,F,,,,PLAQUIT SEB,41.20B,NAFRev2,O,1.92489,50.839301,0.95,housenumber,14 Rue des Berceaux 62610 Rodelinghem,62716_0047_00014,G,14 RUE DES BERCEAUX,