siren,nic,siret,statutDiffusionEtablissement,dateCreationEtablissement,trancheEffectifsEtablissement,anneeEffectifsEtablissement,activitePrincipaleRegistreMetiersEtablissement,dateDernierTraitementEtablissement,etablissementSiege,nombrePeriodesEtablissement,complementAdresseEtablissement,numeroVoieEtablissement,indiceRepetitionEtablissement,typeVoieEtablissement,libelleVoieEtablissement,codePostalEtablissement,libelleCommuneEtablissement,libelleCommuneEtrangerEtablissement,distributionSpecialeEtablissement,codeCommuneEtablissement,codeCedexEtablissement,libelleCedexEtablissement,codePaysEtrangerEtablissement,libellePaysEtrangerEtablissement,complementAdresse2Etablissement,numeroVoie2Etablissement,indiceRepetition2Etablissement,typeVoie2Etablissement,libelleVoie2Etablissement,codePostal2Etablissement,libelleCommune2Etablissement,libelleCommuneEtranger2Etablissement,distributionSpeciale2Etablissement,codeCommune2Etablissement,codeCedex2Etablissement,libelleCedex2Etablissement,codePaysEtranger2Etablissement,libellePaysEtranger2Etablissement,dateDebut,etatAdministratifEtablissement,enseigne1Etablissement,enseigne2Etablissement,enseigne3Etablissement,denominationUsuelleEtablissement,activitePrincipaleEtablissement,nomenclatureActivitePrincipaleEtablissement,caractereEmployeurEtablissement,longitude,latitude,geo_score,geo_type,geo_adresse,geo_id,geo_ligne,geo_l4,geo_l5
217200021,00012,21720002100012,O,1983-03-01,02,2019,,2021-10-27T08:10:14,true,4,,,,RUE,DES ECOLES,72600,AILLIERES-BEAUVOIR,,,72002,,,,,,,,,,,,,,,,,,,2008-01-01,A,MAIRIE,,,,84.11Z,NAFRev2,O,0.327254,48.404202,0.54,street,Rue des Cytises 72600 Aillières-Beauvoir,72002_0050,G,RUE DES CYTISES,
217200021,00020,21720002100020,O,1983-12-21,NN,,,2019-11-14T14:00:55,false,4,,,,,,72600,AILLIERES-BEAUVOIR,,,72002,,,,,,,,,,,,,,,,,,,1997-12-31,F,ECOLE PRIMAIRE PUBLIQUE,,,,80.1Z,NAF1993,O,,,0,,,,,,
217200021,00038,21720002100038,O,2002-04-04,NN,,,2019-11-14T14:00:55,false,3,MAIRIE,,,RUE,DES ECOLES,72600,AILLIERES-BEAUVOIR,,,72002,,,,,,,,,,,,,,,,,,,2008-01-01,A,ASSAINISSEMENT,,,,37.00Z,NAFRev2,N,0.327254,48.404202,0.54,street,Rue des Cytises 72600 Aillières-Beauvoir,72002_0050,G,RUE DES CYTISES,
257200659,00015,25720065900015,O,,NN,,,2019-11-14T14:00:55,true,1,,,,,HOTEL DE VILLE,72600,AILLIERES-BEAUVOIR,,,72002,,,,,,,,,,,,,,,,,,,1994-04-20,F,,,,,75.1C,NAF1993,N,0.348555,48.388454,0.33,locality,Le Haut de l’Epine 72600 Aillières-Beauvoir,72002_B138,G,LE HAUT DE L EPINE,
267201697,00013,26720169700013,O,1992-11-23,NN,,,2019-11-14T14:00:55,true,3,MAIRIE,,,RUE,DES ECOLES,72600,AILLIERES-BEAUVOIR,,,72002,,,,,,,,,,,,,,,,,,,2008-01-01,A,CCAS,,,,88.99B,NAFRev2,N,0.327254,48.404202,0.54,street,Rue des Cytises 72600 Aillières-Beauvoir,72002_0050,G,RUE DES CYTISES,
308916113,00019,30891611300019,O,1975-01-01,NN,,,2019-11-14T14:00:55,true,5,,,,,LE BOURG,72600,AILLIERES-BEAUVOIR,,,72002,,,,,,,,,,,,,,,,,,,2008-01-01,A,,,,,68.20B,NAFRev2,N,0.321184,48.390916,0.61,locality,Le Bas Bouchage 72600 Aillières-Beauvoir,72002_B308,G,LE BAS BOUCHAGE,
317491264,00014,31749126400014,O,,NN,,,2019-11-14T14:00:55,true,1,,,,,LA VALLEE JOUANNET,72600,AILLIERES-BEAUVOIR,,,72002,,,,,,,,,,,,,,,,,,,1987-06-30,F,,,,,55.71,NAP,N,0.330305,48.413345,0.84,locality,La Vallee Jouanet 72600 Aillières-Beauvoir,72002_B300,G,LA VALLEE JOUANET,
323306498,00011,32330649800011,O,1981-10-01,00,2018,,2020-08-25T10:30:08,true,3,,,,,LA FOSSE,72600,AILLIERES-BEAUVOIR,,,72002,,,,,,,,,,,,,,,,,,,2008-01-01,A,,,,,01.11Z,NAFRev2,N,0.300676,48.384755,0.4,locality,Basse Folie 72600 Aillières-Beauvoir,72002_B007,G,BASSE FOLIE,
323752592,00010,32375259200010,O,1982-02-01,NN,,,2019-11-14T14:00:55,true,3,,,,,FIAZEL 3,72600,AILLIERES-BEAUVOIR,,,72002,,,,,,,,,,,,,,,,,,,2008-01-01,A,,,,,68.20B,NAFRev2,N,,,0,,,,,,
327793105,00013,32779310500013,O,1982-01-01,NN,,,2019-11-14T14:00:55,true,3,,,,,LE BOURG,72600,AILLIERES-BEAUVOIR,,,72002,,,,,,,,,,,,,,,,,,,2008-01-01,A,,,,,94.91Z,NAFRev2,N,0.321184,48.390916,0.61,locality,Le Bas Bouchage 72600 Aillières-Beauvoir,72002_B308,G,LE BAS BOUCHAGE,
331182816,00040,33118281600040,O,1985-01-01,01,2019,,2021-10-27T08:28:23,false,4,,,,,LA PERSINIERE,72600,AILLIERES-BEAUVOIR,,,72002,,,,,,,,,,,,,,,,,,,2008-01-01,A,,,,,08.12Z,NAFRev2,O,0.312841,48.396264,0.47,locality,La Petite Chaize 72600 Aillières-Beauvoir,72002_B205,G,LA PETITE CHAIZE,
339328817,00020,33932881700020,O,1997-06-23,,,,2019-11-14T14:00:55,true,1,,,,,BASSE FOLIE,72600,AILLIERES-BEAUVOIR,,,72002,,,,,,,,,,,,,,,,,,,1998-07-29,F,,,,,74.1J,NAF1993,N,0.300676,48.384755,0.93,locality,Basse Folie 72600 Aillières-Beauvoir,72002_B007,G,BASSE FOLIE,
340638188,00011,34063818800011,O,,NN,,,2019-11-14T14:00:55,true,1,,,,,,72600,AILLIERES-BEAUVOIR,,,72002,,,,,,,,,,,,,,,,,,,1992-12-31,F,,,,,01.4A,NAF1993,N,,,0,,,,,,
340929876,00027,34092987600027,O,2007-09-15,,,,2019-11-14T14:00:55,true,5,,1,,RUE,DU PUITS DU CHENE,72600,AILLIERES-BEAUVOIR,,,72002,,,,,,,,,,,,,,,,,,,2013-09-01,F,,,,,96.09Z,NAFRev2,N,0.326195,48.405138,0.94,housenumber,1 Rue du Puits du Chène 72600 Aillières-Beauvoir,72002_0189_00001,G,1 RUE DU PUITS DU CHENE,
344213400,00015,34421340000015,O,1988-02-01,NN,,,2019-11-14T14:00:55,true,4,,,,,LA HAIRMERAYE,72600,AILLIERES-BEAUVOIR,,,72002,,,,,,,,,,,,,,,,,,,2004-03-31,F,,,,,01.1A,NAFRev1,N,,,0,,,,,,
350229787,00014,35022978700014,O,1989-02-10,NN,,,2019-11-14T14:00:55,true,5,,,,,LE HAUT BOUCHAGE,72600,AILLIERES-BEAUVOIR,,,72002,,,,,,,,,,,,,,,,,,,2012-01-31,A,,,,,68.20B,NAFRev2,N,0.326509,48.392415,0.79,locality,Haut Bouchage 72600 Aillières-Beauvoir,72002_B137,G,HAUT BOUCHAGE,
350230462,00011,35023046200011,O,,NN,,,2019-11-14T14:00:55,true,1,,,,,LALOCHERIE,72600,AILLIERES-BEAUVOIR,,,72002,,,,,,,,,,,,,,,,,,,1993-12-25,F,,,,,71.3A,NAF1993,N,-1.1645569,46.7845404,0.8,poi.track,Chemin d'Exploitation de la Galocherie Essarts-en-Bocage,https://osm.org/way/118184889,G,,
350320131,00047,35032013100047,O,2016-06-01,NN,,,2019-11-14T14:00:55,true,3,,22,,RTE,DE PERSEIGNE,72600,AILLIERES-BEAUVOIR,,,72002,,,,,,,,,,,,,,,,,,,2016-12-18,A,L'OREE DU BOIS,,,L'AUBERGE L'OREE DU BOIS,56.10A,NAFRev2,N,0.326074,48.404682,0.85,housenumber,22 Route de Perseigne 72600 Aillières-Beauvoir,72002_0138_00022,G,22 ROUTE DE PERSEIGNE,
350856951,00024,35085695100024,O,2004-01-10,NN,,,2019-11-14T14:00:55,true,3,,,,LD,LA MARE PATOIE,72600,AILLIERES-BEAUVOIR,,,72002,,,,,,,,,,,,,,,,,,,2005-12-23,F,,,,,74.2C,NAFRev1,N,0.331232,48.401139,0.81,locality,La Mare Patois 72600 Aillières-Beauvoir,72002_B163,G,LA MARE PATOIS,
350856951,00032,35085695100032,O,2004-04-01,NN,,,2019-11-14T14:00:55,false,3,LA MARE PATOIE,,,,,72600,AILLIERES-BEAUVOIR,,,72002,,,,,,,,,,,,,,,,,,,2005-12-23,F,,,,,01.1C,NAFRev1,N,0.331232,48.401139,0.81,locality,La Mare Patois 72600 Aillières-Beauvoir,72002_B163,D,LA MARE PATOIS,
352388649,00035,35238864900035,O,2013-01-01,NN,,,2020-03-27T03:41:30,true,4,,,,LD,LES BOULARDERIES,72600,AILLIERES-BEAUVOIR,,,72002,,,,,,,,,,,,,,,,,,,2017-10-24,F,,,,,46.61Z,NAFRev2,N,0.324717,48.398765,0.93,street,Les Boularderies 72600 Aillières-Beauvoir,72002_vh5a6q,G,LES BOULARDERIES,
379918477,00025,37991847700025,O,2010-01-01,,,9602AB,2019-11-14T14:00:55,false,2,,6,T,RUE,DES CYTISES,72600,AILLIERES-BEAUVOIR,,,72002,,,,,,,,,,,,,,,,,,,2013-11-01,F,,,,,96.02A,NAFRev2,N,0.327435,48.404205,0.84,housenumber,6ter Rue des Cytises 72600 Aillières-Beauvoir,72002_0050_00006_ter,G,6TER RUE DES CYTISES,
387611031,00015,38761103100015,O,1990-10-01,NN,,,2019-11-14T14:00:55,true,3,,,,,LE BOURG,72600,AILLIERES-BEAUVOIR,,,72002,,,,,,,,,,,,,,,,,,,2008-01-01,A,,,,,11.03Z,NAFRev2,N,0.321184,48.390916,0.61,locality,Le Bas Bouchage 72600 Aillières-Beauvoir,72002_B308,G,LE BAS BOUCHAGE,
395205644,00028,39520564400028,O,2009-12-03,,,,2019-11-14T14:00:55,true,2,,,,,LA JUNIDA,72600,AILLIERES-BEAUVOIR,,,72002,,,,,,,,,,,,,,,,,,,2017-12-31,F,,,,,56.21Z,NAFRev2,N,,,0,,,,,,
398297648,00014,39829764800014,O,,NN,,,2019-11-14T14:00:55,true,1,,,,,LE PETIT BEAUREGARD,72600,AILLIERES-BEAUVOIR,,,72002,,,,,,,,,,,,,,,,,,,1996-03-31,F,,,,,52.6E,NAF1993,N,0.321166,48.409677,0.93,locality,Le Petit Beauregard 72600 Aillières-Beauvoir,72002_B194,G,LE PETIT BEAUREGARD,
405339458,00011,40533945800011,O,1996-04-01,NN,,,2019-11-14T14:00:55,true,3,,,,,LES SABLONNIERES,72600,AILLIERES-BEAUVOIR,,,72002,,,,,,,,,,,,,,,,,,,2008-01-01,A,,,,,68.20B,NAFRev2,N,0.33504,48.40229,0.42,locality,Les Petites Epinettes 72600 Aillières-Beauvoir,72002_B210,G,LES PETITES EPINETTES,
407685171,00016,40768517100016,O,1996-04-01,NN,,,2019-11-14T14:00:55,true,5,,,,,LES SABLONNIERES,72600,AILLIERES-BEAUVOIR,,,72002,,,,,,,,,,,,,,,,,,,2016-12-31,F,,,,,01.41Z,NAFRev2,O,0.33504,48.40229,0.42,locality,Les Petites Epinettes 72600 Aillières-Beauvoir,72002_B210,G,LES PETITES EPINETTES,
410748818,00029,41074881800029,O,1997-03-11,NN,,,2019-11-14T14:00:55,false,3,,,,,LA BASSE FOLIE,72600,AILLIERES-BEAUVOIR,,,72002,,,,,,,,,,,,,,,,,,,2008-01-01,A,,,,,68.20B,NAFRev2,N,0.300676,48.384755,0.77,locality,Basse Folie 72600 Aillières-Beauvoir,72002_B007,G,BASSE FOLIE,
411093289,00014,41109328900014,O,1957-01-01,NN,,,2019-11-14T14:00:55,true,4,,,,,,72600,AILLIERES-BEAUVOIR,,,72002,,,,,,,,,,,,,,,,,,,2008-01-01,F,,,,,02.10Z,NAFRev2,N,,,0,,,,,,
411318108,00031,41131810800031,O,2003-09-01,,,,2019-11-14T14:00:55,false,4,,,,,LA MOTTE,72600,AILLIERES-BEAUVOIR,,,72002,,,,,,,,,,,,,,,,,,,2009-12-31,F,,,,,73.11Z,NAFRev2,N,0.312841,48.396264,0.4,locality,La Petite Chaize 72600 Aillières-Beauvoir,72002_B205,G,LA PETITE CHAIZE,
412886855,00011,41288685500011,O,1997-07-04,,,,2019-11-14T14:00:55,true,1,,,,,LE MONT LEVANT,72600,AILLIERES-BEAUVOIR,,,72002,,,,,,,,,,,,,,,,,,,1999-12-01,F,,,,,45.4A,NAF1993,N,0.338238,48.40232,0.59,locality,Mont Levent 72600 Aillières-Beauvoir,72002_B165,G,MONT LEVENT,
413062860,00015,41306286000015,O,1997-06-23,,,,2019-11-14T14:00:55,false,3,,,,,BASSE FOLIE,72600,AILLIERES-BEAUVOIR,,,72002,,,,,,,,,,,,,,,,,,,1998-07-29,F,,,,,70.1F,NAF1993,N,0.300676,48.384755,0.93,locality,Basse Folie 72600 Aillières-Beauvoir,72002_B007,G,BASSE FOLIE,
413333212,00012,41333321200012,O,1990-01-01,NN,,,2019-11-14T14:00:55,true,1,,,,,LA LOCHERIE,72600,AILLIERES-BEAUVOIR,,,72002,,,,,,,,,,,,,,,,,,,2000-09-30,F,,,,,01.1A,NAF1993,N,0.1042005,47.9817365,0.88,poi.track,Chemin de la Locherie au Carrefour de Chanière Saint-Georges-du-Bois,https://osm.org/way/252279181,G,,
413333220,00015,41333322000015,O,1989-12-31,NN,,,2019-11-14T14:00:55,true,1,,,,,LA FIARDERIE,72600,AILLIERES-BEAUVOIR,,,72002,,,,,,,,,,,,,,,,,,,2000-08-31,F,,,,,01.2G,NAF1993,N,0.324717,48.398765,0.43,street,Les Boularderies 72600 Aillières-Beauvoir,72002_vh5a6q,G,LES BOULARDERIES,
413333238,00017,41333323800017,O,1982-12-31,NN,,,2019-11-14T14:00:55,true,4,,,,,FIAZE,72600,AILLIERES-BEAUVOIR,,,72002,,,,,,,,,,,,,,,,,,,2011-12-31,A,,,,,01.11Z,NAFRev2,O,,,0,,,,,,
414369264,00018,41436926400018,O,1997-10-01,NN,,,2019-11-14T14:00:55,true,3,,,,,LA HERMERAYE,72600,AILLIERES-BEAUVOIR,,,72002,,,,,,,,,,,,,,,,,,,2008-01-01,A,,,,,82.99Z,NAFRev2,N,,,0,,,,,,
414382432,00014,41438243200014,O,1997-12-01,NN,,,2019-11-14T14:00:55,true,3,,,,,BOURG,72600,AILLIERES-BEAUVOIR,,,72002,,,,,,,,,,,,,,,,,,,2005-06-30,F,,,,,55.1A,NAFRev1,O,0.324717,48.398765,0.42,street,Les Boularderies 72600 Aillières-Beauvoir,72002_vh5a6q,G,LES BOULARDERIES,
418283230,00013,41828323000013,O,1998-04-06,,,,2019-11-14T14:00:55,true,1,,,,,LES BOULARDERIES,72600,AILLIERES-BEAUVOIR,,,72002,,,,,,,,,,,,,,,,,,,1999-03-31,F,,,,,01.4B,NAF1993,N,0.324717,48.398765,0.93,street,Les Boularderies 72600 Aillières-Beauvoir,72002_vh5a6q,G,LES BOULARDERIES,
421595729,00011,42159572900011,O,1998-12-23,NN,,,2019-11-14T14:00:55,true,3,,,,,LE PRESSOIR,72600,AILLIERES-BEAUVOIR,,,72002,,,,,,,,,,,,,,,,,,,2008-01-01,A,,,,,68.20A,NAFRev2,N,0.321166,48.409677,0.54,locality,Le Petit Beauregard 72600 Aillières-Beauvoir,72002_B194,G,LE PETIT BEAUREGARD,
423726132,00016,42372613200016,O,1999-07-26,NN,,,2019-11-14T14:00:55,true,4,,,,,BOURG,72600,AILLIERES-BEAUVOIR,,,72002,,,,,,,,,,,,,,,,,,,2007-12-20,F,,,,,45.4M,NAFRev1,O,0.324717,48.398765,0.42,street,Les Boularderies 72600 Aillières-Beauvoir,72002_vh5a6q,G,LES BOULARDERIES,
427773957,00019,42777395700019,O,1989-05-01,NN,,,2019-11-14T14:00:55,true,3,,,,,,72600,AILLIERES-BEAUVOIR,,,72002,,,,,,,,,,,,,,,,,,,2008-01-01,A,,,,,68.20B,NAFRev2,N,,,0,,,,,,
429633431,00011,42963343100011,O,2000-03-01,,,,2019-11-14T14:00:55,true,1,,,,,LES BOULARDERIES,72600,AILLIERES-BEAUVOIR,,,72002,,,,,,,,,,,,,,,,,,,2000-05-24,F,,,,,51.1R,NAF1993,N,0.324717,48.398765,0.93,street,Les Boularderies 72600 Aillières-Beauvoir,72002_vh5a6q,G,LES BOULARDERIES,
430680868,00014,43068086800014,O,1970-01-01,NN,,,2019-11-14T14:00:55,true,3,,,,,LES HUPERIES,72600,AILLIERES-BEAUVOIR,,,72002,,,,,,,,,,,,,,,,,,,2008-01-01,A,,,,,01.42Z,NAFRev2,N,0.324717,48.398765,0.54,street,Les Boularderies 72600 Aillières-Beauvoir,72002_vh5a6q,G,LES BOULARDERIES,
432445773,00018,43244577300018,O,2000-04-04,NN,,,2019-11-14T14:00:55,true,3,,,,,LE BAS BOUCHAGES,72600,AILLIERES-BEAUVOIR,,,72002,,,,,,,,,,,,,,,,,,,2004-05-05,F,,,,,01.1A,NAFRev1,N,0.321184,48.390916,0.86,locality,Le Bas Bouchage 72600 Aillières-Beauvoir,72002_B308,G,LE BAS BOUCHAGE,
433582822,00030,43358282200030,O,2019-01-07,,,,2021-02-23T13:15:09,true,1,,,,LD,LES BOULARDERIES,72600,AILLIERES-BEAUVOIR,,,72002,,,,,,,,,,,,,,,,,,,2019-01-07,A,OCCIDENT ORIENT OVERSEAS,,,,46.76Z,NAFRev2,N,0.324717,48.398765,0.93,street,Les Boularderies 72600 Aillières-Beauvoir,72002_vh5a6q,G,LES BOULARDERIES,
439797093,00028,43979709300028,O,2003-04-01,NN,,,2019-11-14T14:00:55,false,4,,,,,LES BOULARDERIES,72600,AILLIERES-BEAUVOIR,,,72002,,,,,,,,,,,,,,,,,,,2012-04-01,F,,,,,93.29Z,NAFRev2,N,0.324717,48.398765,0.93,street,Les Boularderies 72600 Aillières-Beauvoir,72002_vh5a6q,G,LES BOULARDERIES,
441491511,00016,44149151100016,O,2002-03-01,NN,,,2019-11-14T14:00:55,false,4,,,,,LA HAIRMERAYE,72600,AILLIERES-BEAUVOIR,,,72002,,,,,,,,,,,,,,,,,,,2018-08-31,F,,,,,68.31Z,NAFRev2,N,,,0,,,,,,
441491511,00024,44149151100024,O,2004-04-01,NN,,,2021-02-23T13:23:04,false,5,,,,,LA HERMERAYE,72600,AILLIERES-BEAUVOIR,,,72002,,,,,,,,,,,,,,,,,,,2013-04-01,A,,,,,01.11Z,NAFRev2,N,,,0,,,,,,
441491511,00032,44149151100032,O,2019-08-09,,,,2019-11-14T14:00:55,true,1,,,,,LIEU-DIT LA HAIRMERAYE,72600,AILLIERES-BEAUVOIR,,,72002,,,,,,,,,,,,,,,,,,,2019-08-09,A,,,,,46.11Z,NAFRev2,N,,,0,,,,,,
443130893,00029,44313089300029,O,2007-04-05,NN,,3312ZB,2019-11-14T14:00:55,true,5,,,,,LES BOULARDERIES,72600,AILLIERES-BEAUVOIR,,,72002,,,,,,,,,,,,,,,,,,,2014-01-01,F,,,,,33.12Z,NAFRev2,N,0.324717,48.398765,0.93,street,Les Boularderies 72600 Aillières-Beauvoir,72002_vh5a6q,G,LES BOULARDERIES,
453439986,00028,45343998600028,O,2010-05-19,,,,2020-09-03T03:39:18,true,2,,6,,RUE,DES CYTISES,72600,AILLIERES-BEAUVOIR,,,72002,,,,,,,,,,,,,,,,,,,2020-09-02,F,,,,,68.20B,NAFRev2,N,0.327092,48.404193,0.94,housenumber,6 Rue des Cytises 72600 Aillières-Beauvoir,72002_0050_00006,G,6 RUE DES CYTISES,
477925424,00012,47792542400012,O,2004-07-20,,,,2019-11-14T14:00:55,true,3,,,,LD,LA MARE PATOIS,72600,AILLIERES-BEAUVOIR,,,72002,,,,,,,,,,,,,,,,,,,2005-03-31,F,,,,,52.6D,NAFRev1,N,0.331232,48.401139,0.93,locality,La Mare Patois 72600 Aillières-Beauvoir,72002_B163,G,LA MARE PATOIS,
479162489,00021,47916248900021,O,2006-05-17,,,,2019-11-14T14:00:55,false,3,,,,LD,L'EPINE BLANCHE,72600,AILLIERES-BEAUVOIR,,,72002,,,,,,,,,,,,,,,,,,,2012-03-01,F,,,,,59.20Z,NAFRev2,N,0.348555,48.388454,0.47,locality,Le Haut de l’Epine 72600 Aillières-Beauvoir,72002_B138,G,LE HAUT DE L EPINE,
483510954,00017,48351095400017,O,2005-06-30,NN,,,2019-11-14T14:00:55,true,3,,,,LD,LE BOURG,72600,AILLIERES-BEAUVOIR,,,72002,,,,,,,,,,,,,,,,,,,2014-03-31,F,,,,,56.10A,NAFRev2,O,0.321184,48.390916,0.61,locality,Le Bas Bouchage 72600 Aillières-Beauvoir,72002_B308,G,LE BAS BOUCHAGE,
494456551,00014,49445655100014,O,2007-02-21,,,,2019-11-14T14:00:55,true,3,,,,,LE HAUT BOUCHAGE,72600,AILLIERES-BEAUVOIR,,,72002,,,,,,,,,,,,,,,,,,,2008-08-18,F,,,,,43.99C,NAFRev2,N,0.326509,48.392415,0.79,locality,Haut Bouchage 72600 Aillières-Beauvoir,72002_B137,G,HAUT BOUCHAGE,
502474877,00011,50247487700011,O,2008-01-01,,,,2019-11-14T14:00:55,true,1,,,,,BOIS D'AILLIERES,72600,AILLIERES-BEAUVOIR,,,72002,,,,,,,,,,,,,,,,,,,2008-01-01,A,,,,,02.10Z,NAFRev2,O,0.331232,48.401139,0.65,locality,La Mare Patois 72600 Aillières-Beauvoir,72002_B163,G,LA MARE PATOIS,
503553554,00018,50355355400018,O,2008-03-31,,,,2019-11-14T14:00:55,true,1,LE PRE SEC,,,,,72600,AILLIERES-BEAUVOIR,,,72002,,,,,,,,,,,,,,,,,,,2008-03-31,A,,,,,01.43Z,NAFRev2,N,0.321166,48.409677,0.35,locality,Le Petit Beauregard 72600 Aillières-Beauvoir,72002_B194,D,LE PETIT BEAUREGARD,
520268723,00035,52026872300035,O,2021-05-27,,,,2021-08-07T08:44:39,true,1,,1,,RUE,DES CYTISES,72600,AILLIERES-BEAUVOIR,,,72002,,,,,,,,,,,,,,,,,,,2021-05-27,A,,,,BPSI,71.12B,NAFRev2,N,0.32717,48.404233,0.94,housenumber,1 Rue des Cytises 72600 Aillières-Beauvoir,72002_0050_00001,G,1 RUE DES CYTISES,
521130542,00025,52113054200025,O,2010-05-15,,,,2019-11-14T14:00:55,true,2,,9,,RUE,DU PUIT DU CHENE,72600,AILLIERES-BEAUVOIR,,,72002,,,,,,,,,,,,,,,,,,,2010-11-03,F,,,,,47.99A,NAFRev2,N,0.326504,48.406034,0.86,housenumber,9 Rue du Puits du Chène 72600 Aillières-Beauvoir,72002_0189_00009,G,9 RUE DU PUITS DU CHENE,
534757471,00022,53475747100022,O,2013-11-30,,,9602BB,2020-11-17T03:47:13,false,2,,6,T,RUE,DES CYTISES,72600,AILLIERES-BEAUVOIR,,,72002,,,,,,,,,,,,,,,,,,,2020-11-10,F,ANELYSE ESTHETIQUE,,,,96.02B,NAFRev2,N,0.327435,48.404205,0.84,housenumber,6ter Rue des Cytises 72600 Aillières-Beauvoir,72002_0050_00006_ter,G,6TER RUE DES CYTISES,
537382277,00011,53738227700011,O,2011-10-20,,,,2019-11-14T14:00:55,true,2,,,,,LE PUITS,72600,AILLIERES-BEAUVOIR,,,72002,,,,,,,,,,,,,,,,,,,2013-04-14,F,,,,,70.22Z,NAFRev2,N,0.326504,48.406034,0.61,street,Rue du Puits du Chène 72600 Aillières-Beauvoir,72002_0189,G,RUE DU PUITS DU CHENE,
537382558,00014,53738255800014,O,2011-11-01,,,,2019-11-14T14:00:55,true,1,,9,,RUE,DU PUIT DU CHENE,72600,AILLIERES-BEAUVOIR,,,72002,,,,,,,,,,,,,,,,,,,2011-11-01,A,,,,,43.11Z,NAFRev2,N,0.326504,48.406034,0.86,housenumber,9 Rue du Puits du Chène 72600 Aillières-Beauvoir,72002_0189_00009,G,9 RUE DU PUITS DU CHENE,
538079765,00029,53807976500029,O,2018-03-01,,,,2021-10-20T11:03:41,false,2,,18,,RTE,DE PERSEIGNE,72600,AILLIERES-BEAUVOIR,,,72002,,,,,,,,,,,,,,,,,,,2018-12-14,F,,,,,96.04Z,NAFRev2,N,0.32644,48.404384,0.85,housenumber,18 Route de Perseigne 72600 Aillières-Beauvoir,72002_0138_00018,G,18 ROUTE DE PERSEIGNE,
696241306,00013,69624130600013,O,,NN,,,2019-11-14T14:00:55,true,1,,,,LD,BOURG,72600,AILLIERES-BEAUVOIR,,,72002,,,,,,,,,,,,,,,,,,,1990-12-31,F,,,,,67.05,NAP,N,0.324717,48.398765,0.42,street,Les Boularderies 72600 Aillières-Beauvoir,72002_vh5a6q,G,LES BOULARDERIES,
749820775,00015,74982077500015,O,2012-02-01,01,2019,,2021-10-27T08:48:44,true,1,,,,,LE HAUT BOUCHAGE,72600,AILLIERES-BEAUVOIR,,,72002,,,,,,,,,,,,,,,,,,,2012-02-01,A,,,,,01.41Z,NAFRev2,N,0.326509,48.392415,0.79,locality,Haut Bouchage 72600 Aillières-Beauvoir,72002_B137,G,HAUT BOUCHAGE,
752850180,00015,75285018000015,O,2012-07-10,02,2019,,2021-10-27T08:52:29,true,5,,,,LD,LE BAS BOUCHAGE,72600,AILLIERES-BEAUVOIR,,,72002,,,,,,,,,,,,,,,,,,,2017-11-02,A,,,,,46.23Z,NAFRev2,O,0.321184,48.390916,0.93,locality,Le Bas Bouchage 72600 Aillières-Beauvoir,72002_B308,G,LE BAS BOUCHAGE,
786279554,00012,78627955400012,O,,NN,,,2019-11-14T14:00:55,true,1,,,,,,72600,AILLIERES-BEAUVOIR,,,72002,,,,,,,,,,,,,,,,,,,,F,,,,,01.80,NAP,N,,,0,,,,,,
786279562,00015,78627956200015,O,,NN,,,2019-11-14T14:00:55,true,1,,,,LD,MONT LEVANT,72600,AILLIERES-BEAUVOIR,,,72002,,,,,,,,,,,,,,,,,,,,F,,,,,41.07,NAP,N,0.338238,48.40232,0.68,locality,Mont Levent 72600 Aillières-Beauvoir,72002_B165,G,MONT LEVENT,
786286021,00021,78628602100021,O,1992-12-25,NN,,,2019-11-14T14:00:55,false,3,,,,LD,BIQUES,72600,AILLIERES-BEAUVOIR,,,72002,,,,,,,,,,,,,,,,,,,1993-12-25,F,,,,,45.4C,NAF1993,N,0.327287,48.404593,0.91,street,Rue aux Biques 72600 Aillières-Beauvoir,72002_0025,G,RUE AUX BIQUES,
786286021,00039,78628602100039,O,1993-02-15,NN,,,2019-11-14T14:00:55,true,3,,,,,LE BOURG,72600,AILLIERES-BEAUVOIR,,,72002,,,,,,,,,,,,,,,,,,,2007-11-30,F,,,,,36.1E,NAFRev1,N,0.321184,48.390916,0.61,locality,Le Bas Bouchage 72600 Aillières-Beauvoir,72002_B308,G,LE BAS BOUCHAGE,
786337287,00035,78633728700035,O,1991-01-01,NN,,,2019-11-14T14:00:55,false,4,,,,,FORET DE PERSEIGNE,72600,AILLIERES-BEAUVOIR,,,72002,,,,,,,,,,,,,,,,,,,2010-10-31,F,,,,,94.99Z,NAFRev2,N,0.322909,48.416055,0.93,street,Foret de Perseigne 72600 Aillières-Beauvoir,72002_B105,G,FORET DE PERSEIGNE,
791068083,00017,79106808300017,O,2013-01-01,,,4334ZC,2019-11-14T14:00:55,true,2,,18,,RTE,DE PERSEIGNE,72600,AILLIERES-BEAUVOIR,,,72002,,,,,,,,,,,,,,,,,,,2014-11-13,F,,,,,43.34Z,NAFRev2,N,0.32644,48.404384,0.85,housenumber,18 Route de Perseigne 72600 Aillières-Beauvoir,72002_0138_00018,G,18 ROUTE DE PERSEIGNE,
793504812,00017,79350481200017,O,2001-04-24,,,,2019-11-14T14:00:55,true,1,,,,,CHEMIN DU CRUCHET,72600,AILLIERES-BEAUVOIR,,,72002,,,,,,,,,,,,,,,,,,,2001-04-24,A,,,,,94.99Z,NAFRev2,N,0.324844,48.40666,0.73,street,Chemin des Cruchets 72600 Aillières-Beauvoir,72002_0046,G,CHEMIN DES CRUCHETS,
793882523,00012,79388252300012,O,2013-06-18,NN,,,2019-11-14T14:00:55,true,3,,4,,RTE,DE LA NOMBRAIE,72600,AILLIERES-BEAUVOIR,,,72002,,,,,,,,,,,,,,,,,,,2016-10-18,A,,,,,43.91B,NAFRev2,N,,,0,,,,,,
797703279,00027,79770327900027,O,2014-06-16,NN,,,2021-02-23T16:25:39,true,1,,22,,RTE,DE PERSEIGNE,72600,AILLIERES-BEAUVOIR,,,72002,,,,,,,,,,,,,,,,,,,2014-06-16,A,L'OREE DU BOIS,,,,56.10A,NAFRev2,O,0.326074,48.404682,0.85,housenumber,22 Route de Perseigne 72600 Aillières-Beauvoir,72002_0138_00022,G,22 ROUTE DE PERSEIGNE,
798444022,00015,79844402200015,O,2013-11-12,,,,2020-10-05T07:57:51,false,2,,,,IMP,LE PETIT BEAUREGARD,72600,AILLIERES-BEAUVOIR,,,72002,,,,,,,,,,,,,,,,,,,2019-05-30,F,,,,,01.62Z,NAFRev2,N,0.321166,48.409677,0.8,locality,Le Petit Beauregard 72600 Aillières-Beauvoir,72002_B194,G,LE PETIT BEAUREGARD,
798728465,00013,79872846500013,O,2013-11-18,,,,2019-11-14T14:00:55,false,2,,,,,BOUCHAGE,72600,AILLIERES-BEAUVOIR,,,72002,,,,,,,,,,,,,,,,,,,2014-03-01,F,,,,,01.42Z,NAFRev2,N,0.326509,48.392415,0.91,locality,Haut Bouchage 72600 Aillières-Beauvoir,72002_B137,G,HAUT BOUCHAGE,
798728465,00021,79872846500021,O,2014-03-01,NN,,,2021-02-23T16:27:23,true,2,,,,,LE BAS BOUCHAGE,72600,AILLIERES-BEAUVOIR,,,72002,,,,,,,,,,,,,,,,,,,2016-02-07,A,,,,,01.42Z,NAFRev2,O,0.321184,48.390916,0.93,locality,Le Bas Bouchage 72600 Aillières-Beauvoir,72002_B308,G,LE BAS BOUCHAGE,
798836268,00010,79883626800010,O,2013-12-01,,,,2021-02-23T16:27:33,true,4,,30,,RTE,DE PERSEIGNE,72600,AILLIERES-BEAUVOIR,,,72002,,,,,,,,,,,,,,,,,,,2019-09-16,A,,,,AMELISSABOX,47.99A,NAFRev2,N,0.324905,48.405248,0.85,housenumber,30 Route de Perseigne 72600 Aillières-Beauvoir,72002_0138_00030,G,30 ROUTE DE PERSEIGNE,
800107245,00014,80010724500014,O,2001-04-27,,,,2019-11-14T14:00:55,true,1,MAIRIE,3,,RUE,PUITS DU CHENE,72600,AILLIERES-BEAUVOIR,,,72002,,,,,,,,,,,,,,,,,,,2001-04-27,A,,,,,94.99Z,NAFRev2,N,0.326036,48.405045,0.9,housenumber,3 Rue du Puits du Chène 72600 Aillières-Beauvoir,72002_0189_00003,G,3 RUE DU PUITS DU CHENE,
807864004,00013,80786400400013,O,2014-11-17,,,,2019-11-14T14:00:55,true,1,,14,,RTE,DES NOUETTES,72600,AILLIERES-BEAUVOIR,,,72002,,,,,,,,,,,,,,,,,,,2014-11-17,A,,,,,43.34Z,NAFRev2,N,0.326791,48.404285,0.42,housenumber,14 Route de Perseigne 72600 Aillières-Beauvoir,72002_0138_00014,G,14 ROUTE DE PERSEIGNE,
808124887,00015,80812488700015,O,2014-11-01,,,,2019-11-14T14:00:55,true,1,,,,,LE TERTRE,72600,AILLIERES-BEAUVOIR,,,72002,,,,,,,,,,,,,,,,,,,2014-11-01,A,,,,,64.20Z,NAFRev2,N,0.346683,48.378372,0.37,locality,Les Quatre Souches 72600 Aillières-Beauvoir,72002_B267,G,LES QUATRE SOUCHES,