siren,nic,siret,statutDiffusionEtablissement,dateCreationEtablissement,trancheEffectifsEtablissement,anneeEffectifsEtablissement,activitePrincipaleRegistreMetiersEtablissement,dateDernierTraitementEtablissement,etablissementSiege,nombrePeriodesEtablissement,complementAdresseEtablissement,numeroVoieEtablissement,indiceRepetitionEtablissement,typeVoieEtablissement,libelleVoieEtablissement,codePostalEtablissement,libelleCommuneEtablissement,libelleCommuneEtrangerEtablissement,distributionSpecialeEtablissement,codeCommuneEtablissement,codeCedexEtablissement,libelleCedexEtablissement,codePaysEtrangerEtablissement,libellePaysEtrangerEtablissement,complementAdresse2Etablissement,numeroVoie2Etablissement,indiceRepetition2Etablissement,typeVoie2Etablissement,libelleVoie2Etablissement,codePostal2Etablissement,libelleCommune2Etablissement,libelleCommuneEtranger2Etablissement,distributionSpeciale2Etablissement,codeCommune2Etablissement,codeCedex2Etablissement,libelleCedex2Etablissement,codePaysEtranger2Etablissement,libellePaysEtranger2Etablissement,dateDebut,etatAdministratifEtablissement,enseigne1Etablissement,enseigne2Etablissement,enseigne3Etablissement,denominationUsuelleEtablissement,activitePrincipaleEtablissement,nomenclatureActivitePrincipaleEtablissement,caractereEmployeurEtablissement,longitude,latitude,geo_score,geo_type,geo_adresse,geo_id,geo_ligne,geo_l4,geo_l5
217601400,00013,21760140000013,O,1983-03-01,02,2019,,2021-10-27T08:10:29,true,4,,,,,LE BOURG,76740,BRAMETOT,,,76140,,,,,,,,,,,,,,,,,,,2008-01-01,A,MAIRIE,,,,84.11Z,NAFRev2,O,0.866135,49.78398,0.31,street,Route de Canville 76740 Brametot,76140_0013,G,ROUTE DE CANVILLE,
217601400,00021,21760140000021,O,1983-12-21,01,2019,,2021-10-27T08:10:29,false,3,,8,,RUE,DE L'EGLISE,76740,BRAMETOT,,,76140,,,,,,,,,,,,,,,,,,,2008-01-01,A,ECOLE PRIMAIRE PUBLIQUE,,,,85.20Z,NAFRev2,N,0.865765,49.78508,0.94,housenumber,8 Rue de l’Eglise 76740 Brametot,76140_0025_00008,G,8 RUE DE L EGLISE,
257604710,00018,25760471000018,O,2002-12-31,,,,2006-10-26T23:44:28,false,3,MAIRIE,,,RTE,DE CANVILLE,76740,BRAMETOT,,,76140,,,,,,,,,,,,,,,,,,,2005-06-30,F,,,,,75.1G,NAFRev1,N,0.866135,49.78398,0.83,street,Route de Canville 76740 Brametot,76140_0013,G,ROUTE DE CANVILLE,
257604710,00075,25760471000075,O,2002-12-31,01,2019,,2021-10-27T08:12:27,false,1,,,,RTE,DE VENESTANVILLE,76740,BRAMETOT,,,76140,,,,,,,,,,,,,,,,,,,2002-12-31,A,CENTRE DE STOCKAGE,,,,38.21Z,NAFRev2,O,0.876788,49.785649,0.85,locality,Route de Venestanville 76740 Brametot,76140_0095,G,ROUTE DE VENESTANVILLE,
267601169,00019,26760116900019,O,1983-03-01,NN,,,2020-02-04T10:03:28,true,4,MAIRIE,,,,LE BOURG,76740,BRAMETOT,,,76140,,,,,,,,,,,,,,,,,,,2018-12-31,F,CCAS,,,,88.99B,NAFRev2,N,0.866135,49.78398,0.31,street,Route de Canville 76740 Brametot,76140_0013,G,ROUTE DE CANVILLE,
303931240,00012,30393124000012,O,,,,,,true,1,,,,,,76740,BRAMETOT,,,76140,,,,,,,,,,,,,,,,,,,1984-12-25,F,,,,,64.24,NAP,N,,,0,,,,,,
311518823,00027,31151882300027,O,,NN,,,,true,1,,,,,,76740,BRAMETOT,,,76140,,,,,,,,,,,,,,,,,,,1988-08-20,F,,,,,67.07,NAP,N,,,0,,,,,,
313371379,00014,31337137900014,O,1978-01-01,NN,,,2008-10-06T20:58:30,true,4,,,,,,76740,BRAMETOT,,,76140,,,,,,,,,,,,,,,,,,,2008-09-29,F,,,,,49.41A,NAFRev2,N,,,0,,,,,,
316324144,00013,31632414400013,O,,NN,,,,true,1,,,,,,76740,BRAMETOT,,,76140,,,,,,,,,,,,,,,,,,,1987-12-25,F,,,,,64.24,NAP,N,,,0,,,,,,
317502458,00019,31750245800019,O,,,,,,true,1,,,,,,76740,BRAMETOT,,,76140,,,,,,,,,,,,,,,,,,,1985-12-25,F,,,,,55.71,NAP,N,,,0,,,,,,
318145273,00013,31814527300013,O,,,,,,true,1,,,,,,76740,BRAMETOT,,,76140,,,,,,,,,,,,,,,,,,,1985-12-25,F,,,,,49.01,NAP,N,,,0,,,,,,
326646726,00017,32664672600017,O,,NN,,,,true,1,,,,,,76740,BRAMETOT,,,76140,,,,,,,,,,,,,,,,,,,2002-04-28,F,,,,,01.1A,NAF1993,N,,,0,,,,,,
328921739,00038,32892173900038,O,1984-03-01,NN,,,2012-10-11T10:11:58,false,4,,,,,,76740,BRAMETOT,,,76140,,,,,,,,,,,,,,,,,,,2012-09-12,F,,,,,38.21Z,NAFRev2,N,,,0,,,,,,
331803999,00019,33180399900019,O,,NN,,,,true,1,,,,,,76740,BRAMETOT,,,76140,,,,,,,,,,,,,,,,,,,,F,,,,,55.71,NAP,N,,,0,,,,,,
342653243,00010,34265324300010,O,1987-10-01,NN,,,2018-06-12T10:19:03,false,4,,,,,,76740,BRAMETOT,,,76140,,,,,,,,,,,,,,,,,,,2015-12-31,A,,,,,68.20B,NAFRev2,N,,,0,,,,,,
342653243,00036,34265324300036,O,2018-06-05,,,,2021-02-23T10:58:06,true,1,,6,,RTE,DE GRAINVILLE,76740,BRAMETOT,,,76140,,,,,,,,,,,,,,,,,,,2018-06-05,A,,,,,46.11Z,NAFRev2,N,0.863288,49.777491,0.85,housenumber,6 Route de Grainville 76740 Brametot,76140_0035_00006,G,6 ROUTE DE GRAINVILLE,
343744181,00011,34374418100011,O,,NN,,,,true,1,,,,,,76740,BRAMETOT,,,76140,,,,,,,,,,,,,,,,,,,2002-09-18,F,,,,,01.3Z,NAF1993,N,,,0,,,,,,
349325183,00086,34932518300086,O,2001-10-01,NN,,,2008-04-26T11:01:45,false,5,,,,,,76740,BRAMETOT,,,76140,,,,,,,,,,,,,,,,,,,2006-12-31,F,,,,,90.0E,NAFRev1,N,,,0,,,,,,
349868836,00033,34986883600033,O,2010-10-01,,,,2014-01-07T11:08:41,false,2,,2,,RTE,DE ROUEN,76740,BRAMETOT,,,76140,,,,,,,,,,,,,,,,,,,2014-01-01,F,,,,,41.20A,NAFRev2,N,0.871963,49.78119,0.82,housenumber,2 Route de Rouen 76740 Brametot,76140_0075_00002,G,2 ROUTE DE ROUEN,
383825023,00013,38382502300013,O,1991-10-01,NN,,,,true,1,,,,,,76740,BRAMETOT,,,76140,,,,,,,,,,,,,,,,,,,1998-03-31,F,,,,,71.3C,NAF1993,N,,,0,,,,,,
384155156,00019,38415515600019,O,1991-03-20,NN,,,2007-01-18T09:30:22,true,3,,,,,,76740,BRAMETOT,,,76140,,,,,,,,,,,,,,,,,,,1999-12-31,F,,,,,01.1A,NAF1993,N,,,0,,,,,,
385116561,00015,38511656100015,O,1992-04-02,NN,,,2014-06-14T01:01:01,true,6,,,,,,76740,BRAMETOT,,,76140,,,,,,,,,,,,,,,,,,,2013-07-31,F,,,,,43.99C,NAFRev2,N,,,0,,,,,,
410301162,00252,41030116200252,O,1998-01-01,,,,2021-08-23T10:06:21,false,4,USINE DE BRAMETOT,,,,,76740,BRAMETOT,,,76140,,,,,,,,,,,,,,,,,,,2020-12-31,F,,,,,38.21Z,NAFRev2,N,0.864992,49.78567,0.68,street,Rue de l’Eglise 76740 Brametot,76140_0025,D,RUE DE L EGLISE,
420806473,00013,42080647300013,O,1998-11-01,NN,,,2008-07-10T01:23:15,true,3,MME MICHAUD,,,RTE,DE CANVILLE,76740,BRAMETOT,,,76140,,,,,,,,,,,,,,,,,,,2008-01-01,A,,,,,68.20B,NAFRev2,N,0.866135,49.78398,0.83,street,Route de Canville 76740 Brametot,76140_0013,G,ROUTE DE CANVILLE,
428481030,00024,42848103000024,O,2006-10-01,,,,2021-02-23T11:48:02,true,2,,18,,RTE,DE CANVILLE,76740,BRAMETOT,,,76140,,,,,,,,,,,,,,,,,,,2008-01-01,A,,,,,90.03B,NAFRev2,N,0.864223,49.78364,0.85,housenumber,18 Route de Canville 76740 Brametot,76140_0013_00018,G,18 ROUTE DE CANVILLE,
447539008,00014,44753900800014,O,1993-03-31,NN,,,2008-01-04T22:55:44,true,3,,1,,RUE,DU PUITS,76740,BRAMETOT,,,76140,,,,,,,,,,,,,,,,,,,2008-01-01,A,,,,,01.45Z,NAFRev2,N,0.867243,49.785203,0.94,housenumber,1 Rue du Puits 76740 Brametot,76140_0066_00001,G,1 RUE DU PUITS,
448783662,00019,44878366200019,O,2003-05-01,NN,,,2009-06-27T10:53:59,false,4,,4,,RTE,DE ROUEN,76740,BRAMETOT,,,76140,,,,,,,,,,,,,,,,,,,2008-01-01,F,,,,,43.22A,NAFRev2,O,0.871759,49.781474,0.82,housenumber,4 Route de Rouen 76740 Brametot,76140_0075_00004,G,4 ROUTE DE ROUEN,
482188364,00020,48218836400020,O,2006-10-01,,,,2021-02-23T13:46:14,true,2,,18,,RTE,DE CANVILLE,76740,BRAMETOT,,,76140,,,,,,,,,,,,,,,,,,,2008-01-01,A,,,,,90.03B,NAFRev2,N,0.864223,49.78364,0.85,housenumber,18 Route de Canville 76740 Brametot,76140_0013_00018,G,18 ROUTE DE CANVILLE,
484333505,00010,48433350500010,O,2005-08-10,,,,2008-01-05T01:31:04,true,2,,1,B,RUE,DE L EGLISE,76740,BRAMETOT,,,76140,,,,,,,,,,,,,,,,,,,2008-01-01,A,,,,,68.20A,NAFRev2,N,0.865782,49.784864,0.85,housenumber,1bis Rue de l’Eglise 76740 Brametot,76140_0025_00001_bis,G,1BIS RUE DE L EGLISE,
494956824,00010,49495682400010,O,2007-03-16,02,2019,,2021-10-27T08:34:49,true,2,,1,,RTE,DE GRAINVILLE,76740,BRAMETOT,,,76140,,,,,,,,,,,,,,,,,,,2008-01-01,A,,,,,01.50Z,NAFRev2,O,0.867665,49.778586,0.85,housenumber,1 Route de Grainville 76740 Brametot,76140_0035_00001,G,1 ROUTE DE GRAINVILLE,
501744130,00037,50174413000037,O,2010-11-03,11,2019,,2021-10-27T08:04:06,true,1,,,,RTE,DE VENESTANVILLE,76740,BRAMETOT,,,76140,,,,,,,,,,,,,,,,,,,2010-11-03,A,,,,,38.21Z,NAFRev2,O,0.876788,49.785649,0.85,locality,Route de Venestanville 76740 Brametot,76140_0095,G,ROUTE DE VENESTANVILLE,
513989277,00019,51398927700019,O,2009-08-01,,,,2020-03-10T19:33:10,true,1,,2,,,CAVEE BALLET,76740,BRAMETOT,,,76140,,,,,,,,,,,,,,,,,,,2009-08-01,A,,,,,70.22Z,NAFRev2,N,0.867564,49.786534,0.86,housenumber,2 Rue de la Cavee Ballet 76740 Brametot,76140_0016_00002,G,2 RUE DE LA CAVEE BALLET,
520540881,00015,52054088100015,O,2010-02-16,,,,2012-11-10T01:50:17,true,2,,12,,RUE,DE CANVILLE,76740,BRAMETOT,,,76140,,,,,,,,,,,,,,,,,,,2011-01-30,F,,,,,96.02A,NAFRev2,N,0.865027,49.783737,0.8,housenumber,12 Route de Canville 76740 Brametot,76140_0013_00012,G,12 ROUTE DE CANVILLE,
521733600,00014,52173360000014,O,2010-04-02,,,,2010-04-14T05:21:09,true,1,,,,RTE,DE GRAINVILLE,76740,BRAMETOT,,,76140,,,,,,,,,,,,,,,,,,,2010-04-02,A,,,,,01.49Z,NAFRev2,N,0.863288,49.777491,0.84,street,Route de Grainville 76740 Brametot,76140_0035,G,ROUTE DE GRAINVILLE,
530908631,00027,53090863100027,O,2011-08-12,NN,,4331ZB,2020-11-03T03:40:26,true,3,,12,,RTE,DE CANVILLE,76740,BRAMETOT,,,76140,,,,,,,,,,,,,,,,,,,2020-11-02,F,,,,,43.31Z,NAFRev2,O,0.865027,49.783737,0.85,housenumber,12 Route de Canville 76740 Brametot,76140_0013_00012,G,12 ROUTE DE CANVILLE,
562077503,01370,56207750301370,O,1996-02-24,,,,,false,3,,,,,,76740,BRAMETOT,,,76140,,,,,,,,,,,,,,,,,,,1998-11-27,F,,,,,45.2E,NAF1993,N,,,0,,,,,,
575750161,00359,57575016100359,O,1997-12-25,,,,2008-01-05T02:31:00,false,2,,,,,,76740,BRAMETOT,,,76140,,,,,,,,,,,,,,,,,,,2008-01-01,A,,,,,36.00Z,NAFRev2,N,,,0,,,,,,
606970408,00013,60697040800013,O,,,,4331ZB,2015-03-18T00:43:27,true,1,,,,,,76740,BRAMETOT,,,76140,,,,,,,,,,,,,,,,,,,1997-12-31,F,,,,,45.4A,NAF1993,N,,,0,,,,,,
607170230,00017,60717023000017,O,,,,,,true,1,,,,,,76740,BRAMETOT,,,76140,,,,,,,,,,,,,,,,,,,1984-12-25,F,,,,,67.05,NAP,N,,,0,,,,,,
749942033,00012,74994203300012,O,2012-03-01,NN,,4322AZ,2016-04-26T05:21:51,true,2,,9,,RTE,DE CANVILLE,76740,BRAMETOT,,,76140,,,,,,,,,,,,,,,,,,,2013-01-07,A,,,,,43.22A,NAFRev2,O,0.864745,49.783583,0.84,housenumber,9 Route de Canville 76740 Brametot,76140_0013_00009,G,9 ROUTE DE CANVILLE,
753806520,00023,75380652000023,O,2014-07-01,,,,2016-11-25T04:59:06,true,2,,7,,,LOTISSEMENT LES JONCS MARINS,76740,BRAMETOT,,,76140,,,,,,,,,,,,,,,,,,,2014-09-30,F,,,,,43.31Z,NAFRev2,N,0.863564,49.78311,0.94,housenumber,7 Lotissement les Joncs Marins 76740 Brametot,76140_a010_00007,G,7 LOTISSEMENT LES JONCS MARINS,
781002134,00018,78100213400018,O,1900-01-01,NN,,,2008-01-05T03:15:09,true,3,,,,,,76740,BRAMETOT,,,76140,,,,,,,,,,,,,,,,,,,2008-01-01,A,,,,,94.99Z,NAFRev2,N,,,0,,,,,,
789728540,00020,78972854000020,O,2016-04-22,,,,2021-02-23T16:15:31,true,1,,1,B,RTE,DE ROUEN,76740,BRAMETOT,,,76140,,,,,,,,,,,,,,,,,,,2016-04-22,A,,,,,45.20A,NAFRev2,N,0.869705,49.784153,0.72,housenumber,1bis Route de Rouen 76740 Brametot,76140_0075_00001_bis,G,1BIS ROUTE DE ROUEN,
802271791,00013,80227179100013,O,2014-05-01,,,,2014-07-10T03:04:22,true,2,,4,,,T LOTISSEMENT LES JONCS MARINS,76740,BRAMETOT,,,76140,,,,,,,,,,,,,,,,,,,2014-06-16,F,,,,A L AUTOMOBILES,45.11Z,NAFRev2,N,0.863787,49.782878,0.86,housenumber,4ter Lotissement les Joncs Marins 76740 Brametot,76140_a010_00004_ter,G,4TER LOT LES JONCS MARINS,
803991223,00014,80399122300014,O,2014-07-10,,,,2020-08-15T03:39:34,false,2,,6,,RUE,DE LA RUETTE,76740,BRAMETOT,,,76140,,,,,,,,,,,,,,,,,,,2020-07-16,F,,,,,68.20B,NAFRev2,N,0.864561,49.787481,0.94,housenumber,6 Rue de la Ruette 76740 Brametot,76140_0080_00006,G,6 RUE DE LA RUETTE,
804241537,00013,80424153700013,O,2014-09-01,,,,2014-08-28T09:13:03,true,1,,6,,RUE,DE L'EGLISE,76740,BRAMETOT,,,76140,,,,,,,,,,,,,,,,,,,2014-09-01,A,,,,,43.99C,NAFRev2,N,0.865894,49.784901,0.94,housenumber,6 Rue de l’Eglise 76740 Brametot,76140_0025_00006,G,6 RUE DE L EGLISE,
805100500,00018,80510050000018,O,2014-11-01,,,,2015-10-12T02:35:58,true,2,,4,B,RUE,LES JONCS MARINS,76740,BRAMETOT,,,76140,,,,,,,,,,,,,,,,,,,2015-11-01,F,,,,,85.32Z,NAFRev2,N,0.863787,49.782878,0.71,housenumber,4bis Lotissement les Joncs Marins 76740 Brametot,76140_a010_00004_bis,G,4BIS LOT LES JONCS MARINS,
814241428,00014,81424142800014,O,2011-11-09,,,,2015-10-21T18:23:25,true,1,SITE DE L'E'CAUX POLE,,,RTE,DE VENESTANVILLE,76740,BRAMETOT,,,76140,,,,,,,,,,,,,,,,,,,2011-11-09,A,,,,,72.19Z,NAFRev2,N,0.876788,49.785649,0.85,locality,Route de Venestanville 76740 Brametot,76140_0095,G,ROUTE DE VENESTANVILLE,
818777526,00026,81877752600026,O,2018-11-11,,,,2018-11-15T03:54:40,true,1,,,,,DEPARTEMENTAL D 307,76740,BRAMETOT,,,76140,,,,,,,,,,,,,,,,,,,2018-11-11,A,,,,,01.42Z,NAFRev2,N,-0.6282885,44.492273,0.72,poi.camp_site,Camping Départemental d'Hostens Hostens,https://osm.org/way/517090746,G,,
823241534,00010,82324153400010,O,2016-10-10,,,,2016-10-20T09:52:13,true,1,,1,B,RUE,DE L'EGLISE,76740,BRAMETOT,,,76140,,,,,,,,,,,,,,,,,,,2016-10-10,A,,,,,68.20B,NAFRev2,N,0.865782,49.784864,0.85,housenumber,1bis Rue de l’Eglise 76740 Brametot,76140_0025_00001_bis,G,1BIS RUE DE L EGLISE,
823467402,00017,82346740200017,O,2016-10-01,02,2019,,2021-10-27T09:29:19,true,1,,1,,RTE,DE GRAINVILLE,76740,BRAMETOT,,,76140,,,,,,,,,,,,,,,,,,,2016-10-01,A,,,,,46.31Z,NAFRev2,O,0.867665,49.778586,0.85,housenumber,1 Route de Grainville 76740 Brametot,76140_0035_00001,G,1 ROUTE DE GRAINVILLE,
823961438,00012,82396143800012,O,2016-09-11,,,,2016-11-27T03:57:19,true,1,,1,,RUE,DU PUITS,76740,BRAMETOT,,,76140,,,,,,,,,,,,,,,,,,,2016-09-11,A,,,,,01.49Z,NAFRev2,N,0.867243,49.785203,0.94,housenumber,1 Rue du Puits 76740 Brametot,76140_0066_00001,G,1 RUE DU PUITS,
829397629,00017,82939762900017,O,2017-05-01,,,3213ZZ,2019-08-22T19:31:58,false,2,,1,,RTE,DE CANVILLE,76740,BRAMETOT,,,76140,,,,,,,,,,,,,,,,,,,2019-03-01,F,,,,LES CREA DE BENE,32.13Z,NAFRev2,N,0.868278,49.784647,0.84,housenumber,1 Route de Canville 76740 Brametot,76140_0013_00001,G,1 ROUTE DE CANVILLE,
852071240,00018,85207124000018,O,2019-07-01,,,1392ZC,2019-12-18T03:56:26,true,2,,3,,RUE,DE LA RUETTE,76740,BRAMETOT,,,76140,,,,,,,,,,,,,,,,,,,2019-10-01,F,,,,,13.92Z,NAFRev2,N,0.864378,49.78677,0.94,housenumber,3 Rue de la Ruette 76740 Brametot,76140_0080_00003,G,3 RUE DE LA RUETTE,
899449805,00014,89944980500014,O,2021-05-10,,,,2021-12-06T03:34:03,true,2,,4,T,,LOTISSEMENT LES JONCS MARINS,76740,BRAMETOT,,,76140,,,,,,,,,,,,,,,,,,,2021-11-30,F,,,,,47.99A,NAFRev2,N,0.863787,49.782878,0.91,housenumber,4ter Lotissement les Joncs Marins 76740 Brametot,76140_a010_00004_ter,G,4TER LOT LES JONCS MARINS,
900846916,00014,90084691600014,O,2021-06-25,,,,2021-06-29T11:43:08,true,1,,1,,RTE,DE GRAINVILLE,76740,BRAMETOT,,,76140,,,,,,,,,,,,,,,,,,,2021-06-25,A,,,,,66.30Z,NAFRev2,N,0.867665,49.778586,0.85,housenumber,1 Route de Grainville 76740 Brametot,76140_0035_00001,G,1 ROUTE DE GRAINVILLE,
907945711,00014,90794571100014,O,2021-11-01,,,,2021-12-08T09:07:47,true,1,,6,,RTE,DE GRAINVILLE,76740,BRAMETOT,,,76140,,,,,,,,,,,,,,,,,,,2021-11-01,A,,,,,46.11Z,NAFRev2,N,0.863288,49.777491,0.85,housenumber,6 Route de Grainville 76740 Brametot,76140_0035_00006,G,6 ROUTE DE GRAINVILLE,
