siren,nic,siret,statutDiffusionEtablissement,dateCreationEtablissement,trancheEffectifsEtablissement,anneeEffectifsEtablissement,activitePrincipaleRegistreMetiersEtablissement,dateDernierTraitementEtablissement,etablissementSiege,nombrePeriodesEtablissement,complementAdresseEtablissement,numeroVoieEtablissement,indiceRepetitionEtablissement,typeVoieEtablissement,libelleVoieEtablissement,codePostalEtablissement,libelleCommuneEtablissement,libelleCommuneEtrangerEtablissement,distributionSpecialeEtablissement,codeCommuneEtablissement,codeCedexEtablissement,libelleCedexEtablissement,codePaysEtrangerEtablissement,libellePaysEtrangerEtablissement,complementAdresse2Etablissement,numeroVoie2Etablissement,indiceRepetition2Etablissement,typeVoie2Etablissement,libelleVoie2Etablissement,codePostal2Etablissement,libelleCommune2Etablissement,libelleCommuneEtranger2Etablissement,distributionSpeciale2Etablissement,codeCommune2Etablissement,codeCedex2Etablissement,libelleCedex2Etablissement,codePaysEtranger2Etablissement,libellePaysEtranger2Etablissement,dateDebut,etatAdministratifEtablissement,enseigne1Etablissement,enseigne2Etablissement,enseigne3Etablissement,denominationUsuelleEtablissement,activitePrincipaleEtablissement,nomenclatureActivitePrincipaleEtablissement,caractereEmployeurEtablissement,longitude,latitude,geo_score,geo_type,geo_adresse,geo_id,geo_ligne,geo_l4,geo_l5
200040624,00161,20004062400161,O,2014-01-01,,,,2019-02-27T11:23:33,false,1,,,,QUA,LABAUD,84750,CASENEUVE,,,84032,,,,,,,,,,,,,,,,,,,2014-01-01,A,MULTI ACCUEIL LES PITCHOUNS,,,,88.91A,NAFRev2,N,5.487201,43.884926,0.63,street,Labaud 84750 Caseneuve,84032_319xwa,G,LABAUD,
218400323,00018,21840032300018,O,1983-03-01,03,2019,,2021-10-27T08:11:00,true,4,,,,,HOT DE VILLE,84750,CASENEUVE,,,84032,,,,,,,,,,,,,,,,,,,2008-01-01,A,MAIRIE,,,,84.11Z,NAFRev2,O,5.451406,43.888199,0.44,street,Impasse de la Reille 84750 Caseneuve,84032_xchvz7,G,IMPASSE DE LA REILLE,
218400323,00026,21840032300026,O,1983-12-21,01,2019,,2021-10-27T08:11:00,false,3,,,,,,84750,CASENEUVE,,,84032,,,,,,,,,,,,,,,,,,,2008-01-01,A,ECOLE PRIMAIRE PUBLIQUE,,,,85.20Z,NAFRev2,N,,,0,,,,,,
248400202,00029,24840020200029,O,2005-04-14,,,,2013-10-24T09:52:59,false,3,MAIRIE,,,RUE,DE LA MAIRIE,84750,CASENEUVE,,,84032,,,,,,,,,,,,,,,,,,,2014-01-01,F,BA ZONE ACTIVITE COMMERCIALE,,,,42.99Z,NAFRev2,N,5.484099,43.887306,0.63,street,Rue de la Mer 84750 Caseneuve,84032_0080,G,RUE DE LA MER,
248400202,00169,24840020200169,O,2013-07-08,,,,2013-10-24T09:53:00,false,2,,,,QUA,LABAUD,84750,CASENEUVE,,,84032,,,,,,,,,,,,,,,,,,,2014-01-01,F,CRECHE LES PTITCHOUNS DU LUBERON,,,,88.91A,NAFRev2,N,5.487201,43.884926,0.63,street,Labaud 84750 Caseneuve,84032_319xwa,G,LABAUD,
268401494,00011,26840149400011,O,1984-12-04,NN,,,2010-06-26T03:17:02,true,3,,,,,HOTEL DE VILLE,84750,CASENEUVE,,,84032,,,,,,,,,,,,,,,,,,,2008-01-01,A,CDE,,,,88.99B,NAFRev2,N,5.451406,43.888199,0.39,street,Impasse de la Reille 84750 Caseneuve,84032_xchvz7,G,IMPASSE DE LA REILLE,
268403144,00010,26840314400010,O,1985-02-18,NN,,,2010-06-26T03:17:05,true,3,,,,,HOTEL DE VILLE,84750,CASENEUVE,,,84032,,,,,,,,,,,,,,,,,,,2008-01-01,A,CCAS,,,,88.99B,NAFRev2,N,5.451406,43.888199,0.39,street,Impasse de la Reille 84750 Caseneuve,84032_xchvz7,G,IMPASSE DE LA REILLE,
302153440,00037,30215344000037,O,1995-02-01,NN,,,2008-11-07T00:18:15,true,3,RTE DE VIENS LES RAMADES,,,,QUARTIER LE RABLASSIN,84750,CASENEUVE,,,84032,,,,,,,,,,,,,,,,,,,2006-09-21,F,,,,,45.2V,NAFRev1,N,5.447711,43.880465,0.44,street,Impasse du Rablassin 84750 Caseneuve,84032_5ryeea,G,IMPASSE DU RABLASSIN,
302541404,00018,30254140400018,O,1900-01-01,NN,,,2006-12-15T00:15:18,false,4,,,,,LES ESTEVES LE COLOMBIER,84750,CASENEUVE,,,84032,,,,,,,,,,,,,,,,,,,1993-12-25,F,,,,,92.3A,NAF1993,N,5.464476,43.891416,0.58,street,Le Colombier 84750 Caseneuve,84032_jcgev5,G,LE COLOMBIER,
303052237,00011,30305223700011,O,,,,,,true,1,,,,LD,VIGNEAUX,84750,CASENEUVE,,,84032,,,,,,,,,,,,,,,,,,,1986-03-31,F,,,,,62.43,NAP,N,5.474804,43.885048,0.51,street,Chemin de la Grand’Vigne 84750 Caseneuve,84032_qyxf1v,G,CHEMIN DE LA GRAND VIGNE,
303625339,00021,30362533900021,O,1986-09-03,NN,,,2008-11-07T00:19:16,true,4,,,,,LE RABLASSIN,84750,CASENEUVE,,,84032,,,,,,,,,,,,,,,,,,,2003-05-19,F,,,,,45.2V,NAFRev1,N,5.447711,43.880465,0.72,street,Impasse du Rablassin 84750 Caseneuve,84032_5ryeea,G,IMPASSE DU RABLASSIN,
304462450,00012,30446245000012,O,,NN,,,2007-01-18T09:11:22,true,1,,,,,MOULIN DES RAMADES,84750,CASENEUVE,,,84032,,,,,,,,,,,,,,,,,,,1988-10-05,F,,,,,01.1A,NAF1993,N,5.455458,43.874959,0.66,street,Chemin des Ramades 84750 Caseneuve,84032_lbl8jf,G,CHEMIN DES RAMADES,
305685570,00015,30568557000015,O,,,,,2007-01-18T09:11:30,true,1,,,,,,84750,CASENEUVE,,,84032,,,,,,,,,,,,,,,,,,,1989-01-01,F,,,,,01.1C,NAF1993,N,,,0,,,,,,
311401210,00019,31140121000019,O,1977-01-01,NN,,,2008-01-04T20:07:27,true,4,,,,,CAMPAGNE ST JEAN,84750,CASENEUVE,,,84032,,,,,,,,,,,,,,,,,,,2008-01-01,A,,,,,01.11Z,NAFRev2,N,5.490734,43.887306,0.46,street,Chemin de Saint Jean 84750 Caseneuve,84032_rhosu3,G,CHEMIN DE SAINT JEAN,
311874291,00017,31187429100017,O,,,,,,true,1,,,,,LA BAUSSETTE,84750,CASENEUVE,,,84032,,,,,,,,,,,,,,,,,,,1984-12-25,F,,,,,55.60,NAP,N,5.479682,43.875472,0.31,street,Route du Boisset 84750 Caseneuve,84032_gprgiq,G,ROUTE DU BOISSET,
313084899,00019,31308489900019,O,1978-01-01,NN,,,,true,1,,,,LD,LES LAURONS,84750,CASENEUVE,,,84032,,,,,,,,,,,,,,,,,,,2002-01-01,F,,,,,01.2J,NAF1993,N,5.488563,43.882805,0.4,street,Allée des Lavandins 84750 Caseneuve,84032_vwz34f,G,ALLEE DES LAVANDINS,
315731653,00012,31573165300012,O,1979-01-01,NN,,,2008-11-07T00:31:12,true,3,,,,RTE,DE VIENS LD LA LEGUE,84750,CASENEUVE,,,84032,,,,,,,,,,,,,,,,,,,2004-06-30,F,,,,,45.3A,NAFRev1,N,5.477572,43.895129,0.42,street,La Legue 84750 Caseneuve,84032_rwc80e,G,LA LEGUE,
315813881,00010,31581388100010,O,1979-01-01,NN,,4322AZ,2018-03-14T03:51:18,true,6,,,,RUE,DE BOISSET,84750,CASENEUVE,,,84032,,,,,,,,,,,,,,,,,,,2017-12-31,F,,,,,43.21A,NAFRev2,N,5.471805,43.867392,0.59,street,Le Boisset 84750 Caseneuve,84032_t8lree,G,LE BOISSET,
316904218,00013,31690421800013,O,,NN,,,,true,1,,,,CHE,DE LA GALINE,84750,CASENEUVE,,,84032,,,,,,,,,,,,,,,,,,,1996-06-30,F,,,,,45.4J,NAF1993,N,5.484968,43.883759,0.84,street,Chemin de la Galine 84750 Caseneuve,84032_0060,G,CHEMIN DE LA GALINE,
317234300,00034,31723430000034,O,2009-04-17,,,,2010-12-07T10:32:28,false,2,,,,,LES BANQUETS,84750,CASENEUVE,,,84032,,,,,,,,,,,,,,,,,,,2010-09-08,F,,,,,86.90D,NAFRev2,N,5.483287,43.883836,0.79,street,Impasse des Banquets 84750 Caseneuve,84032_kd9g0k,G,IMPASSE DES BANQUETS,
318436581,00017,31843658100017,O,1980-01-01,NN,,,2008-01-04T21:00:29,true,3,,,,,VILLA DOMITIA,84750,CASENEUVE,,,84032,,,,,,,,,,,,,,,,,,,2008-01-01,A,,,,,93.12Z,NAFRev2,N,,,0,,,,,,
318734217,00017,31873421700017,O,1980-01-01,NN,,,2016-01-07T03:41:03,true,3,,,,,DOMAINE DE COURNEIREDE,84750,CASENEUVE,,,84032,,,,,,,,,,,,,,,,,,,2008-01-01,A,,,,,68.32A,NAFRev2,N,5.489243,43.900984,0.53,street,Chemin des Courneiredes 84750 Caseneuve,84032_fj8ubl,G,CHEMIN DES COURNEIREDES,
318734225,00010,31873422500010,O,1980-01-01,NN,,,2020-08-20T15:15:58,true,4,,,,,DOMAINE DE COURNEREIDE,84750,CASENEUVE,,,84032,,,,,,,,,,,,,,,,,,,2020-08-18,F,,,,,68.20A,NAFRev2,N,5.489243,43.900984,0.33,street,Chemin des Courneiredes 84750 Caseneuve,84032_fj8ubl,G,CHEMIN DES COURNEIREDES,
319061503,00011,31906150300011,O,1980-05-01,03,2019,,2021-12-09T16:31:20,true,3,,89,,RTE,DE SAINT-JEAN,84750,CASENEUVE,,,84032,,,,,,,,,,,,,,,,,,,2008-01-01,A,,,,,01.50Z,NAFRev2,N,5.487773,43.885388,0.73,housenumber,89 Chemin de Saint Jean 84750 Caseneuve,84032_rhosu3_00089,G,89 CHEMIN DE SAINT JEAN,
320163728,00050,32016372800050,O,2004-02-24,,,,2009-10-16T05:20:29,false,4,,,,QUAI,PIERRE FEU,84750,CASENEUVE,,,84032,,,,,,,,,,,,,,,,,,,2009-09-10,F,,,,,86.90D,NAFRev2,N,5.490619,43.886901,0.68,street,Pierre Feu 84750 Caseneuve,84032_B084,G,PIERRE FEU,
320524960,00012,32052496000012,O,2005-04-04,,,8122ZZ,2017-01-12T05:38:33,true,3,,,,,LE MAUCOURINS,84750,CASENEUVE,,,84032,,,,,,,,,,,,,,,,,,,2016-12-31,F,,,,,81.21Z,NAFRev2,N,5.494589,43.894828,0.67,street,Chemin de Maucourin 84750 Caseneuve,84032_ek8rkj,G,CHEMIN DE MAUCOURIN,
321772386,00058,32177238600058,O,2007-05-09,,,,2014-07-08T00:25:55,true,3,,,,,DES GRANGES,84750,CASENEUVE,,,84032,,,,,,,,,,,,,,,,,,,2009-08-31,F,,,,,43.99C,NAFRev2,N,5.483511,43.886332,0.92,street,Rue des Granges 84750 Caseneuve,84032_0063,G,RUE DES GRANGES,
322028499,00018,32202849900018,O,1981-07-06,NN,,3312ZA,2015-03-17T00:16:18,true,3,,,,,LE COLOMBIER,84750,CASENEUVE,,,84032,,,,,,,,,,,,,,,,,,,2008-01-01,A,,,,,33.12Z,NAFRev2,N,5.464476,43.891416,0.94,street,Le Colombier 84750 Caseneuve,84032_jcgev5,G,LE COLOMBIER,
324481142,00044,32448114200044,O,2002-11-02,NN,,,2008-11-07T00:41:26,true,3,LA GRANGE,,,,,84750,CASENEUVE,,,84032,,,,,,,,,,,,,,,,,,,2005-10-26,F,,,,,45.2V,NAFRev1,N,5.483511,43.886332,0.55,street,Rue des Granges 84750 Caseneuve,84032_0063,D,RUE DES GRANGES,
324886019,00029,32488601900029,O,2018-10-15,,,2561ZB,2021-02-23T10:47:38,true,1,RTE DE VIENS,,,,COULET DE SEL,84750,CASENEUVE,,,84032,,,,,,,,,,,,,,,,,,,2018-10-15,A,RAINBOW COLORS,,,RAINBOW COLORS,25.61Z,NAFRev2,N,5.448473,43.883682,0.94,locality,Coulet de Sel 84750 Caseneuve,84032_B033,G,COULET DE SEL,
325761245,00027,32576124500027,O,1983-01-19,NN,,,,true,3,,,,,LE VILLAGE,84750,CASENEUVE,,,84032,,,,,,,,,,,,,,,,,,,1992-03-31,F,,,,,36.1G,NAF1993,N,5.484922,43.886765,0.68,street,Place du Village 84750 Caseneuve,84032_0120,G,PLACE DU VILLAGE,
328569298,00032,32856929800032,O,2012-07-01,,,,2021-07-13T09:18:13,true,2,,,,,LES RAMADES,84750,CASENEUVE,,,84032,,,,,,,,,,,,,,,,,,,2020-12-31,F,,,,,96.09Z,NAFRev2,N,5.452417,43.875982,0.94,street,Les Ramades 84750 Caseneuve,84032_cfuk9u,G,LES RAMADES,
329836910,00011,32983691000011,O,1984-02-16,03,2019,,2021-10-27T08:27:30,true,4,,,,,MAIRIE,84750,CASENEUVE,,,84032,,,,,,,,,,,,,,,,,,,2008-01-01,A,,,,,88.10A,NAFRev2,O,5.482907,43.881299,0.38,street,Chemin de Saint Maime 84750 Caseneuve,84032_cf5ikt,G,CHEMIN DE SAINT MAIME,
334661527,00039,33466152700039,O,,NN,,,,true,1,,,,,,84750,CASENEUVE,,,84032,,,,,,,,,,,,,,,,,,,1989-11-15,F,,,,,86.07,NAP,N,,,0,,,,,,
337670970,00017,33767097000017,O,,NN,,,,true,1,,,,,SAINT FRANCOIS,84750,CASENEUVE,,,84032,,,,,,,,,,,,,,,,,,,1987-04-25,F,,,,,02.20,NAP,N,5.490734,43.887306,0.4,street,Chemin de Saint Jean 84750 Caseneuve,84032_rhosu3,G,CHEMIN DE SAINT JEAN,
338025075,00031,33802507500031,O,,NN,,,,true,1,,,,,AIRE EMBORE LA GARDE,84750,CASENEUVE,,,84032,,,,,,,,,,,,,,,,,,,1989-10-27,F,,,,,60.2L,NAF1993,N,4.7290831,44.4051042,0.76,poi.motorway_junction,Aire de Pierrelatte (Embranchement d'autoroute) La Garde-Adhémar,https://osm.org/node/227106989,G,,
340238302,00012,34023830200012,O,,,,,,true,1,,,,,MOULIN DES RAMADES,84750,CASENEUVE,,,84032,,,,,,,,,,,,,,,,,,,1988-10-05,F,,,,,55.2C,NAF1993,N,5.455458,43.874959,0.66,street,Chemin des Ramades 84750 Caseneuve,84032_lbl8jf,G,CHEMIN DES RAMADES,
340238484,00018,34023848400018,O,,NN,,,,true,1,,,,,MOULIN DES RAMADES,84750,CASENEUVE,,,84032,,,,,,,,,,,,,,,,,,,1988-10-05,F,,,,,67.13,NAP,N,5.455458,43.874959,0.66,street,Chemin des Ramades 84750 Caseneuve,84032_lbl8jf,G,CHEMIN DES RAMADES,
340238724,00017,34023872400017,O,1900-01-01,NN,,,2015-07-02T09:47:11,false,4,,,,,MOULIN DES RAMADES,84750,CASENEUVE,,,84032,,,,,,,,,,,,,,,,,,,1988-12-25,F,,,,,67.13,NAP,N,5.455458,43.874959,0.66,street,Chemin des Ramades 84750 Caseneuve,84032_lbl8jf,G,CHEMIN DES RAMADES,
342026044,00012,34202604400012,O,1987-03-31,NN,,,2008-01-04T21:58:49,true,3,,,,LD,MASSIERES,84750,CASENEUVE,,,84032,,,,,,,,,,,,,,,,,,,2008-01-01,A,,,,,68.20B,NAFRev2,N,5.507171,43.905427,0.64,street,Chemin de Massieyes 84750 Caseneuve,84032_ptkd2o,G,CHEMIN DE MASSIEYES,
344064159,00025,34406415900025,O,,NN,,,,true,1,,,,,LA GARDE,84750,CASENEUVE,,,84032,,,,,,,,,,,,,,,,,,,1993-07-01,F,,,,,60.2L,NAF1993,N,5.483995,43.887203,0.92,street,Rue de la Garde 84750 Caseneuve,84032_mcnzpv,G,RUE DE LA GARDE,
348978800,00012,34897880000012,O,1988-10-05,NN,,,,true,4,,,,,MOULIN DES RAMADES,84750,CASENEUVE,,,84032,,,,,,,,,,,,,,,,,,,1994-05-24,F,,,,,55.2C,NAF1993,N,5.455458,43.874959,0.66,street,Chemin des Ramades 84750 Caseneuve,84032_lbl8jf,G,CHEMIN DES RAMADES,
349104968,00020,34910496800020,O,1993-07-01,NN,,,,false,4,,,,RUE,DU CAVIE,84750,CASENEUVE,,,84032,,,,,,,,,,,,,,,,,,,1999-03-01,F,,,,,85.1C,NAF1993,N,5.484275,43.886565,0.65,street,Rue du Caire 84750 Caseneuve,84032_0030,G,RUE DU CAIRE,
349684795,00017,34968479500017,O,1989-01-15,NN,,,2008-01-04T23:07:31,true,3,,,,,LIEUDIT MASSIEIES,84750,CASENEUVE,,,84032,,,,,,,,,,,,,,,,,,,2008-01-01,A,,,,,68.20B,NAFRev2,N,5.507171,43.905427,0.64,street,Chemin de Massieyes 84750 Caseneuve,84032_ptkd2o,G,CHEMIN DE MASSIEYES,
350086526,00042,35008652600042,O,2004-10-01,NN,,,2008-11-08T00:25:27,false,3,QU LA BAUD,,,RTE,DE ST MARTIN,84750,CASENEUVE,,,84032,,,,,,,,,,,,,,,,,,,2007-12-13,F,,,,,45.3A,NAFRev1,N,5.486263,43.885485,0.72,street,Route de Saint Martin de Castillon 84750 Caseneuve,84032_q37evo,G,RTE DE SAINT MARTIN DE CASTILLON,
352452114,00015,35245211400015,O,1989-09-23,NN,,,2020-07-01T10:14:50,true,7,,,,QUAI,BEREGEAY,84750,CASENEUVE,,,84032,,,,,,,,,,,,,,,,,,,2020-06-30,F,,,,,68.32A,NAFRev2,N,,,0,,,,,,
353824063,00013,35382406300013,O,1990-01-01,12,2019,8121ZZ,2021-10-27T08:04:32,true,4,,,,,CAMPAGNE ST JEAN,84750,CASENEUVE,,,84032,,,,,,,,,,,,,,,,,,,2008-12-31,A,,,,,81.30Z,NAFRev2,O,5.490734,43.887306,0.46,street,Chemin de Saint Jean 84750 Caseneuve,84032_rhosu3,G,CHEMIN DE SAINT JEAN,
353824063,00021,35382406300021,O,1987-12-31,NN,,,2008-01-04T23:58:45,false,3,,,,,CAMP ST JEAN,84750,CASENEUVE,,,84032,,,,,,,,,,,,,,,,,,,2008-01-01,A,,,,,01.21Z,NAFRev2,N,5.490734,43.887306,0.52,street,Chemin de Saint Jean 84750 Caseneuve,84032_rhosu3,G,CHEMIN DE SAINT JEAN,
381085216,00012,38108521600012,O,1991-01-29,NN,,,2009-06-28T05:43:18,true,4,,,,,LE VILLAGE,84750,CASENEUVE,,,84032,,,,,,,,,,,,,,,,,,,2008-12-31,F,,,,,01.50Z,NAFRev2,N,5.484922,43.886765,0.68,street,Place du Village 84750 Caseneuve,84032_0120,G,PLACE DU VILLAGE,
381475102,00046,38147510200046,O,2009-05-01,,,,2016-03-09T08:27:02,false,2,,,,RUE,DU PORTAIL,84750,CASENEUVE,,,84032,,,,,,,,,,,,,,,,,,,2014-11-12,F,,,,,90.01Z,NAFRev2,N,5.483732,43.886603,0.94,street,Rue du Portail 84750 Caseneuve,84032_0100,G,RUE DU PORTAIL,
382884435,00043,38288443500043,O,2005-01-01,,,,2021-02-23T11:11:10,true,1,,,,,LES CLAUSSONS AUX JONQUETS,84750,CASENEUVE,,,84032,,,,,,,,,,,,,,,,,,,2005-01-01,A,,,,,90.03B,NAFRev2,N,5.45236,43.888148,0.38,street,Chemin des Jonquets 84750 Caseneuve,84032_j1jvgq,G,CHEMIN DES JONQUETS,
382894152,00018,38289415200018,O,1991-07-12,NN,,,,true,1,,,,,RESIDENCE SAINT FRANCOIS,84750,CASENEUVE,,,84032,,,,,,,,,,,,,,,,,,,2001-02-01,F,,,,,55.3A,NAF1993,O,5.490734,43.887306,0.3,street,Chemin de Saint Jean 84750 Caseneuve,84032_rhosu3,G,CHEMIN DE SAINT JEAN,
383086477,00031,38308647700031,O,2014-02-03,,,,2014-07-18T10:24:15,true,1,LES MORILLES,,,RTE,DE VIENS LES MORILLES,84750,CASENEUVE,,,84032,,,,,,,,,,,,,,,,,,,2014-02-03,A,,,,,86.90F,NAFRev2,N,5.475491,43.893625,0.48,street,Route de Viens 84750 Caseneuve,84032_0118,G,ROUTE DE VIENS,
384115606,00046,38411560600046,O,2004-11-01,NN,,,2006-11-25T11:44:42,false,3,,,,,LE VILLAGE CHEZ MME MANUEL,84750,CASENEUVE,,,84032,,,,,,,,,,,,,,,,,,,2005-12-31,F,,,,,26.2A,NAFRev1,N,,,0,,,,,,
384321733,00014,38432173300014,O,1992-02-03,NN,,,2006-11-25T11:45:20,true,1,,,,,,84750,CASENEUVE,,,84032,,,,,,,,,,,,,,,,,,,1995-05-20,F,,,,,74.1J,NAF1993,N,,,0,,,,,,
384477725,00020,38447772500020,O,2001-01-25,NN,,,2008-11-08T00:45:15,true,4,,,,,LE RABLASSIN,84750,CASENEUVE,,,84032,,,,,,,,,,,,,,,,,,,2003-03-21,F,,,,,26.2A,NAFRev1,N,5.447711,43.880465,0.72,street,Impasse du Rablassin 84750 Caseneuve,84032_5ryeea,G,IMPASSE DU RABLASSIN,
384626776,00015,38462677600015,O,1992-03-15,NN,,,,false,3,,,,,HAMEAU DES BASSES BLASSES,84750,CASENEUVE,,,84032,,,,,,,,,,,,,,,,,,,1994-09-15,F,,,,,74.8F,NAF1993,N,5.461807,43.893638,0.39,street,Impasse de Basse Blace 84750 Caseneuve,84032_yetw2u,G,IMPASSE DE BASSE BLACE,
384626776,00049,38462677600049,O,2003-10-14,NN,,8219ZP,2015-03-17T00:36:26,true,3,,,,,LES VIEILLES BLACES,84750,CASENEUVE,,,84032,,,,,,,,,,,,,,,,,,,2005-10-08,F,,,,,74.8F,NAFRev1,N,5.463243,43.894749,0.45,street,Route des Blaces 84750 Caseneuve,84032_o7561f,G,ROUTE DES BLACES,
385374111,00016,38537411100016,O,1975-01-01,NN,,,2007-08-09T10:47:20,true,3,,,,,LE BOISSET,84750,CASENEUVE,,,84032,,,,,,,,,,,,,,,,,,,2006-12-31,F,,,,,01.2C,NAFRev1,N,5.471805,43.867392,0.94,street,Le Boisset 84750 Caseneuve,84032_t8lree,G,LE BOISSET,
390572840,00028,39057284000028,O,2013-12-13,,,,2021-02-23T11:16:29,true,1,,,,RTE,LA RAVELLE,84750,CASENEUVE,,,84032,,,,,,,,,,,,,,,,,,,2013-12-13,A,,,,,43.99C,NAFRev2,N,5.451406,43.888199,0.45,street,Impasse de la Reille 84750 Caseneuve,84032_xchvz7,G,IMPASSE DE LA REILLE,
390662872,00014,39066287200014,O,1993-04-05,NN,,,2019-01-07T16:01:04,true,6,,,,,LIEU DIT LES BLACES,84750,CASENEUVE,,,84032,,,,,,,,,,,,,,,,,,,2018-12-31,F,,,,,01.49Z,NAFRev2,N,5.463243,43.894749,0.74,street,Route des Blaces 84750 Caseneuve,84032_o7561f,G,ROUTE DES BLACES,
391101086,00018,39110108600018,O,1991-12-16,NN,,,2010-01-08T05:02:40,true,5,,,,,LA GRANDE BASTIDE,84750,CASENEUVE,,,84032,,,,,,,,,,,,,,,,,,,2009-12-31,F,,,,,01.24Z,NAFRev2,N,5.474804,43.885048,0.5,street,Chemin de la Grand’Vigne 84750 Caseneuve,84032_qyxf1v,G,CHEMIN DE LA GRAND VIGNE,
391534617,00033,39153461700033,O,2012-05-16,,,,2021-02-23T11:17:23,true,1,,,,,QUARTIER LES RAMADES,84750,CASENEUVE,,,84032,,,,,,,,,,,,,,,,,,,2012-05-16,A,,,,,68.20B,NAFRev2,N,5.452417,43.875982,0.57,street,Les Ramades 84750 Caseneuve,84032_cfuk9u,G,LES RAMADES,
392334819,00019,39233481900019,O,1993-08-25,NN,,,2018-12-04T04:33:40,true,3,,,,,LE COULET DE PLUME,84750,CASENEUVE,,,84032,,,,,,,,,,,,,,,,,,,2008-01-01,A,,,,,68.20A,NAFRev2,N,5.448473,43.883682,0.52,locality,Coulet de Sel 84750 Caseneuve,84032_B033,G,COULET DE SEL,
393663836,00012,39366383600012,O,,NN,,,,true,1,,,,,,84750,CASENEUVE,,,84032,,,,,,,,,,,,,,,,,,,1997-12-31,F,,,,,36.1G,NAF1993,N,,,0,,,,,,
394473730,00015,39447373000015,O,,NN,,,,true,1,,,,PL,DE LA MAIRIE,84750,CASENEUVE,,,84032,,,,,,,,,,,,,,,,,,,1996-12-19,F,,,,,15.1A,NAF1993,N,5.45639,43.888527,0.43,street,Chemin de la Milane 84750 Caseneuve,84032_vierib,G,CHEMIN DE LA MILANE,
397958679,00011,39795867900011,O,1994-07-01,NN,,,2006-11-25T12:31:28,true,3,CHEZ M.RICHAUD RAVELLE,,,RTE,DE VIENS,84750,CASENEUVE,,,84032,,,,,,,,,,,,,,,,,,,2005-06-30,F,,,,,51.3A,NAFRev1,N,5.475491,43.893625,0.81,street,Route de Viens 84750 Caseneuve,84032_0118,G,ROUTE DE VIENS,
397958679,00029,39795867900029,O,1987-12-31,NN,,,2006-10-28T02:29:27,false,3,LA RAVELLE,,,RTE,DE VIENS,84750,CASENEUVE,,,84032,,,,,,,,,,,,,,,,,,,2004-11-30,F,,,,,01.1C,NAFRev1,N,5.475491,43.893625,0.81,street,Route de Viens 84750 Caseneuve,84032_0118,G,ROUTE DE VIENS,
399149152,00015,39914915200015,O,1995-01-09,NN,,,,true,1,,,,,LES VIGNEAUX,84750,CASENEUVE,,,84032,,,,,,,,,,,,,,,,,,,1998-06-08,F,,,,,22.2J,NAF1993,N,5.478112,43.883375,0.43,street,Les Micoulaux 84750 Caseneuve,84032_vtqlks,G,LES MICOULAUX,
399410810,00010,39941081000010,O,1995-01-01,NN,,,2008-04-26T13:01:06,true,3,CHEZ MME RICHAUD L.,,,,LA RAVELLE,84750,CASENEUVE,,,84032,,,,,,,,,,,,,,,,,,,2006-06-01,F,,,,,01.1C,NAFRev1,N,5.451406,43.888199,0.51,street,Impasse de la Reille 84750 Caseneuve,84032_xchvz7,G,IMPASSE DE LA REILLE,
401804794,00014,40180479400014,O,1994-07-01,NN,,,,false,3,,,,,LES JONQUETS,84750,CASENEUVE,,,84032,,,,,,,,,,,,,,,,,,,1996-01-01,F,,,,,92.3A,NAF1993,N,5.45236,43.888148,0.78,street,Chemin des Jonquets 84750 Caseneuve,84032_j1jvgq,G,CHEMIN DES JONQUETS,
402229215,00023,40222921500023,O,2016-07-01,,,,2021-02-23T11:26:21,true,1,,,,RUE,BASSE,84750,CASENEUVE,,,84032,,,,,,,,,,,,,,,,,,,2016-07-01,A,,,,,74.90B,NAFRev2,N,5.483816,43.88711,0.94,street,Rue Basse 84750 Caseneuve,84032_0016,G,RUE BASSE,
402901623,00015,40290162300015,O,1995-11-20,NN,,4322AZ,2015-03-17T00:45:49,true,3,,,,CHE,DES MARTEAUX ST JEAN,84750,CASENEUVE,,,84032,,,,,,,,,,,,,,,,,,,2008-01-01,A,,,,,43.22A,NAFRev2,N,5.492293,43.886555,0.58,locality,Chemin des Marteaux 84750 Caseneuve,84032_0077,G,CHEMIN DES MARTEAUX,
403796444,00012,40379644400012,O,1995-02-25,NN,,,2009-04-30T05:38:24,true,3,QUARTIER POURRAS,,,QUAI,POURRAS,84750,CASENEUVE,,,84032,,,,,,,,,,,,,,,,,,,2008-01-01,A,,,,,68.20B,NAFRev2,N,5.487491,43.904444,0.61,street,Pourras 84750 Caseneuve,84032_7ig1pf,G,POURRAS,
404672891,00045,40467289100045,O,2015-07-01,,,,2018-02-21T10:42:33,false,1,LES LAURONS,,,,,84750,CASENEUVE,,,84032,,,,,,,,,,,,,,,,,,,2015-07-01,F,ECURIE - PONEY CLUB DES LAURONS,,,,93.29Z,NAFRev2,N,5.488563,43.882805,0.4,street,Allée des Lavandins 84750 Caseneuve,84032_vwz34f,D,ALLEE DES LAVANDINS,
404741241,00024,40474124100024,O,2010-07-01,,,,2019-11-15T04:07:30,true,2,,,,,LE COULET DES PLUMES,84750,CASENEUVE,,,84032,,,,,,,,,,,,,,,,,,,2019-09-19,F,,,,,01.28Z,NAFRev2,N,5.448473,43.883682,0.46,locality,Coulet de Sel 84750 Caseneuve,84032_B033,G,COULET DE SEL,
408081701,00018,40808170100018,O,1996-06-01,NN,,,2008-05-27T11:08:04,true,3,,,,,LA GRANGE,84750,CASENEUVE,,,84032,,,,,,,,,,,,,,,,,,,2008-01-01,A,,,,,68.20A,NAFRev2,N,5.483511,43.886332,0.55,street,Rue des Granges 84750 Caseneuve,84032_0063,G,RUE DES GRANGES,
409470333,00017,40947033300017,O,1996-09-01,NN,,,2008-01-04T21:27:26,true,3,,,,,MAIRIE,84750,CASENEUVE,,,84032,,,,,,,,,,,,,,,,,,,2008-01-01,A,,,,,88.10A,NAFRev2,N,5.482907,43.881299,0.38,street,Chemin de Saint Maime 84750 Caseneuve,84032_cf5ikt,G,CHEMIN DE SAINT MAIME,
410738090,00019,41073809000019,O,1997-01-01,NN,,2370ZZ,2019-06-24T13:29:07,true,4,CASENEUVE,,,,LES MAUX COURINS,84750,CASENEUVE,,,84032,,,,,,,,,,,,,,,,,,,2017-12-31,F,,,,,23.70Z,NAFRev2,O,,,0,,,,,,
412498156,00014,41249815600014,O,,NN,,,,true,1,,,,,LA GRANDE BASTIDE,84750,CASENEUVE,,,84032,,,,,,,,,,,,,,,,,,,1987-12-31,F,,,,,01.1F,NAF1993,N,5.474804,43.885048,0.5,street,Chemin de la Grand’Vigne 84750 Caseneuve,84032_qyxf1v,G,CHEMIN DE LA GRAND VIGNE,
412498727,00012,41249872700012,O,1987-12-31,NN,,,2013-01-14T10:43:03,true,3,,,,,LE BOISSET,84750,CASENEUVE,,,84032,,,,,,,,,,,,,,,,,,,2008-01-01,A,,,,,01.24Z,NAFRev2,N,5.471805,43.867392,0.94,street,Le Boisset 84750 Caseneuve,84032_t8lree,G,LE BOISSET,
412502296,00012,41250229600012,O,1987-12-31,NN,,,,true,4,,,,,,84750,CASENEUVE,,,84032,,,,,,,,,,,,,,,,,,,1998-10-31,F,,,,,01.1G,NAF1993,N,,,0,,,,,,
413710914,00016,41371091400016,O,1989-04-01,NN,,,2008-10-16T05:55:50,true,4,,,,,LA GRANDE BASTIDE,84750,CASENEUVE,,,84032,,,,,,,,,,,,,,,,,,,2008-01-01,F,,,,,01.11Z,NAFRev2,N,5.474804,43.885048,0.5,street,Chemin de la Grand’Vigne 84750 Caseneuve,84032_qyxf1v,G,CHEMIN DE LA GRAND VIGNE,
413711334,00016,41371133400016,O,1988-10-01,NN,,,2008-01-04T22:37:24,true,3,,,,,LE VILLAGE,84750,CASENEUVE,,,84032,,,,,,,,,,,,,,,,,,,2008-01-01,A,,,,,01.24Z,NAFRev2,N,5.484922,43.886765,0.68,street,Place du Village 84750 Caseneuve,84032_0120,G,PLACE DU VILLAGE,
413711896,00014,41371189600014,O,1988-04-01,NN,,,2008-01-04T22:37:24,true,3,,,,,LA GRANGE,84750,CASENEUVE,,,84032,,,,,,,,,,,,,,,,,,,2008-01-01,A,,,,,01.11Z,NAFRev2,N,5.483511,43.886332,0.55,street,Rue des Granges 84750 Caseneuve,84032_0063,G,RUE DES GRANGES,
413712001,00010,41371200100010,O,1989-12-31,NN,,,,true,4,,,,,LES LOUVRONS,84750,CASENEUVE,,,84032,,,,,,,,,,,,,,,,,,,2000-12-31,F,,,,,01.2C,NAF1993,N,,,0,,,,,,
413713496,00011,41371349600011,O,1995-01-01,NN,,,2008-07-27T05:53:56,true,4,,,,,LE COLOMBIER,84750,CASENEUVE,,,84032,,,,,,,,,,,,,,,,,,,2008-06-30,F,,,,,01.24Z,NAFRev2,N,5.464476,43.891416,0.94,street,Le Colombier 84750 Caseneuve,84032_jcgev5,G,LE COLOMBIER,
414572479,00015,41457247900015,O,,,,,,true,1,,,,,CAMP ST JEAN,84750,CASENEUVE,,,84032,,,,,,,,,,,,,,,,,,,1997-12-31,F,,,,,01.1A,NAF1993,N,5.490734,43.887306,0.52,street,Chemin de Saint Jean 84750 Caseneuve,84032_rhosu3,G,CHEMIN DE SAINT JEAN,