siren,nic,siret,statutDiffusionEtablissement,dateCreationEtablissement,trancheEffectifsEtablissement,anneeEffectifsEtablissement,activitePrincipaleRegistreMetiersEtablissement,dateDernierTraitementEtablissement,etablissementSiege,nombrePeriodesEtablissement,complementAdresseEtablissement,numeroVoieEtablissement,indiceRepetitionEtablissement,typeVoieEtablissement,libelleVoieEtablissement,codePostalEtablissement,libelleCommuneEtablissement,libelleCommuneEtrangerEtablissement,distributionSpecialeEtablissement,codeCommuneEtablissement,codeCedexEtablissement,libelleCedexEtablissement,codePaysEtrangerEtablissement,libellePaysEtrangerEtablissement,complementAdresse2Etablissement,numeroVoie2Etablissement,indiceRepetition2Etablissement,typeVoie2Etablissement,libelleVoie2Etablissement,codePostal2Etablissement,libelleCommune2Etablissement,libelleCommuneEtranger2Etablissement,distributionSpeciale2Etablissement,codeCommune2Etablissement,codeCedex2Etablissement,libelleCedex2Etablissement,codePaysEtranger2Etablissement,libellePaysEtranger2Etablissement,dateDebut,etatAdministratifEtablissement,enseigne1Etablissement,enseigne2Etablissement,enseigne3Etablissement,denominationUsuelleEtablissement,activitePrincipaleEtablissement,nomenclatureActivitePrincipaleEtablissement,caractereEmployeurEtablissement,longitude,latitude,geo_score,geo_type,geo_adresse,geo_id,geo_ligne,geo_l4,geo_l5
210800595,00014,21080059500014,O,1983-03-01,01,2019,,2021-10-27T08:06:35,true,3,,,,,,08370,BIEVRES,,,08065,,,,,,,,,,,,,,,,,,,2008-01-01,A,MAIRIE,,,,84.11Z,NAFRev2,N,,,0,,,,,,
210800595,00022,21080059500022,O,1996-05-01,NN,,,2018-08-27T16:00:12,false,4,,,,,,08370,BIEVRES,,,08065,,,,,,,,,,,,,,,,,,,2016-12-31,F,SERVICE DES EAUX,,,,36.00Z,NAFRev2,N,,,0,,,,,,
260800560,00013,26080056000013,O,1983-03-01,NN,,,2017-08-06T14:07:01,true,4,,,,,,08370,BIEVRES,,,08065,,,,,,,,,,,,,,,,,,,2017-08-01,F,CCAS,,,,88.99B,NAFRev2,N,,,0,,,,,,
270800121,00013,27080012100013,O,,,,,,true,1,,,,,,08370,BIEVRES,,,08065,,,,,,,,,,,,,,,,,,,1995-12-25,F,,,,,41.0Z,NAF1993,N,,,0,,,,,,
290802685,00013,29080268500013,O,1989-06-07,NN,,,2008-01-04T19:05:50,true,3,,,,,MAIRIE,08370,BIEVRES,,,08065,,,,,,,,,,,,,,,,,,,2008-01-01,A,,,,,42.99Z,NAFRev2,N,5.264843,49.556111,0.9,street,Rue de la Mairie 08370 Bièvres,08065_0059,G,RUE DE LA MAIRIE,
319356341,00010,31935634100010,O,1980-06-01,NN,,,,true,1,,,,RUE,GUILLE,08370,BIEVRES,,,08065,,,,,,,,,,,,,,,,,,,2002-06-30,F,,,,,55.3A,NAF1993,O,5.262778,49.555882,0.84,street,Rue la Guille 08370 Bièvres,08065_0080,G,RUE LA GUILLE,
329050165,00011,32905016500011,O,1984-01-01,NN,,,2012-07-28T10:13:17,true,4,,,,,,08370,BIEVRES,,,08065,,,,,,,,,,,,,,,,,,,2008-12-25,F,,,,,01.42Z,NAFRev2,N,,,0,,,,,,
340076074,00012,34007607400012,O,1987-01-01,NN,,,2011-02-15T05:34:09,true,4,,,,,FERME DU BESSUS,08370,BIEVRES,,,08065,,,,,,,,,,,,,,,,,,,2008-02-14,F,,,,,01.41Z,NAFRev2,N,,,0,,,,,,
352638340,00021,35263834000021,O,1992-01-01,NN,,,2014-06-26T15:47:48,true,6,,6,,RUE,DU PAQUIS,08370,BIEVRES,,,08065,,,,,,,,,,,,,,,,,,,2014-05-26,A,,,,,64.20Z,NAFRev2,N,5.26596,49.556934,0.93,housenumber,6 Rue du Paquis 08370 Bièvres,08065_0100_00006,G,6 RUE DU PAQUIS,
380776807,00014,38077680700014,O,1991-01-01,NN,,,2019-05-09T14:14:58,true,5,,8,,RUE,DE PARIS,08370,BIEVRES,,,08065,,,,,,,,,,,,,,,,,,,2018-11-22,A,,,,,01.50Z,NAFRev2,N,5.265149,49.555345,0.93,housenumber,8 Rue de Paris 08370 Bièvres,08065_0120_00008,G,8 RUE DE PARIS,
380776872,00018,38077687200018,O,1991-01-01,NN,,,2021-10-27T08:46:29,true,3,,,,,,08370,BIEVRES,,,08065,,,,,,,,,,,,,,,,,,,1996-12-25,F,,,,,01.1A,NAF1993,N,,,0,,,,,,
384682027,00014,38468202700014,O,1992-02-01,NN,,,2008-01-04T22:42:16,true,3,,,,,MR MME BERNARD VIGNOL,08370,BIEVRES,,,08065,,,,,,,,,,,,,,,,,,,2008-01-01,A,,,,,01.42Z,NAFRev2,N,,,0,,,,,,
388740839,00013,38874083900013,O,1991-01-01,NN,,,2006-10-28T01:24:10,true,3,,,,,,08370,BIEVRES,,,08065,,,,,,,,,,,,,,,,,,,2006-10-31,F,,,,,01.2A,NAFRev1,N,,,0,,,,,,
389427535,00015,38942753500015,O,,NN,,,,true,1,,,,,,08370,BIEVRES,,,08065,,,,,,,,,,,,,,,,,,,1993-03-31,F,,,,,01.2A,NAF1993,N,,,0,,,,,,
389462953,00016,38946295300016,O,1979-01-01,NN,,,2007-01-18T09:31:41,true,3,,,,,,08370,BIEVRES,,,08065,,,,,,,,,,,,,,,,,,,1999-12-25,F,,,,,01.3Z,NAF1993,N,,,0,,,,,,
390977346,00019,39097734600019,O,1992-01-01,NN,,,2009-01-16T11:22:23,true,5,,7,,RUE,PRINCIPALE,08370,BIEVRES,,,08065,,,,,,,,,,,,,,,,,,,2009-01-01,A,,,,,01.41Z,NAFRev2,N,5.265751,49.556052,0.93,housenumber,7 Rue Principale 08370 Bièvres,08065_0103_00007,G,7 RUE PRINCIPALE,
390977569,00016,39097756900016,O,1992-01-01,NN,,,2016-12-14T13:39:54,false,4,,,,,,08370,BIEVRES,,,08065,,,,,,,,,,,,,,,,,,,2008-01-01,F,,,,,01.42Z,NAFRev2,N,,,0,,,,,,
390977569,00024,39097756900024,O,1996-01-01,,,,2016-12-23T11:33:44,true,1,,4,,,LE PAQUIS,08370,BIEVRES,,,08065,,,,,,,,,,,,,,,,,,,1996-01-01,A,,,,,01.45Z,NAFRev2,N,5.267212,49.556706,0.93,housenumber,4 Le Paquis 08370 Bièvres,08065_eom5ux_00004,G,4 LE PAQUIS,
409441078,00014,40944107800014,O,1996-10-22,NN,,,2008-01-04T21:26:59,true,3,,,,,,08370,BIEVRES,,,08065,,,,,,,,,,,,,,,,,,,2008-01-01,A,,,,,01.42Z,NAFRev2,N,,,0,,,,,,
411417934,00014,41141793400014,O,1981-01-01,NN,,,,true,1,,,,,,08370,BIEVRES,,,08065,,,,,,,,,,,,,,,,,,,1998-12-31,F,,,,,01.1A,NAF1993,N,,,0,,,,,,
412756900,00012,41275690000012,O,1981-01-01,NN,,,2008-03-05T04:28:21,true,5,,,,,,08370,BIEVRES,,,08065,,,,,,,,,,,,,,,,,,,2008-02-29,F,,,,,01.41Z,NAFRev2,N,,,0,,,,,,
427979554,00016,42797955400016,O,1991-01-01,NN,,,2008-01-05T01:21:03,true,3,,,,,,08370,BIEVRES,,,08065,,,,,,,,,,,,,,,,,,,2008-01-01,A,,,,,01.50Z,NAFRev2,N,,,0,,,,,,
448463695,00016,44846369500016,O,2003-03-25,NN,,,2009-06-27T10:52:06,true,3,,,,RUE,DE GLORIETTE,08370,BIEVRES,,,08065,,,,,,,,,,,,,,,,,,,2008-01-01,A,,,,,01.42Z,NAFRev2,N,5.267455,49.555237,0.93,street,Rue de Gloriette 08370 Bièvres,08065_0060,G,RUE DE GLORIETTE,
453892960,00015,45389296000015,O,2004-07-01,NN,,,2010-05-11T10:37:44,false,3,,,,RUE,GUILLE,08370,BIEVRES,,,08065,,,,,,,,,,,,,,,,,,,2005-06-29,F,,,,,55.1A,NAFRev1,O,5.262778,49.555882,0.84,street,Rue la Guille 08370 Bièvres,08065_0080,G,RUE LA GUILLE,
501616106,00016,50161610600016,O,2007-12-29,,,,2011-02-15T05:34:08,true,3,FERME DU BESSUS,,,,,08370,BIEVRES,,,08065,,,,,,,,,,,,,,,,,,,2008-02-14,F,,,,,01.50Z,NAFRev2,N,,,0,,,,,,
503542318,00012,50354231800012,O,2008-02-15,,,,2022-02-17T19:35:00,true,1,FERME DU BESSUS,,,,,08370,BIEVRES,,,08065,,,,,,,,,,,,,,,,,,,2008-02-15,A,,,,,01.41Z,NAFRev2,N,,,0,,,,,,
509738159,00011,50973815900011,O,2009-04-01,,,,2009-09-01T11:05:37,true,1,,7,,RUE,PRINCIPALE,08370,BIEVRES,,,08065,,,,,,,,,,,,,,,,,,,2009-04-01,A,,,,,01.41Z,NAFRev2,N,5.265751,49.556052,0.93,housenumber,7 Rue Principale 08370 Bièvres,08065_0103_00007,G,7 RUE PRINCIPALE,
685971459,00019,68597145900019,O,,NN,,,,true,1,,,,,,08370,BIEVRES,,,08065,,,,,,,,,,,,,,,,,,,,F,,,,,67.07,NAP,N,,,0,,,,,,
686870320,00013,68687032000013,O,1959-01-01,NN,,,,true,1,,,,,,08370,BIEVRES,,,08065,,,,,,,,,,,,,,,,,,,2001-10-10,F,,,,,70.2C,NAF1993,N,,,0,,,,,,
775612781,00044,77561278100044,O,1980-09-12,,,,,false,3,,,,HAM,SAINT WALFROY,08370,BIEVRES,,,08065,,,,,,,,,,,,,,,,,,,1999-04-27,F,,,,,91.3E,NAF1993,N,5.275858,49.569333,0.93,street,Saint-Walfroy 08370 Bièvres,08065_B087,G,SAINT WALFROY,
780241923,00017,78024192300017,O,,NN,,,,true,1,,,,,ERM ST WALFROY,08370,BIEVRES,,,08065,,,,,,,,,,,,,,,,,,,1990-02-14,F,,,,,64.49,NAP,N,5.275858,49.569333,0.55,street,Saint-Walfroy 08370 Bièvres,08065_B087,G,SAINT WALFROY,
823170808,00013,82317080800013,O,2016-10-11,,,4312AZ,2021-02-23T17:43:15,true,1,,3,,RUE,DES CAPUCINS,08370,BIEVRES,,,08065,,,,,,,,,,,,,,,,,,,2016-10-11,A,,,,CLEMENT ASSAINISSEMENT,43.12A,NAFRev2,N,5.263651,49.556894,0.93,housenumber,3 Rue des Capucins 08370 Bièvres,08065_0040_00003,G,3 RUE DES CAPUCINS,
904568797,00016,90456879700016,O,2021-10-11,,,,2022-02-07T12:41:22,true,1,,13,,RUE,DU PAQUIS,08370,BIEVRES,,,08065,,,,,,,,,,,,,,,,,,,2021-10-11,A,,,,,01.29Z,NAFRev2,N,5.26655,49.55721,0.93,housenumber,13 Rue du Paquis 08370 Bièvres,08065_0100_00013,G,13 RUE DU PAQUIS,
