siren,nic,siret,statutDiffusionEtablissement,dateCreationEtablissement,trancheEffectifsEtablissement,anneeEffectifsEtablissement,activitePrincipaleRegistreMetiersEtablissement,dateDernierTraitementEtablissement,etablissementSiege,nombrePeriodesEtablissement,complementAdresseEtablissement,numeroVoieEtablissement,indiceRepetitionEtablissement,typeVoieEtablissement,libelleVoieEtablissement,codePostalEtablissement,libelleCommuneEtablissement,libelleCommuneEtrangerEtablissement,distributionSpecialeEtablissement,codeCommuneEtablissement,codeCedexEtablissement,libelleCedexEtablissement,codePaysEtrangerEtablissement,libellePaysEtrangerEtablissement,complementAdresse2Etablissement,numeroVoie2Etablissement,indiceRepetition2Etablissement,typeVoie2Etablissement,libelleVoie2Etablissement,codePostal2Etablissement,libelleCommune2Etablissement,libelleCommuneEtranger2Etablissement,distributionSpeciale2Etablissement,codeCommune2Etablissement,codeCedex2Etablissement,libelleCedex2Etablissement,codePaysEtranger2Etablissement,libellePaysEtranger2Etablissement,dateDebut,etatAdministratifEtablissement,enseigne1Etablissement,enseigne2Etablissement,enseigne3Etablissement,denominationUsuelleEtablissement,activitePrincipaleEtablissement,nomenclatureActivitePrincipaleEtablissement,caractereEmployeurEtablissement,longitude,latitude,geo_score,geo_type,geo_adresse,geo_id,geo_ligne,geo_l4,geo_l5
211000567,00019,21100056700019,O,1983-03-01,02,2019,,2021-10-27T08:06:40,true,3,,8,,RUE,DU TREMBLET,10220,BREVONNES,,,10061,,,,,,,,,,,,,,,,,,,2008-01-01,A,MAIRIE,,,,84.11Z,NAFRev2,O,4.410945,48.362731,0.95,housenumber,8 Rue du Tremblet 10220 Brévonnes,10061_0050_00008,G,8 RUE DU TREMBLET,
211000567,00027,21100056700027,O,1983-03-16,NN,,,2008-01-04T18:25:16,false,3,,,,,,10220,BREVONNES,,,10061,,,,,,,,,,,,,,,,,,,2008-01-01,A,SAPEURS POMPIERS,,,,84.25Z,NAFRev2,N,,,0,,,,,,
211000567,00035,21100056700035,O,1983-12-21,NN,,,2014-06-13T23:25:02,false,3,,8,,RUE,DU TREMBLET,10220,BREVONNES,,,10061,,,,,,,,,,,,,,,,,,,2008-01-01,A,ECOLE PRIMAIRE PUBLIQUE,,,,85.20Z,NAFRev2,N,4.410945,48.362731,0.95,housenumber,8 Rue du Tremblet 10220 Brévonnes,10061_0050_00008,G,8 RUE DU TREMBLET,
211000567,00043,21100056700043,O,1983-12-21,02,2019,,2021-10-27T08:06:40,false,3,,6,,RUE,DU TREMBLET,10220,BREVONNES,,,10061,,,,,,,,,,,,,,,,,,,2008-01-01,A,ECOLE MATERNELLE PUBLIQUE,,,,85.10Z,NAFRev2,N,4.399756,48.359969,0.95,housenumber,6 Rue du Tremblet 10220 Brévonnes,10061_0050_00006,G,6 RUE DU TREMBLET,
211000567,00050,21100056700050,O,1996-05-01,NN,,,2008-01-04T18:25:16,false,3,MAIRIE,8,,RUE,DU TREMBLET,10220,BREVONNES,,,10061,,,,,,,,,,,,,,,,,,,2008-01-01,A,SERVICE D'ASSAINISSEMENT,,,,37.00Z,NAFRev2,N,4.410945,48.362731,0.95,housenumber,8 Rue du Tremblet 10220 Brévonnes,10061_0050_00008,G,8 RUE DU TREMBLET,
261000590,00016,26100059000016,O,1983-03-01,NN,,,2017-08-06T14:07:49,true,4,MAIRIE,8,,RUE,DU TREMBLET,10220,BREVONNES,,,10061,,,,,,,,,,,,,,,,,,,2017-08-01,F,CCAS,,,,88.99B,NAFRev2,N,4.410945,48.362731,0.95,housenumber,8 Rue du Tremblet 10220 Brévonnes,10061_0050_00008,G,8 RUE DU TREMBLET,
261004782,00015,26100478200015,O,1983-03-01,NN,,,2010-06-26T03:04:18,true,3,MAIRIE,8,,RUE,DU TREMBLET,10220,BREVONNES,,,10061,,,,,,,,,,,,,,,,,,,2008-01-01,A,CDE,,,,88.99B,NAFRev2,N,4.410945,48.362731,0.95,housenumber,8 Rue du Tremblet 10220 Brévonnes,10061_0050_00008,G,8 RUE DU TREMBLET,
271001034,00013,27100103400013,O,,,,,,true,1,,,,,,10220,BREVONNES,,,10061,,,,,,,,,,,,,,,,,,,1995-12-25,F,,,,,90.0A,NAF1993,N,,,0,,,,,,
291002079,00015,29100207900015,O,1985-01-10,NN,,,2018-09-29T12:08:55,true,3,MAIRIE,8,,RUE,DU TREMBLET,10220,BREVONNES,,,10061,,,,,,,,,,,,,,,,,,,2008-01-01,A,,,,,42.99Z,NAFRev2,N,4.410945,48.362731,0.95,housenumber,8 Rue du Tremblet 10220 Brévonnes,10061_0050_00008,G,8 RUE DU TREMBLET,
301237947,00025,30123794700025,O,1995-11-02,NN,,,2011-04-28T00:10:51,false,4,,21,,RUE,DE LA GARE,10220,BREVONNES,,,10061,,,,,,,,,,,,,,,,,,,1999-07-23,F,,,,,28.1C,NAF1993,O,4.405324,48.360022,0.95,housenumber,21 Rue de la Gare 10220 Brévonnes,10061_0022_00021,G,21 RUE DE LA GARE,
301621892,00027,30162189200027,O,2001-04-17,12,2019,,2021-10-27T08:14:05,false,5,,,,LD,LE COQ GRILLOT,10220,BREVONNES,,,10061,,,,,,,,,,,,,,,,,,,2011-02-08,A,,,,,46.90Z,NAFRev2,O,,,0,,,,,,
302756085,00015,30275608500015,O,,,,,,true,1,,,,,,10220,BREVONNES,,,10061,,,,,,,,,,,,,,,,,,,,F,,,,,97.23,NAP,N,,,0,,,,,,
303577159,00013,30357715900013,O,,NN,,,,true,1,,,,,,10220,BREVONNES,,,10061,,,,,,,,,,,,,,,,,,,1991-10-31,F,,,,,48.01,NAP,N,,,0,,,,,,
304693633,00014,30469363300014,O,1900-01-01,,,,,true,2,,,,RTE,DE DIENVILLE,10220,BREVONNES,,,10061,,,,,,,,,,,,,,,,,,,1993-12-25,F,,,,,02.0B,NAF1993,N,4.40338,48.357215,0.78,street,Rue de Dienville 10220 Brévonnes,10061_0085,G,RUE DE DIENVILLE,
309991941,00019,30999194100019,O,1977-01-01,NN,,1013AZ,2015-03-17T00:12:19,true,4,,,,RUE,DU BOIS,10220,BREVONNES,,,10061,,,,,,,,,,,,,,,,,,,2009-09-15,F,,,,,56.30Z,NAFRev2,N,4.399088,48.354409,0.95,street,Rue du Bois 10220 Brévonnes,10061_0070,G,RUE DU BOIS,
310544952,00032,31054495200032,O,1990-04-01,NN,,,2014-07-08T00:15:08,true,4,,,,RTE,DE BLAINCOURT,10220,BREVONNES,,,10061,,,,,,,,,,,,,,,,,,,2013-06-30,F,,,,,43.34Z,NAFRev2,N,,,0,,,,,,
313741274,00010,31374127400010,O,1900-01-01,,,,,true,3,,,,,,10220,BREVONNES,,,10061,,,,,,,,,,,,,,,,,,,1992-12-25,F,,,,,01.2A,NAF1993,N,,,0,,,,,,
313782781,00030,31378278100030,O,1994-09-01,NN,,,,false,4,,5,,RUE,DE LA GARE,10220,BREVONNES,,,10061,,,,,,,,,,,,,,,,,,,1997-09-30,F,AUBERGE SAINT HUBERT,,,,55.3A,NAF1993,O,4.401463,48.359219,0.95,housenumber,5 Rue de la Gare 10220 Brévonnes,10061_0022_00005,G,5 RUE DE LA GARE,
314227927,00014,31422792700014,O,1976-01-01,NN,,,2010-04-18T03:42:11,true,5,,,,RUE,DE PINEY,10220,BREVONNES,,,10061,,,,,,,,,,,,,,,,,,,2008-04-09,F,,,,,55.10Z,NAFRev2,O,4.394644,48.357473,0.95,street,Rue de Piney 10220 Brévonnes,10061_0140,G,RUE DE PINEY,
314733601,00012,31473360100012,O,,NN,,,,true,1,,,,RUE,DE CHAMPAGNE,10220,BREVONNES,,,10061,,,,,,,,,,,,,,,,,,,1996-05-15,F,,,,,52.2C,NAF1993,N,4.39828,48.361482,0.95,street,Rue de Champagne 10220 Brévonnes,10061_0004,G,RUE DE CHAMPAGNE,
314991670,00014,31499167000014,O,1979-01-01,NN,,,2008-11-07T00:30:23,true,4,,14,,RUE,DU BOIS,10220,BREVONNES,,,10061,,,,,,,,,,,,,,,,,,,2008-05-31,F,,,,,10.11Z,NAFRev2,N,4.399199,48.356409,0.95,housenumber,14 Rue du Bois 10220 Brévonnes,10061_0070_00014,G,14 RUE DU BOIS,
316214741,00068,31621474100068,O,2012-03-15,,,,2012-11-09T00:17:20,true,2,,20,,RUE,DE L'AUZON,10220,BREVONNES,,,10061,,,,,,,,,,,,,,,,,,,2012-04-05,F,,,,,43.39Z,NAFRev2,N,4.402222,48.357804,0.95,housenumber,20 Rue de l’Auzon 10220 Brévonnes,10061_0026_00020,G,20 RUE DE L AUZON,
316490663,00010,31649066300010,O,,NN,,,,true,1,,,,RUE,DE PINEY,10220,BREVONNES,,,10061,,,,,,,,,,,,,,,,,,,,F,,,,,78.02,NAP,N,4.394644,48.357473,0.95,street,Rue de Piney 10220 Brévonnes,10061_0140,G,RUE DE PINEY,
316769512,00013,31676951200013,O,1979-01-01,NN,,,2016-01-12T00:11:04,true,3,,,,RUE,DU BOIS,10220,BREVONNES,,,10061,,,,,,,,,,,,,,,,,,,2008-01-01,A,,,,,01.43Z,NAFRev2,N,4.399088,48.354409,0.95,street,Rue du Bois 10220 Brévonnes,10061_0070,G,RUE DU BOIS,
316825793,00011,31682579300011,O,1979-01-01,NN,,,2008-01-04T20:48:44,true,4,,,,,MAIRIE,10220,BREVONNES,,,10061,,,,,,,,,,,,,,,,,,,2008-01-01,A,,,,,94.99Z,NAFRev2,N,4.405525,48.360793,0.39,street,Rue de la Scierie 10220 Brévonnes,10061_0045,G,RUE DE LA SCIERIE,
319033452,00016,31903345200016,O,,,,,,true,1,,,,,,10220,BREVONNES,,,10061,,,,,,,,,,,,,,,,,,,1985-12-25,F,,,,,55.73,NAP,N,,,0,,,,,,
319033460,00019,31903346000019,O,1980-05-01,NN,,,2014-07-08T00:22:51,true,5,,,,RTE,DU BOIS,10220,BREVONNES,,,10061,,,,,,,,,,,,,,,,,,,2009-06-30,F,,,,,43.99C,NAFRev2,O,4.399088,48.354409,0.72,street,Rue du Bois 10220 Brévonnes,10061_0070,G,RUE DU BOIS,
319440103,00012,31944010300012,O,1980-06-06,01,2019,,2021-10-27T08:21:13,true,5,,,,,FERME DE LA LOGE LIONNE,10220,BREVONNES,,,10061,,,,,,,,,,,,,,,,,,,2012-12-31,A,,,,,01.11Z,NAFRev2,O,4.383745,48.347648,0.84,street,Ferme la Loge Lionne 10220 Brévonnes,10061_p3gajy,G,FERME LA LOGE LIONNE,
322649500,00012,32264950000012,O,,NN,,,,true,1,,,,RUE,DE CHAMPAGNE,10220,BREVONNES,,,10061,,,,,,,,,,,,,,,,,,,,F,,,,,48.01,NAP,N,4.39828,48.361482,0.95,street,Rue de Champagne 10220 Brévonnes,10061_0004,G,RUE DE CHAMPAGNE,
323236158,00016,32323615800016,O,1981-10-01,,,4321AB,2015-03-18T01:00:44,true,6,,,,,,10220,BREVONNES,,,10061,,,,,,,,,,,,,,,,,,,2014-03-31,F,,,,,43.21A,NAFRev2,N,,,0,,,,,,
324633395,00029,32463339500029,O,,NN,,,,true,1,,,,RUE,DE CHAMPAGNE,10220,BREVONNES,,,10061,,,,,,,,,,,,,,,,,,,,F,,,,,86.08,NAP,N,4.39828,48.361482,0.95,street,Rue de Champagne 10220 Brévonnes,10061_0004,G,RUE DE CHAMPAGNE,
325424554,00013,32542455400013,O,,,,,,true,1,,,,,,10220,BREVONNES,,,10061,,,,,,,,,,,,,,,,,,,1984-12-25,F,,,,,65.02,NAP,N,,,0,,,,,,
328009154,00019,32800915400019,O,,,,,,true,1,,,,,,10220,BREVONNES,,,10061,,,,,,,,,,,,,,,,,,,1985-12-25,F,,,,,65.02,NAP,N,,,0,,,,,,
330460023,00014,33046002300014,O,,NN,,,,true,1,,,,,,10220,BREVONNES,,,10061,,,,,,,,,,,,,,,,,,,,F,,,,,02.20,NAP,N,,,0,,,,,,
331498469,00039,33149846900039,O,1988-12-07,,,,2015-07-16T13:41:02,true,4,,,,RUE,DE LA GARE,10220,BREVONNES,,,10061,,,,,,,,,,,,,,,,,,,1992-12-25,F,,,,,50.1Z,NAF1993,N,4.404009,48.359711,0.95,street,Rue de la Gare 10220 Brévonnes,10061_0022,G,RUE DE LA GARE,
331505040,00013,33150504000013,O,1985-01-02,NN,,,2008-11-07T00:50:17,true,4,,,,RUE,DU BOIS,10220,BREVONNES,,,10061,,,,,,,,,,,,,,,,,,,2003-01-31,F,,,,,45.2V,NAFRev1,O,4.399088,48.354409,0.95,street,Rue du Bois 10220 Brévonnes,10061_0070,G,RUE DU BOIS,
333025526,00018,33302552600018,O,1984-08-01,NN,,,2008-01-04T20:33:37,true,3,,,,RUE,DU BOIS,10220,BREVONNES,,,10061,,,,,,,,,,,,,,,,,,,2008-01-01,A,,,,,01.49Z,NAFRev2,N,4.399088,48.354409,0.95,street,Rue du Bois 10220 Brévonnes,10061_0070,G,RUE DU BOIS,
334895786,00013,33489578600013,O,,NN,,,,true,1,,,,,LD TUILERIE DU MARMORET,10220,BREVONNES,,,10061,,,,,,,,,,,,,,,,,,,1993-05-18,F,,,,,45.1A,NAF1993,N,4.402443,48.348126,0.63,street,Rue du Marmoret 10220 Brévonnes,10061_0130,G,RUE DU MARMORET,
335321055,00014,33532105500014,O,,,,,,true,1,,,,,,10220,BREVONNES,,,10061,,,,,,,,,,,,,,,,,,,1987-02-21,F,,,,,65.02,NAP,N,,,0,,,,,,
337794457,00016,33779445700016,O,1986-04-30,NN,,,,false,4,,,,,FERME DE PLANFORT,10220,BREVONNES,,,10061,,,,,,,,,,,,,,,,,,,1996-01-01,F,,,,,01.1A,NAF1993,N,4.430322,48.356556,0.94,street,Ferme de Planfort 10220 Brévonnes,10061_iyiac9,G,FERME DE PLANFORT,
337794457,00024,33779445700024,O,1996-01-01,NN,,,2019-03-14T03:59:12,true,3,CHEZ MR XAVIER LESEUR,,,,,10220,BREVONNES,,,10061,,,,,,,,,,,,,,,,,,,2008-01-01,A,,,,,01.50Z,NAFRev2,N,,,0,,,,,,
340530856,00012,34053085600012,O,,NN,,,,true,1,,,,RUE,DU BOIS,10220,BREVONNES,,,10061,,,,,,,,,,,,,,,,,,,1987-02-16,F,,,,,62.46,NAP,N,4.399088,48.354409,0.95,street,Rue du Bois 10220 Brévonnes,10061_0070,G,RUE DU BOIS,
340957646,00011,34095764600011,O,,NN,,,,true,1,,,,RUE,DU BOIS,10220,BREVONNES,,,10061,,,,,,,,,,,,,,,,,,,1987-09-30,F,,,,,62.11,NAP,N,4.399088,48.354409,0.95,street,Rue du Bois 10220 Brévonnes,10061_0070,G,RUE DU BOIS,
342471398,00103,34247139800103,O,1994-07-01,NN,,,,false,3,,,,,AU MARMORET,10220,BREVONNES,,,10061,,,,,,,,,,,,,,,,,,,1994-12-25,F,SIMEX,,,,51.5F,NAF1993,O,4.402443,48.348126,0.78,street,Rue du Marmoret 10220 Brévonnes,10061_0130,G,RUE DU MARMORET,
343012605,00022,34301260500022,O,1987-10-01,,,,,false,4,,,,,,10220,BREVONNES,,BP16,10061,,,,,,,,,,,,,,,,,,,1993-12-25,F,,,,,20.3Z,NAF1993,N,,,0,,,,,,
348085879,00016,34808587900016,O,,NN,,,,true,1,,,,,LA LOGE LIONNE,10220,BREVONNES,,,10061,,,,,,,,,,,,,,,,,,,1995-09-30,F,,,,,51.1R,NAF1993,N,4.383272,48.347812,0.94,street,La Loge Lionne 10220 Brévonnes,10061_B032,G,LA LOGE LIONNE,
349256768,00012,34925676800012,O,1989-01-16,NN,,,2018-01-19T03:37:49,true,4,,,,FG,DE MARMORET,10220,BREVONNES,,,10061,,,,,,,,,,,,,,,,,,,2017-12-31,F,,,,,46.21Z,NAFRev2,N,4.402443,48.348126,0.58,street,Rue du Marmoret 10220 Brévonnes,10061_0130,G,RUE DU MARMORET,
349671180,00017,34967118000017,O,,NN,,,2006-11-25T11:02:34,true,1,,,,,LA LOGE LIONNE,10220,BREVONNES,,,10061,,,,,,,,,,,,,,,,,,,1995-09-30,F,,,,,51.1R,NAF1993,N,4.383272,48.347812,0.94,street,La Loge Lionne 10220 Brévonnes,10061_B032,G,LA LOGE LIONNE,
350155917,00015,35015591700015,O,1900-01-01,NN,,,2011-04-28T00:40:18,false,3,,,,,LA LOGE LIONNE,10220,BREVONNES,,,10061,,,,,,,,,,,,,,,,,,,1995-09-30,F,,,,,51.2A,NAF1993,N,4.383272,48.347812,0.94,street,La Loge Lionne 10220 Brévonnes,10061_B032,G,LA LOGE LIONNE,
352150908,00015,35215090800015,O,1989-10-30,NN,,,,true,4,,,,RUE,DE LA GARE,10220,BREVONNES,,,10061,,,,,,,,,,,,,,,,,,,2000-06-05,F,,,,,70.1D,NAF1993,N,4.404009,48.359711,0.95,street,Rue de la Gare 10220 Brévonnes,10061_0022,G,RUE DE LA GARE,
353328685,00014,35332868500014,O,1990-01-02,NN,,,,true,3,,,,RTE,,10220,BREVONNES,,,10061,,,,,,,,,,,,,,,,,,,1995-12-25,F,,,,,74.2C,NAF1993,O,3.1206907,45.7709538,0.88,poi.industrial,RTE (Zone industrielle) Clermont-Ferrand,https://osm.org/way/43852862,G,,
356000216,03416,35600021603416,O,1991-01-01,NN,,,2006-10-28T00:09:54,false,3,,,,RUE,DU BOIS,10220,BREVONNES,,,10061,,,,,,,,,,,,,,,,,,,2005-12-01,F,BUREAU DE POSTE,,,,64.1A,NAFRev1,N,4.399088,48.354409,0.95,street,Rue du Bois 10220 Brévonnes,10061_0070,G,RUE DU BOIS,
378510887,00029,37851088700029,O,2003-12-31,NN,,,2013-01-22T05:13:58,true,3,,,,,LA LOGE LIONNE,10220,BREVONNES,,,10061,,,,,,,,,,,,,,,,,,,2008-01-01,A,,,,,01.11Z,NAFRev2,N,4.383272,48.347812,0.94,street,La Loge Lionne 10220 Brévonnes,10061_B032,G,LA LOGE LIONNE,
379774573,00016,37977457300016,O,1990-11-10,NN,,,,true,3,,,,RUE,DE CHAMPAGNE,10220,BREVONNES,,,10061,,,,,,,,,,,,,,,,,,,2003-12-31,F,,,,,52.6E,NAFRev1,N,4.39828,48.361482,0.95,street,Rue de Champagne 10220 Brévonnes,10061_0004,G,RUE DE CHAMPAGNE,
381076421,00027,38107642100027,O,2014-12-01,,,,2021-02-23T11:09:32,true,1,,1,,,RUELLE FOCH,10220,BREVONNES,,,10061,,,,,,,,,,,,,,,,,,,2014-12-01,A,,,,,90.03A,NAFRev2,N,4.403226,48.36057,0.94,housenumber,1 Ruelle Foch 10220 Brévonnes,10061_0006_00001,G,1 RUELLE FOCH,
381469089,00035,38146908900035,O,2020-12-23,,,,2022-01-11T04:10:20,true,1,,,,,LA LOGE LIONNE,10220,BREVONNES,,,10061,,,,,,,,,,,,,,,,,,,2020-12-23,A,,,,,01.11Z,NAFRev2,N,4.383272,48.347812,0.94,street,La Loge Lionne 10220 Brévonnes,10061_B032,G,LA LOGE LIONNE,
381551142,00015,38155114200015,O,1991-04-01,NN,,,2008-01-04T21:57:41,true,3,CHEZ M. ET MME RENE MAILLY,5,,RUE,DU BOIS,10220,BREVONNES,,,10061,,,,,,,,,,,,,,,,,,,2008-01-01,A,,,,,01.11Z,NAFRev2,N,4.399035,48.357133,0.95,housenumber,5 Rue du Bois 10220 Brévonnes,10061_0070_00005,G,5 RUE DU BOIS,
381829183,00015,38182918300015,O,,NN,,,,true,1,,,,RUE,DE DIENVILLE,10220,BREVONNES,,,10061,,,,,,,,,,,,,,,,,,,1991-12-20,F,,,,,59.09,NAP,N,4.40338,48.357215,0.95,street,Rue de Dienville 10220 Brévonnes,10061_0085,G,RUE DE DIENVILLE,
383274115,00013,38327411500013,O,,NN,,,,true,1,,6,,LOT,LE VILLAGE,10220,BREVONNES,,,10061,,,,,,,,,,,,,,,,,,,1992-06-04,F,,,,,29.5C,NAF1993,N,4.399536,48.359353,0.65,street,Le Village 10220 Brévonnes,10061_60addb,G,LE VILLAGE,
383743002,00024,38374300200024,O,1995-04-01,NN,,,,false,4,,,,RUE,DE MARMORET,10220,BREVONNES,,,10061,,,,,,,,,,,,,,,,,,,2001-11-01,F,,,,,74.8K,NAF1993,O,4.402443,48.348126,0.78,street,Rue du Marmoret 10220 Brévonnes,10061_0130,G,RUE DU MARMORET,
388845760,00023,38884576000023,O,2000-01-02,NN,,,2008-01-04T23:15:20,true,3,,1,,RUE,DE CHAMPAGNE,10220,BREVONNES,,,10061,,,,,,,,,,,,,,,,,,,2008-01-01,A,,,,,86.21Z,NAFRev2,N,4.399013,48.35885,0.95,housenumber,1 Rue de Champagne 10220 Brévonnes,10061_0004_00001,G,1 RUE DE CHAMPAGNE,
393589486,00017,39358948600017,O,1900-01-01,NN,,,2014-03-18T03:51:54,true,5,,16,,RUE,DE PINEY,10220,BREVONNES,,,10061,,,,,,,,,,,,,,,,,,,2014-02-01,F,TERROIRS ET SAVEURS DE FRANCE,,,,56.10C,NAFRev2,N,4.393998,48.357427,0.95,housenumber,16 Rue de Piney 10220 Brévonnes,10061_0140_00016,G,16 RUE DE PINEY,
395174527,00014,39517452700014,O,,NN,,,,true,1,,33,,RUE,DU TREMBLET,10220,BREVONNES,,,10061,,,,,,,,,,,,,,,,,,,1994-07-14,F,,,,,51.1R,NAF1993,N,4.405867,48.361745,0.95,housenumber,33 Rue du Tremblet 10220 Brévonnes,10061_0050_00033,G,33 RUE DU TREMBLET,
401072467,00012,40107246700012,O,1995-04-24,NN,,,,false,4,,28,,RUE,DE MARMORET,10220,BREVONNES,,,10061,,,,,,,,,,,,,,,,,,,1998-11-26,F,,,,,51.6G,NAF1993,N,4.406855,48.344457,0.81,housenumber,28 Rue du Marmoret 10220 Brévonnes,10061_0130_00028,G,28 RUE DU MARMORET,
403035504,00014,40303550400014,O,1995-11-15,NN,,,2014-11-17T08:08:49,false,4,,,,,FERME DE LA MILLY,10220,BREVONNES,,,10061,,,,,,,,,,,,,,,,,,,2014-10-01,F,,,,,01.11Z,NAFRev2,N,4.379044,48.341297,0.53,street,La Milly 10220 Brévonnes,10061_33abg1,G,LA MILLY,
403035504,00022,40303550400022,O,2014-10-01,,,,2021-02-23T11:27:14,true,1,,,,,LA LOGE LIONNE,10220,BREVONNES,,,10061,,,,,,,,,,,,,,,,,,,2014-10-01,A,,,,,01.11Z,NAFRev2,N,4.383272,48.347812,0.94,street,La Loge Lionne 10220 Brévonnes,10061_B032,G,LA LOGE LIONNE,
408515674,00013,40851567400013,O,1996-07-03,NN,,,2014-07-08T01:39:50,true,4,,,,,LE MARMORET,10220,BREVONNES,,,10061,,,,,,,,,,,,,,,,,,,2009-12-31,F,,,,,16.10A,NAFRev2,N,4.402443,48.348126,0.71,street,Rue du Marmoret 10220 Brévonnes,10061_0130,G,RUE DU MARMORET,
408802270,00012,40880227000012,O,1980-12-31,NN,,,2008-01-04T21:16:57,true,3,,,,RUE,RUE DU BOIS,10220,BREVONNES,,,10061,,,,,,,,,,,,,,,,,,,2008-01-01,A,,,,,01.11Z,NAFRev2,N,4.399088,48.354409,0.89,street,Rue du Bois 10220 Brévonnes,10061_0070,G,RUE DU BOIS,
408802288,00014,40880228800014,O,1980-12-31,NN,,,,true,1,,,,RTE,DE PINEY,10220,BREVONNES,,,10061,,,,,,,,,,,,,,,,,,,1999-12-31,F,,,,,01.1A,NAF1993,N,4.394644,48.357473,0.74,street,Rue de Piney 10220 Brévonnes,10061_0140,G,RUE DE PINEY,
408802296,00017,40880229600017,O,1982-12-01,NN,,,2020-02-03T10:31:28,true,4,,,,,,10220,BREVONNES,,,10061,,,,,,,,,,,,,,,,,,,2018-12-31,F,,,,,01.41Z,NAFRev2,N,,,0,,,,,,
408802304,00019,40880230400019,O,1990-01-01,NN,,,2020-07-22T03:49:12,true,4,,,,RUE,DU BOIS,10220,BREVONNES,,,10061,,,,,,,,,,,,,,,,,,,2020-05-31,F,,,,,01.50Z,NAFRev2,N,4.399088,48.354409,0.95,street,Rue du Bois 10220 Brévonnes,10061_0070,G,RUE DU BOIS,
408802312,00012,40880231200012,O,1995-12-28,NN,,,2008-01-04T21:16:57,true,3,,10,,RUE,DE PINEY,10220,BREVONNES,,,10061,,,,,,,,,,,,,,,,,,,2008-01-01,A,,,,,01.11Z,NAFRev2,N,4.396793,48.357934,0.95,housenumber,10 Rue de Piney 10220 Brévonnes,10061_0140_00010,G,10 RUE DE PINEY,
408802320,00015,40880232000015,O,1996-03-01,NN,,,2008-01-04T21:16:57,true,3,,,,,LA LOGE LIONNE,10220,BREVONNES,,,10061,,,,,,,,,,,,,,,,,,,2008-01-01,A,,,,,01.11Z,NAFRev2,N,4.383272,48.347812,0.94,street,La Loge Lionne 10220 Brévonnes,10061_B032,G,LA LOGE LIONNE,
410021935,00011,41002193500011,O,1988-07-01,NN,,,2015-06-18T04:11:52,true,4,,,,,,10220,BREVONNES,,,10061,,,,,,,,,,,,,,,,,,,2015-06-30,F,,,,,01.11Z,NAFRev2,N,,,0,,,,,,
412260408,00015,41226040800015,O,,,,,,true,1,,,,,,10220,BREVONNES,,,10061,,,,,,,,,,,,,,,,,,,1995-11-15,F,,,,,01.3Z,NAF1993,N,,,0,,,,,,
413691221,00019,41369122100019,O,1997-09-10,NN,,,,true,4,,17,,RUE,DE PINEY,10220,BREVONNES,,,10061,,,,,,,,,,,,,,,,,,,2002-01-28,F,,,,,52.4Y,NAF1993,O,4.395291,48.357483,0.95,housenumber,17 Rue de Piney 10220 Brévonnes,10061_0140_00017,G,17 RUE DE PINEY,
413781394,00015,41378139400015,O,1997-09-11,NN,,,2008-01-05T20:30:23,true,3,,5,,RUE,DE LA GARE,10220,BREVONNES,,,10061,,,,,,,,,,,,,,,,,,,2008-01-01,A,,,,,68.20B,NAFRev2,N,4.401463,48.359219,0.95,housenumber,5 Rue de la Gare 10220 Brévonnes,10061_0022_00005,G,5 RUE DE LA GARE,
414534354,00017,41453435400017,O,1997-11-17,,,,2011-05-03T00:32:37,false,3,,14,,RUE,DU BOIS,10220,BREVONNES,,,10061,,,,,,,,,,,,,,,,,,,1998-07-10,F,,,,,26.7Z,NAF1993,N,4.399199,48.356409,0.95,housenumber,14 Rue du Bois 10220 Brévonnes,10061_0070_00014,G,14 RUE DU BOIS,
414534354,00025,41453435400025,O,2003-05-02,NN,,,2021-02-23T11:36:56,true,7,,10,,RUE,DU BOIS,10220,BREVONNES,,,10061,,,,,,,,,,,,,,,,,,,2018-07-26,A,,,,,43.99C,NAFRev2,N,4.399001,48.35668,0.95,housenumber,10 Rue du Bois 10220 Brévonnes,10061_0070_00010,G,10 RUE DU BOIS,
415004779,00013,41500477900013,O,1998-01-02,NN,,,2021-02-23T11:37:28,true,4,,5,,RUE,DE LA GARE,10220,BREVONNES,,,10061,,,,,,,,,,,,,,,,,,,2008-01-01,A,,,,,68.20B,NAFRev2,O,4.401463,48.359219,0.95,housenumber,5 Rue de la Gare 10220 Brévonnes,10061_0022_00005,G,5 RUE DE LA GARE,
418412193,00025,41841219300025,O,2001-06-15,11,2019,,2021-10-27T08:39:56,false,4,,,,,LA LOGE LIONNE,10220,BREVONNES,,,10061,,,,,,,,,,,,,,,,,,,2011-12-31,A,,,,,01.61Z,NAFRev2,O,4.383272,48.347812,0.94,street,La Loge Lionne 10220 Brévonnes,10061_B032,G,LA LOGE LIONNE,
418891073,00029,41889107300029,O,1999-01-01,,,,,true,1,,15,,RUE,DU BOIS,10220,BREVONNES,,,10061,,,,,,,,,,,,,,,,,,,2000-05-18,F,,,,,51.6K,NAF1993,N,4.39953,48.356142,0.95,housenumber,15 Rue du Bois 10220 Brévonnes,10061_0070_00015,G,15 RUE DU BOIS,
423812692,00014,42381269200014,O,1999-07-27,,,,,true,1,,16,,RUE,DE L'AUZON,10220,BREVONNES,,,10061,,,,,,,,,,,,,,,,,,,1999-09-30,F,,,,,45.4F,NAF1993,N,4.402682,48.357857,0.95,housenumber,16 Rue de l’Auzon 10220 Brévonnes,10061_0026_00016,G,16 RUE DE L AUZON,
424901635,00013,42490163500013,O,1993-06-01,NN,,,2020-05-16T03:49:33,true,3,,,,,FERME DE LA LOGE LIONNE,10220,BREVONNES,,,10061,,,,,,,,,,,,,,,,,,,2008-01-01,A,,,,,68.20B,NAFRev2,N,4.383745,48.347648,0.84,street,Ferme la Loge Lionne 10220 Brévonnes,10061_p3gajy,G,FERME LA LOGE LIONNE,
425127404,00027,42512740400027,O,2012-03-01,03,2019,,2022-02-05T13:34:25,true,1,,28,,RUE,DU MARMORET,10220,BREVONNES,,,10061,,,,,,,,,,,,,,,,,,,2012-03-01,A,,,,,64.20Z,NAFRev2,O,4.406855,48.344457,0.95,housenumber,28 Rue du Marmoret 10220 Brévonnes,10061_0130_00028,G,28 RUE DU MARMORET,
428557441,00014,42855744100014,O,1991-04-01,NN,,,,true,1,,,,,,10220,BREVONNES,,,10061,,,,,,,,,,,,,,,,,,,2001-10-10,F,,,,,70.2B,NAF1993,N,,,0,,,,,,
428596175,00011,42859617500011,O,2000-01-01,NN,,,2007-01-18T09:42:29,true,3,,13,,RTE,DE PINEY,10220,BREVONNES,,,10061,,,,,,,,,,,,,,,,,,,2005-01-01,F,,,,,01.1A,NAFRev1,N,4.3963,48.357669,0.78,housenumber,13 Rue de Piney 10220 Brévonnes,10061_0140_00013,G,13 RUE DE PINEY,
428687412,00018,42868741200018,O,1999-11-01,NN,,,2008-01-05T01:29:41,true,3,,,,,,10220,BREVONNES,,,10061,,,,,,,,,,,,,,,,,,,2008-01-01,A,,,,,68.20B,NAFRev2,N,,,0,,,,,,
429299142,00019,42929914200019,O,1969-01-01,NN,,,2008-01-05T01:37:26,true,3,,30,,RUE,DE DIENVILLE,10220,BREVONNES,,,10061,,,,,,,,,,,,,,,,,,,2008-01-01,A,,,,,01.11Z,NAFRev2,N,4.407261,48.35658,0.95,housenumber,30 Rue de Dienville 10220 Brévonnes,10061_0085_00030,G,30 RUE DE DIENVILLE,
429492820,00015,42949282000015,O,2000-02-01,NN,,,2017-06-08T08:17:47,true,3,,21,,RUE,DE CHAMPAGNE,10220,BREVONNES,,,10061,,,,,,,,,,,,,,,,,,,2008-01-01,A,,,,,68.20B,NAFRev2,N,4.398054,48.361626,0.95,housenumber,21 Rue de Champagne 10220 Brévonnes,10061_0004_00021,G,21 RUE DE CHAMPAGNE,
430286666,00036,43028666600036,O,2011-07-01,,,,2021-02-23T11:50:09,true,2,,3,,IMP,GALLEREY,10220,BREVONNES,,,10061,,,,,,,,,,,,,,,,,,,2012-09-01,A,,,,,85.51Z,NAFRev2,N,4.397276,48.352922,0.81,housenumber,3 Impasse Gallerey 10220 Brévonnes,10061_0020_00003,G,3 IMPASSE GALLEREY,
431683291,00014,43168329100014,O,2000-05-01,NN,,,2021-04-08T03:51:36,true,6,,,,,LA LOGE LIONNE,10220,BREVONNES,,,10061,,,,,,,,,,,,,,,,,,,2016-12-31,A,,,,,46.21Z,NAFRev2,N,4.383272,48.347812,0.94,street,La Loge Lionne 10220 Brévonnes,10061_B032,G,LA LOGE LIONNE,
432085900,00020,43208590000020,O,2008-02-21,,,,2009-06-04T04:45:37,true,1,LA LOGE LIONNE,,,,,10220,BREVONNES,,,10061,,,,,,,,,,,,,,,,,,,2008-02-21,A,,,,,01.11Z,NAFRev2,N,4.383272,48.347812,0.94,street,La Loge Lionne 10220 Brévonnes,10061_B032,D,LA LOGE LIONNE,
434511481,00039,43451148100039,O,2001-05-01,NN,,,2008-01-31T14:00:25,false,4,,,,RUE,BAS,10220,BREVONNES,,,10061,,,,,,,,,,,,,,,,,,,2008-01-01,F,,,,,43.91B,NAFRev2,N,4.404009,48.359711,0.58,street,Rue de la Gare 10220 Brévonnes,10061_0022,G,RUE DE LA GARE,