siren,nic,siret,statutDiffusionEtablissement,dateCreationEtablissement,trancheEffectifsEtablissement,anneeEffectifsEtablissement,activitePrincipaleRegistreMetiersEtablissement,dateDernierTraitementEtablissement,etablissementSiege,nombrePeriodesEtablissement,complementAdresseEtablissement,numeroVoieEtablissement,indiceRepetitionEtablissement,typeVoieEtablissement,libelleVoieEtablissement,codePostalEtablissement,libelleCommuneEtablissement,libelleCommuneEtrangerEtablissement,distributionSpecialeEtablissement,codeCommuneEtablissement,codeCedexEtablissement,libelleCedexEtablissement,codePaysEtrangerEtablissement,libellePaysEtrangerEtablissement,complementAdresse2Etablissement,numeroVoie2Etablissement,indiceRepetition2Etablissement,typeVoie2Etablissement,libelleVoie2Etablissement,codePostal2Etablissement,libelleCommune2Etablissement,libelleCommuneEtranger2Etablissement,distributionSpeciale2Etablissement,codeCommune2Etablissement,codeCedex2Etablissement,libelleCedex2Etablissement,codePaysEtranger2Etablissement,libellePaysEtranger2Etablissement,dateDebut,etatAdministratifEtablissement,enseigne1Etablissement,enseigne2Etablissement,enseigne3Etablissement,denominationUsuelleEtablissement,activitePrincipaleEtablissement,nomenclatureActivitePrincipaleEtablissement,caractereEmployeurEtablissement,longitude,latitude,geo_score,geo_type,geo_adresse,geo_id,geo_ligne,geo_l4,geo_l5
211800057,00013,21180005700013,O,1983-03-01,11,2019,,2021-10-27T08:07:05,true,4,,,,,LE BOURG,18500,ALLOUIS,,,18005,,,,,,,,,,,,,,,,,,,2008-01-01,A,MAIRIE,,,,84.11Z,NAFRev2,O,2.225747,47.165514,0.62,street,Impasse du Bourg 18500 Allouis,18005_0150,G,IMPASSE DU BOURG,
211800057,00021,21180005700021,O,1983-12-21,03,2019,,2021-10-27T08:07:05,false,3,,,,,LE BOURG,18500,ALLOUIS,,,18005,,,,,,,,,,,,,,,,,,,2008-01-01,A,ECOLE PRIMAIRE PUBLIQUE,,,,85.20Z,NAFRev2,N,2.225747,47.165514,0.62,street,Impasse du Bourg 18500 Allouis,18005_0150,G,IMPASSE DU BOURG,
211800057,00039,21180005700039,O,1996-01-01,NN,,,2021-07-20T13:00:33,false,4,LE BOURG,,,,MAIRIE,18500,ALLOUIS,,,18005,,,,,,,,,,,,,,,,,,,2021-01-01,F,SERVICE ASSAINISSEMENT,,,,37.00Z,NAFRev2,N,2.227663,47.165984,0.91,street,Place de la Mairie 18500 Allouis,18005_0395,G,PLACE DE LA MAIRIE,
261802128,00015,26180212800015,O,1995-12-25,NN,,,2010-06-26T03:05:55,true,2,MAIRIE,,,,LE BOURG,18500,ALLOUIS,,,18005,,,,,,,,,,,,,,,,,,,2008-01-01,A,CCAS,,,,88.99B,NAFRev2,N,2.225747,47.165514,0.62,street,Impasse du Bourg 18500 Allouis,18005_0150,G,IMPASSE DU BOURG,
300661006,00019,30066100600019,O,1988-04-01,NN,,,2008-11-07T00:16:51,true,4,,10,B,RTE,D'ALLOGNY,18500,ALLOUIS,,,18005,,,,,,,,,,,,,,,,,,,2008-05-19,F,,,,,45.20A,NAFRev2,N,2.222342,47.148855,0.7,housenumber,10bis Rue d’Allogny 18500 Allouis,18005_0100_00010_bis,G,10BIS RUE D ALLOGNY,
302297478,00018,30229747800018,O,,NN,,,,true,1,,,,RUE,DU TONKIN,18500,ALLOUIS,,,18005,,,,,,,,,,,,,,,,,,,1992-08-31,F,,,,,70.2C,NAF1993,N,2.223308,47.148535,0.95,street,Rue du Tonkin 18500 Allouis,18005_0600,G,RUE DU TONKIN,
309468668,00012,30946866800012,O,1900-01-01,,,,2008-11-07T00:24:17,true,4,,,,RUE,DU TONKIN,18500,ALLOUIS,,,18005,,,,,,,,,,,,,,,,,,,1993-12-25,F,,,,,28.5D,NAF1993,N,2.223308,47.148535,0.95,street,Rue du Tonkin 18500 Allouis,18005_0600,G,RUE DU TONKIN,
312048010,00044,31204801000044,O,2014-11-30,,,,2021-02-23T10:39:26,true,1,,,,,JARRY,18500,ALLOUIS,,,18005,,,,,,,,,,,,,,,,,,,2014-11-30,A,,,,,70.10Z,NAFRev2,N,2.259145,47.156577,0.91,locality,Domaine de Jarry 18500 Allouis,18005_B050,G,DOMAINE DE JARRY,
312873805,00013,31287380500013,O,,,,,,true,1,,,,,DOMAINE NEUF,18500,ALLOUIS,,,18005,,,,,,,,,,,,,,,,,,,1985-12-25,F,,,,,01.80,NAP,N,2.231437,47.180679,0.93,street,Le Domaine Neuf 18500 Allouis,18005_B053,G,LE DOMAINE NEUF,
314154352,00012,31415435200012,O,,NN,,,,true,1,,,,LD,LE TONQUIN,18500,ALLOUIS,,,18005,,,,,,,,,,,,,,,,,,,,F,,,,,55.73,NAP,N,2.223308,47.148535,0.36,street,Rue du Tonkin 18500 Allouis,18005_0600,G,RUE DU TONKIN,
315148270,00012,31514827000012,O,1979-01-01,NN,,,2010-02-23T09:41:08,false,4,,,,,LES TREILLES,18500,ALLOUIS,,,18005,,,,,,,,,,,,,,,,,,,2009-11-30,F,,,,,01.11Z,NAFRev2,N,2.230576,47.168797,0.94,street,Les Treilles 18500 Allouis,18005_tixzol,G,LES TREILLES,
315148270,00020,31514827000020,O,2009-03-01,,,,2021-04-07T10:00:18,true,1,,,,,LES TREILLES,18500,ALLOUIS,,,18005,,,,,,,,,,,,,,,,,,,2009-03-01,A,,,,,68.20B,NAFRev2,N,2.230576,47.168797,0.94,street,Les Treilles 18500 Allouis,18005_tixzol,G,LES TREILLES,
315148270,00038,31514827000038,O,2020-02-15,,,,2020-09-08T13:26:32,false,2,,,,,LES TREILLES,18500,ALLOUIS,,,18005,,,,,,,,,,,,,,,,,,,2020-04-21,F,,,,GITE DES TREILLES,68.20A,NAFRev2,N,2.230576,47.168797,0.94,street,Les Treilles 18500 Allouis,18005_tixzol,G,LES TREILLES,
317390433,00025,31739043300025,O,2004-02-01,NN,,,2012-11-09T00:18:00,true,6,,,,RTE,N 76,18500,ALLOUIS,,,18005,,,,,,,,,,,,,,,,,,,2010-12-31,F,,,,,70.22Z,NAFRev2,N,,,0,,,,,,
318673803,00025,31867380300025,O,1988-09-22,NN,,,2017-05-04T02:53:25,true,3,,,,,SARDONNET,18500,ALLOUIS,,,18005,,,,,,,,,,,,,,,,,,,2008-01-01,A,,,,,01.45Z,NAFRev2,N,2.198574,47.187144,0.92,street,Lieu Dit Sardonnet 18500 Allouis,18005_ikcl1p,G,LIEU DIT SARDONNET,
320824220,00026,32082422000026,O,1900-01-01,NN,,,2011-04-28T00:18:41,false,3,,,,,LE BOURG,18500,ALLOUIS,,,18005,,,,,,,,,,,,,,,,,,,1994-12-31,F,,,,,55.4B,NAF1993,N,2.225747,47.165514,0.62,street,Impasse du Bourg 18500 Allouis,18005_0150,G,IMPASSE DU BOURG,
320824220,00034,32082422000034,O,1998-03-02,NN,,,2006-11-25T09:48:17,true,3,,2,,RUE,DES PETITES BUCHES,18500,ALLOUIS,,,18005,,,,,,,,,,,,,,,,,,,2006-08-31,F,,,,,60.2L,NAFRev1,N,2.22664,47.16518,0.95,housenumber,2 Rue des Petites Buches 18500 Allouis,18005_0450_00002,G,2 RUE DES PETITES BUCHES,
322296054,00024,32229605400024,O,1984-01-01,NN,,,,true,4,,,,,BREAN,18500,ALLOUIS,,,18005,,,,,,,,,,,,,,,,,,,2003-04-30,F,,,,,01.1A,NAFRev1,N,2.218359,47.187062,0.93,street,Le Brean 18500 Allouis,18005_yzxvur,G,LE BREAN,
323163121,00011,32316312100011,O,1981-01-01,NN,,,,true,1,,,,,FERME DE CAYENNE,18500,ALLOUIS,,,18005,,,,,,,,,,,,,,,,,,,1999-06-30,F,,,,,01.1A,NAF1993,N,2.21511,47.176172,0.5,street,Cayenne 18500 Allouis,18005_oti23j,G,CAYENNE,
323711036,00026,32371103600026,O,,NN,,,,true,1,,,,,LES FONTAINES,18500,ALLOUIS,,,18005,,,,,,,,,,,,,,,,,,,1989-03-31,F,,,,,60.09,NAP,N,2.228056,47.195161,0.79,locality,Moulin des Fontaines 18500 Allouis,18005_B085,G,MOULIN DES FONTAINES,
323768051,00043,32376805100043,O,2017-11-22,,,2651BZ,2021-02-23T10:47:03,true,2,,1,,,VIGNES DE PREDONNIER,18500,ALLOUIS,,,18005,,,,,,,,,,,,,,,,,,,2018-12-20,A,,,,,47.91B,NAFRev2,N,2.193545,47.183865,0.82,street,Vignes du Prédonnier 18500 Allouis,18005_B167,G,VIGNES DU PREDONNIER,
325999373,00013,32599937300013,O,,NN,,,,true,1,,,,,,18500,ALLOUIS,,,18005,,,,,,,,,,,,,,,,,,,1992-04-07,F,,,,,77.01,NAP,N,,,0,,,,,,
328165378,00022,32816537800022,O,1996-06-01,NN,,,2014-07-08T00:32:46,false,6,,,,LD,LE BREAN,18500,ALLOUIS,,,18005,,,,,,,,,,,,,,,,,,,2009-07-31,F,,,,,43.32A,NAFRev2,N,2.218359,47.187062,0.95,street,Le Brean 18500 Allouis,18005_yzxvur,G,LE BREAN,
328350939,00018,32835093900018,O,,NN,,,,true,1,,,,,SARDONNET,18500,ALLOUIS,,,18005,,,,,,,,,,,,,,,,,,,1992-07-01,F,,,,,01.1A,NAF1993,N,2.198574,47.187144,0.92,street,Lieu Dit Sardonnet 18500 Allouis,18005_ikcl1p,G,LIEU DIT SARDONNET,
328431077,00010,32843107700010,O,1983-11-10,NN,,,,true,3,,,,RTE,NATIONALE 76,18500,ALLOUIS,,,18005,,,,,,,,,,,,,,,,,,,1991-12-25,F,,,,,67.08,NAP,N,,,0,,,,,,
329869382,00013,32986938200013,O,,NN,,,,true,1,,,,LD,LA TOUCHE,18500,ALLOUIS,,,18005,,,,,,,,,,,,,,,,,,,1995-12-15,F,,,,,01.1A,NAF1993,N,2.26211,47.152102,0.94,street,La Touche 18500 Allouis,18005_sq2qnt,G,LA TOUCHE,
330670225,00011,33067022500011,O,1984-07-01,NN,,,2021-01-18T18:55:54,false,8,,,,LD,LA THUASNERIE,18500,ALLOUIS,,,18005,,,,,,,,,,,,,,,,,,,2008-12-31,A,,,,,90.03B,NAFRev2,N,2.242278,47.171903,0.94,street,La Thuasnerie 18500 Allouis,18005_aduxpn,G,LA THUASNERIE,
333077436,00017,33307743600017,O,1985-07-01,NN,,4321AB,2017-01-15T04:09:43,true,4,,,,LD,BREAN,18500,ALLOUIS,,,18005,,,,,,,,,,,,,,,,,,,2016-12-31,F,,,,,43.21A,NAFRev2,N,2.218359,47.187062,0.93,street,Le Brean 18500 Allouis,18005_yzxvur,G,LE BREAN,
335027751,00122,33502775100122,O,2016-03-04,,,,2020-09-03T03:59:12,true,2,,4,,PL,DE LA MAIRIE,18500,ALLOUIS,,,18005,,,,,,,,,,,,,,,,,,,2020-09-01,F,PETIT ALLOUIS,,,,56.10A,NAFRev2,N,2.227493,47.166089,0.84,housenumber,4 Place de la Mairie 18500 Allouis,18005_0395_00004,G,4 PLACE DE LA MAIRIE,
337503585,00016,33750358500016,O,1986-04-01,NN,,,2018-03-03T04:26:44,true,6,,24,,RUE,DU CHEMIN VERT,18500,ALLOUIS,,,18005,,,,,,,,,,,,,,,,,,,2015-12-31,F,,,,,25.62B,NAFRev2,N,2.220601,47.150825,0.95,housenumber,24 Rue du Chemin Vert 18500 Allouis,18005_0200_00024,G,24 RUE DU CHEMIN VERT,
337847339,00021,33784733900021,O,2001-06-01,NN,,,2008-11-07T00:56:42,false,4,,,,LD,CAYENNE,18500,ALLOUIS,,,18005,,,,,,,,,,,,,,,,,,,2003-07-01,F,CONFORT CHAUFFAGE,,,,45.3E,NAFRev1,N,2.21511,47.176172,0.94,street,Cayenne 18500 Allouis,18005_oti23j,G,CAYENNE,
338294994,00037,33829499400037,O,1991-04-01,NN,,,2009-06-27T05:14:04,false,3,,,,,,18500,ALLOUIS,,,18005,,,,,,,,,,,,,,,,,,,2007-04-01,F,,,,,01.4D,NAFRev1,N,,,0,,,,,,
339112336,00013,33911233600013,O,1900-01-01,NN,,,2011-04-28T00:31:30,false,3,,,,LD,LE RHIN DU BOIS D EN HAUT,18500,ALLOUIS,,,18005,,,,,,,,,,,,,,,,,,,1992-09-30,F,,,,,45.4C,NAF1993,N,2.248516,47.178093,0.95,street,Le Rhin du Bois d’En Haut 18500 Allouis,18005_B120,G,LE RHIN DU BOIS D EN HAUT,
339175978,00016,33917597800016,O,1986-09-15,01,2019,,2021-10-27T08:32:35,true,3,,,,,FERME D'ASNIERES,18500,ALLOUIS,,,18005,,,,,,,,,,,,,,,,,,,2008-01-01,A,,,,,01.11Z,NAFRev2,N,2.230251,47.154261,0.5,street,Lieu Dit Asnieres 18500 Allouis,18005_a8d336,G,LIEU DIT ASNIERES,
339303489,00019,33930348900019,O,1986-08-09,NN,,,2009-05-14T04:44:52,false,4,,,,LD,LA THUASNERIE,18500,ALLOUIS,,,18005,,,,,,,,,,,,,,,,,,,2005-06-21,F,,,,,26.1J,NAFRev1,O,2.242278,47.171903,0.94,street,La Thuasnerie 18500 Allouis,18005_aduxpn,G,LA THUASNERIE,
340257757,00021,34025775700021,O,1996-10-02,,,,2016-01-12T00:12:32,false,4,,,,,DOMAINE DE LA FRINGALE,18500,ALLOUIS,,,18005,,,,,,,,,,,,,,,,,,,2008-01-01,A,,,,,96.09Z,NAFRev2,N,2.206966,47.162589,0.94,street,Domaine de la Fringale 18500 Allouis,18005_B051,G,DOMAINE DE LA FRINGALE,
340257757,00039,34025775700039,O,1996-10-02,NN,,,2008-01-04T21:40:00,true,4,,,,,DOMAINE DE LA FRINGALE,18500,ALLOUIS,,,18005,,,,,,,,,,,,,,,,,,,2008-01-01,A,,,,,01.43Z,NAFRev2,N,2.206966,47.162589,0.94,street,Domaine de la Fringale 18500 Allouis,18005_B051,G,DOMAINE DE LA FRINGALE,
340611904,00020,34061190400020,O,1996-07-20,NN,,,2009-06-30T04:49:03,true,4,RN 76,,,CHE,DES HOUCHES,18500,ALLOUIS,,,18005,,,,,,,,,,,,,,,,,,,2009-06-30,F,LE CHALET,,,,47.79Z,NAFRev2,N,2.195669,47.164452,0.74,street,Che des Grandes Ouches 18500 Allouis,18005_rdtcv7,G,CHE DES GRANDES OUCHES,
341648152,00013,34164815200013,O,1987-05-14,NN,,,2008-01-04T21:54:47,true,3,MAIRIE,,,,LE BOURG,18500,ALLOUIS,,,18005,,,,,,,,,,,,,,,,,,,2008-01-01,A,,,,,93.12Z,NAFRev2,N,2.225747,47.165514,0.62,street,Impasse du Bourg 18500 Allouis,18005_0150,G,IMPASSE DU BOURG,
341732857,00022,34173285700022,O,2010-01-06,,,4331ZB,2021-02-23T10:57:24,true,1,,,,,LES VIGNES DU PREDONNIER,18500,ALLOUIS,,,18005,,,,,,,,,,,,,,,,,,,2010-01-06,A,,,,,43.31Z,NAFRev2,N,2.193545,47.183865,0.84,street,Vignes du Prédonnier 18500 Allouis,18005_B167,G,VIGNES DU PREDONNIER,
341896330,00022,34189633000022,O,2003-05-01,NN,,,2009-09-11T09:17:35,true,4,,,,,BREAN,18500,ALLOUIS,,,18005,,,,,,,,,,,,,,,,,,,2009-02-28,F,,,,,01.11Z,NAFRev2,N,2.218359,47.187062,0.93,street,Le Brean 18500 Allouis,18005_yzxvur,G,LE BREAN,
342000155,00016,34200015500016,O,,NN,,,,true,1,,,,LD,LE RHIN DU BOIS D'EN BAS,18500,ALLOUIS,,,18005,,,,,,,,,,,,,,,,,,,1987-10-23,F,,,,,80.08,NAP,N,2.249318,47.172022,0.95,street,Le Rhin du Bois d’En Bas 18500 Allouis,18005_B119,G,LE RHIN DU BOIS D EN BAS,
342404399,00350,34240439900350,O,1987-09-08,12,2019,,2021-10-27T08:35:09,false,6,,25,,,LES TERRES BLANCHES,18500,ALLOUIS,,,18005,,,,,,,,,,,,,,,,,,,2011-03-31,A,CEN ALLOUIS,,,,61.20Z,NAFRev2,O,2.206412,47.166028,0.95,housenumber,25 Les Terres Blanches 18500 Allouis,18005_b135_00025,G,25 LES TERRES BLANCHES,
343977468,00036,34397746800036,O,2002-01-01,NN,,,2008-01-04T22:22:28,true,5,LE MONTET,,,,LE MONTET,18500,ALLOUIS,,,18005,,,,,,,,,,,,,,,,,,,2008-01-01,A,,,,,75.00Z,NAFRev2,N,2.239203,47.188971,0.94,street,Le Montet 18500 Allouis,18005_bpsl67,G,LE MONTET,
344954789,00022,34495478900022,O,2014-10-30,,,,2021-02-23T10:59:52,true,1,,,,,JARRY,18500,ALLOUIS,,,18005,,,,,,,,,,,,,,,,,,,2014-10-30,A,,,,,68.20B,NAFRev2,N,2.259145,47.156577,0.91,locality,Domaine de Jarry 18500 Allouis,18005_B050,G,DOMAINE DE JARRY,
347978090,00020,34797809000020,O,2009-10-30,,,,2016-04-19T08:34:21,true,2,,1,,,LD BREAN,18500,ALLOUIS,,,18005,,,,,,,,,,,,,,,,,,,2015-12-31,F,,,,,47.91A,NAFRev2,N,2.219746,47.188722,0.82,housenumber,1 Le Brean 18500 Allouis,18005_yzxvur_00001,G,1 LE BREAN,
349737957,00010,34973795700010,O,1989-01-01,NN,,,,true,4,,,,,RHIN DU BOIS,18500,ALLOUIS,,,18005,,,,,,,,,,,,,,,,,,,1998-06-30,F,,,,,01.1A,NAF1993,N,2.249318,47.172022,0.93,street,Le Rhin du Bois d’En Bas 18500 Allouis,18005_B119,G,LE RHIN DU BOIS D EN BAS,
351652003,00028,35165200300028,O,2018-01-01,,,,2021-02-23T11:04:13,true,1,LA POULETTERIE,,,,,18500,ALLOUIS,,,18005,,,,,,,,,,,,,,,,,,,2018-01-01,A,,,,,68.20B,NAFRev2,N,2.210799,47.186884,0.94,street,La Pouletterie 18500 Allouis,18005_6qjy8w,D,LA POULETTERIE,
352033740,00015,35203374000015,O,,,,,,true,1,,,,RTE,NATIONALE 76,18500,ALLOUIS,,,18005,,,,,,,,,,,,,,,,,,,1990-11-09,F,,,,,48.06,NAP,N,,,0,,,,,,
378520704,00024,37852070400024,O,1991-09-15,,,,2008-11-08T00:34:08,true,3,,,,,GARDONNES,18500,ALLOUIS,,,18005,,,,,,,,,,,,,,,,,,,1994-01-14,F,,,,,45.2B,NAF1993,N,2.198574,47.187144,0.56,street,Lieu Dit Sardonnet 18500 Allouis,18005_ikcl1p,G,LIEU DIT SARDONNET,
379271489,00021,37927148900021,O,2010-01-04,,,,2011-11-24T04:21:09,true,2,,,,,LE BOURG,18500,ALLOUIS,,,18005,,,,,,,,,,,,,,,,,,,2011-10-31,F,CAFE DES SPORTS,,,,56.30Z,NAFRev2,N,2.225747,47.165514,0.62,street,Impasse du Bourg 18500 Allouis,18005_0150,G,IMPASSE DU BOURG,
380284869,00035,38028486900035,O,2003-08-04,NN,,,2014-07-08T01:04:12,true,4,LES TERRES BLANCHES,,,RTE,DE VOUZERON,18500,ALLOUIS,,,18005,,,,,,,,,,,,,,,,,,,2010-11-02,F,,,,,49.41B,NAFRev2,N,2.19481,47.164397,0.33,street,Route de Chancenay 18500 Allouis,18005_0180,G,ROUTE DE CHANCENAY,
381550433,00019,38155043300019,O,,NN,,,,true,1,,,,,SARDONNET,18500,ALLOUIS,,,18005,,,,,,,,,,,,,,,,,,,1992-07-01,F,,,,,01.1A,NAF1993,N,2.198574,47.187144,0.92,street,Lieu Dit Sardonnet 18500 Allouis,18005_ikcl1p,G,LIEU DIT SARDONNET,
383174752,00014,38317475200014,O,1991-09-01,NN,,,,true,4,,,,,BOURG,18500,ALLOUIS,,,18005,,,,,,,,,,,,,,,,,,,1999-06-30,F,,,,,01.1A,NAF1993,N,2.225747,47.165514,0.91,street,Impasse du Bourg 18500 Allouis,18005_0150,G,IMPASSE DU BOURG,
384955464,00019,38495546400019,O,1992-03-06,NN,,,,true,1,,,,,LA THUASNERIE,18500,ALLOUIS,,,18005,,,,,,,,,,,,,,,,,,,1998-06-30,F,,,,,74.8K,NAF1993,N,2.242278,47.171903,0.94,street,La Thuasnerie 18500 Allouis,18005_aduxpn,G,LA THUASNERIE,
385384649,00013,38538464900013,O,1991-10-05,NN,,,2006-11-25T11:48:54,true,1,,,,,LA THUASNERIE,18500,ALLOUIS,,,18005,,,,,,,,,,,,,,,,,,,2002-06-30,F,,,,,74.1J,NAF1993,N,2.242278,47.171903,0.94,street,La Thuasnerie 18500 Allouis,18005_aduxpn,G,LA THUASNERIE,
387496045,00015,38749604500015,O,1992-05-01,,,,2008-11-08T00:47:13,false,3,,,,RTE,NATIONALE 76,18500,ALLOUIS,,,18005,,,,,,,,,,,,,,,,,,,1993-12-25,F,,,,,45.4H,NAF1993,N,,,0,,,,,,
387513013,00012,38751301300012,O,1992-05-06,NN,,,2008-01-05T19:58:00,true,3,LD LES GRANDES OUCHES,76,,RTE,NATIONALE,18500,ALLOUIS,,,18005,,,,,,,,,,,,,,,,,,,2008-01-01,A,,,,,68.20B,NAFRev2,N,2.197314,47.166891,0.51,street,Les Grandes Ouches 18500 Allouis,18005_B072,D,LES GRANDES OUCHES,
387876964,00017,38787696400017,O,1992-05-06,NN,,,2006-11-25T11:50:45,true,5,LES GRANDES OUCHES,,,RTE,NATIONALE 76,18500,ALLOUIS,,,18005,,,,,,,,,,,,,,,,,,,2004-12-03,F,,,,,55.4C,NAFRev1,O,2.197314,47.166891,0.55,street,Les Grandes Ouches 18500 Allouis,18005_B072,D,LES GRANDES OUCHES,
388290835,00015,38829083500015,O,1992-07-01,NN,,,2008-01-04T23:07:13,true,3,,,,,LE SARDONNET,18500,ALLOUIS,,,18005,,,,,,,,,,,,,,,,,,,2008-01-01,A,,,,,01.11Z,NAFRev2,N,2.198574,47.187144,0.73,street,Lieu Dit Sardonnet 18500 Allouis,18005_ikcl1p,G,LIEU DIT SARDONNET,
388929424,00017,38892942400017,O,1978-01-01,,,,2007-01-18T09:31:26,false,3,,,,,LE MOUTET,18500,ALLOUIS,,,18005,,,,,,,,,,,,,,,,,,,1994-11-01,F,,,,,01.3Z,NAF1993,N,2.239203,47.188971,0.66,street,Le Montet 18500 Allouis,18005_bpsl67,G,LE MONTET,
388931180,00011,38893118000011,O,1972-02-01,NN,,,2008-01-04T23:16:48,true,4,,,,,,18500,ALLOUIS,,,18005,,,,,,,,,,,,,,,,,,,2008-01-01,A,,,,,68.20B,NAFRev2,N,,,0,,,,,,
388931438,00013,38893143800013,O,,NN,,,,true,1,,,,,LA FRINGALE,18500,ALLOUIS,,,18005,,,,,,,,,,,,,,,,,,,1995-10-30,F,,,,,01.3Z,NAF1993,N,2.205354,47.162011,0.94,street,La Fringale 18500 Allouis,18005_nse8k5,G,LA FRINGALE,
391090248,00017,39109024800017,O,1993-01-01,NN,,,2009-02-06T15:35:48,true,4,,,,,,18500,ALLOUIS,,,18005,,,,,,,,,,,,,,,,,,,2008-01-01,F,,,,,02.10Z,NAFRev2,N,,,0,,,,,,
391137692,00029,39113769200029,O,1995-07-26,NN,,,2006-11-25T12:05:25,false,4,MME MONTEIRO,21,,RUE,TONKIN,18500,ALLOUIS,,,18005,,,,,,,,,,,,,,,,,,,1998-04-10,F,,,,,92.3A,NAF1993,O,2.224277,47.148883,0.88,housenumber,21 Rue du Tonkin 18500 Allouis,18005_0600_00021,G,21 RUE DU TONKIN,
393317318,00011,39331731800011,O,1994-01-04,NN,,,2008-11-08T00:57:54,false,4,,,,,SARDONNET,18500,ALLOUIS,,,18005,,,,,,,,,,,,,,,,,,,2001-01-12,F,,,,,45.1A,NAF1993,O,2.198574,47.187144,0.92,street,Lieu Dit Sardonnet 18500 Allouis,18005_ikcl1p,G,LIEU DIT SARDONNET,
393557319,00018,39355731900018,O,,NN,,,,true,1,,,,RTE,NATIONALE,18500,ALLOUIS,,,18005,,,,,,,,,,,,,,,,,,,1995-10-31,F,,,,,50.1Z,NAF1993,N,1.2279812,49.230352,0.77,poi,Route Nationale (Pont) Saint-Pierre-du-Vauvray,https://osm.org/way/95838375,G,,
395057045,00019,39505704500019,O,,NN,,,,true,1,,,,,LE MOULIN A VENT,18500,ALLOUIS,,,18005,,,,,,,,,,,,,,,,,,,1994-12-31,F,,,,,01.2G,NAF1993,N,2.229515,47.173904,0.94,street,Le Moulin a Vent 18500 Allouis,18005_B083,G,LE MOULIN A VENT,
397885732,00024,39788573200024,O,2004-09-02,NN,,,2021-02-23T11:21:38,true,3,,,,,LES TERRES BLANCHES,18500,ALLOUIS,,,18005,,,,,,,,,,,,,,,,,,,2008-01-01,A,,,,,68.20B,NAFRev2,N,2.204594,47.165559,0.95,street,Les Terres Blanches 18500 Allouis,18005_B135,G,LES TERRES BLANCHES,
400431185,00026,40043118500026,O,2009-10-09,,,,2013-03-26T04:17:44,true,2,,16,,CHE,DES AVINAUX,18500,ALLOUIS,,,18005,,,,,,,,,,,,,,,,,,,2013-03-31,F,,,,,81.30Z,NAFRev2,N,2.197318,47.163152,0.85,housenumber,16 Chemin des Avinaux 18500 Allouis,18005_0120_00016,G,16 CHEMIN DES AVINAUX,
401939129,00011,40193912900011,O,1995-07-01,NN,,,,true,1,,,,,DOMAINE NEUF,18500,ALLOUIS,,,18005,,,,,,,,,,,,,,,,,,,1998-11-01,F,,,,,01.1A,NAF1993,N,2.231437,47.180679,0.93,street,Le Domaine Neuf 18500 Allouis,18005_B053,G,LE DOMAINE NEUF,
402491732,00010,40249173200010,O,1995-04-22,NN,,,2010-02-25T04:28:24,true,4,,,,,LE BOURG,18500,ALLOUIS,,,18005,,,,,,,,,,,,,,,,,,,2008-10-03,F,,,,,56.30Z,NAFRev2,N,2.225747,47.165514,0.62,street,Impasse du Bourg 18500 Allouis,18005_0150,G,IMPASSE DU BOURG,
403570559,00019,40357055900019,O,,NN,,,,true,1,,9,,IMP,,18500,ALLOUIS,,,18005,,,,,,,,,,,,,,,,,,,1996-12-31,F,,,,,72.5Z,NAF1993,N,2.226065,47.16584,0.75,housenumber,9 Impasse du Bourg 18500 Allouis,18005_0150_00009,G,9 IMPASSE DU BOURG,
405224403,00015,40522440300015,O,1982-12-31,NN,,,2021-09-07T11:38:11,true,4,BOIS GIRARD,,,,,18500,ALLOUIS,,,18005,,,,,,,,,,,,,,,,,,,2019-12-31,F,,,,,01.11Z,NAFRev2,N,2.202884,47.185111,0.93,street,Le Bois Girard 18500 Allouis,18005_B015,D,LE BOIS GIRARD,
408301497,00025,40830149700025,O,2009-08-28,,,,2010-11-07T05:58:45,true,2,,,,CHE,DU MOULIN DE CHANCENAY,18500,ALLOUIS,,,18005,,,,,,,,,,,,,,,,,,,2010-11-30,F,,,,,68.31Z,NAFRev2,N,2.198574,47.163138,0.94,street,Che du Moulin de Chancenay 18500 Allouis,18005_jexc0r,G,CHE DU MOULIN DE CHANCENAY,
408724631,00010,40872463100010,O,1996-09-02,NN,,,2008-11-08T01:20:41,false,4,,44,,RUE,MARIUS AMELINE,18500,ALLOUIS,,,18005,,,,,,,,,,,,,,,,,,,2001-09-01,F,,,,,45.4J,NAF1993,N,2.221408,47.147463,0.95,housenumber,44 Rue Marius Ameline 18500 Allouis,18005_0400_00044,G,44 RUE MARIUS AMELINE,
408724631,00028,40872463100028,O,2001-09-01,NN,,4333ZZ,2019-10-11T08:45:22,false,8,8 A 10,8,,RUE,TONKIN,18500,ALLOUIS,,,18005,,,,,,,,,,,,,,,,,,,2019-07-22,F,,,,,43.33Z,NAFRev2,N,2.22186,47.147957,0.88,housenumber,8 Rue du Tonkin 18500 Allouis,18005_0600_00008,G,8 RUE DU TONKIN,
409118197,00014,40911819700014,O,1996-10-02,NN,,,,true,1,,24,,RUE,MARIUS AMELINE,18500,ALLOUIS,,,18005,,,,,,,,,,,,,,,,,,,2002-12-31,F,,,,,74.8F,NAF1993,N,2.2219,47.146936,0.95,housenumber,24 Rue Marius Ameline 18500 Allouis,18005_0400_00024,G,24 RUE MARIUS AMELINE,
409789229,00013,40978922900013,O,1996-10-26,NN,,,2008-01-04T21:31:58,true,3,,,,,BABLOU,18500,ALLOUIS,,,18005,,,,,,,,,,,,,,,,,,,2008-01-01,A,,,,,01.11Z,NAFRev2,N,2.183546,47.169966,0.92,street,Chemin de Bablou 18500 Allouis,18005_0140,G,CHEMIN DE BABLOU,
411484256,00028,41148425600028,O,2004-10-19,NN,,2370ZZ,2021-02-23T11:33:45,true,6,LES TERRES BLANCHES,,,RTE,DE VOUZERON,18500,ALLOUIS,,,18005,,,,,,,,,,,,,,,,,,,2014-07-31,A,,,,,23.70Z,NAFRev2,N,2.19481,47.164397,0.33,street,Route de Chancenay 18500 Allouis,18005_0180,G,ROUTE DE CHANCENAY,
418163788,00015,41816378800015,O,1996-01-01,NN,,,2016-01-12T00:19:58,true,3,,,,,LES TAILLES FEUILLEES,18500,ALLOUIS,,,18005,,,,,,,,,,,,,,,,,,,2008-01-01,A,,,,,02.20Z,NAFRev2,N,,,0,,,,,,
418164737,00011,41816473700011,O,1996-01-01,NN,,,,true,1,,,,,LES TAILLES FEUILLEES,18500,ALLOUIS,,,18005,,,,,,,,,,,,,,,,,,,2000-01-25,F,,,,,02.0B,NAF1993,N,,,0,,,,,,
418927265,00011,41892726500011,O,1998-05-01,NN,,,2008-01-04T23:28:36,true,3,,,,,CAYENNE,18500,ALLOUIS,,,18005,,,,,,,,,,,,,,,,,,,2008-01-01,A,,,,,01.11Z,NAFRev2,N,2.21511,47.176172,0.94,street,Cayenne 18500 Allouis,18005_oti23j,G,CAYENNE,
419435086,00014,41943508600014,O,1998-07-01,NN,,,2012-09-28T08:04:33,false,5,,,,,LE MOULIN A VENT,18500,ALLOUIS,,,18005,,,,,,,,,,,,,,,,,,,2012-10-01,A,,,,,35.11Z,NAFRev2,N,2.229515,47.173904,0.94,street,Le Moulin a Vent 18500 Allouis,18005_B083,G,LE MOULIN A VENT,
419435086,00022,41943508600022,O,1999-11-20,,,,,false,3,,,,,LE RHIN DU BOIS,18500,ALLOUIS,,,18005,,,,,,,,,,,,,,,,,,,2000-03-27,F,,,,,01.4A,NAF1993,N,2.249318,47.172022,0.93,street,Le Rhin du Bois d’En Bas 18500 Allouis,18005_B119,G,LE RHIN DU BOIS D EN BAS,
419435086,00030,41943508600030,O,2010-01-01,01,2019,,2021-10-27T08:40:45,true,1,,,,,LE RHIN DU BOIS D'EN HAUT,18500,ALLOUIS,,,18005,,,,,,,,,,,,,,,,,,,2010-01-01,A,,,,,01.11Z,NAFRev2,N,2.248516,47.178093,0.95,street,Le Rhin du Bois d’En Haut 18500 Allouis,18005_B120,G,LE RHIN DU BOIS D EN HAUT,
422208041,00018,42220804100018,O,1999-01-08,NN,,,2021-07-24T03:35:23,true,4,,,,,CHAMPMARTIN,18500,ALLOUIS,,,18005,,,,,,,,,,,,,,,,,,,2020-12-31,F,,,,,02.20Z,NAFRev2,N,2.233697,47.199195,0.92,street,Lieu Dit Champmartin 18500 Allouis,18005_eplrzj,G,LIEU DIT CHAMPMARTIN,
422292573,00017,42229257300017,O,1999-01-04,,,,,true,1,,3,,RUE,DES TERRES BLANCHES,18500,ALLOUIS,,,18005,,,,,,,,,,,,,,,,,,,2000-09-29,F,,,,,72.1Z,NAF1993,N,2.228658,47.164775,0.95,housenumber,3 Rue des Terres Blanches 18500 Allouis,18005_0500_00003,G,3 RUE DES TERRES BLANCHES,
422366583,00017,42236658300017,O,1999-03-04,NN,,,2020-02-14T19:36:19,true,3,,21,,RUE,DU TONKIN,18500,ALLOUIS,,,18005,,,,,,,,,,,,,,,,,,,2008-01-01,A,,,,,68.20B,NAFRev2,N,2.224277,47.148883,0.95,housenumber,21 Rue du Tonkin 18500 Allouis,18005_0600_00021,G,21 RUE DU TONKIN,